{
  "Records": [
      {
          "messageId": "059f36b4-87a3-44ab-83d2-661975830a7d",
          "receiptHandle": "AQEBwJnKyrHigUMZj6rYigCgxlaS3SLy0a",
          "body": "{\"certificateId\":\"ac176001-8627-1a4b-8186-276bc4970000\",\"paymentId\":\"c0a8003b-8679-1571-8186-79f5d4000000\",\"certificateType\":\"HRT_PPC\",\"paymentStatus\":\"STATUS_IGNORED\"}",
          "attributes": {
              "ApproximateReceiveCount": "1",
              "SentTimestamp": "1545082649183",
              "SenderId": "AIDAIENQZJOLO23YVJ4VO",
              "ApproximateFirstReceiveTimestamp": "1545082649185"
          },
          "messageAttributes": {
            "eventName": {
              "dataType": "string",
              "stringValue": "paymentStatusChange"
            },
            "source": {
              "dataType": "string",
              "stringValue": "health-charge-exemption-payment-api"
            },
            "correlationId": {
              "dataType": "string",
              "stringValue": "3ec1ee79-6860-4825-a733-acbd6b35796b"
            }
          },
          "md5OfBody": "098f6bcd4621d373cade4e832627b4f6",
          "eventSource": "aws:sqs",
          "eventSourceARN": "arn:aws:sqs:eu-west-2:123456789012:exemption-local-sqs-internal-payment-status-update",
          "awsRegion": "eu-west-2"
      }
  ]
}