{
  "Records": [
    {
      "messageId": "2e1424d4-f796-459a-8184-9c92662be6da",
      "receiptHandle": "AQEBzWwaftRI0KuVm4tP+/7q1rGgNqicHq...",
      "body": "{\n  \"id\": \"c0a80086-8b6b-11e0-818b-6c4ac3f20006\",\n  \"reference\": \"12345678\",\n  \"to\": \"test@test.com\",\n  \"status\": \"delivered\",\n  \"created_at\": \"2017-05-14T12:15:30.000000Z\",\n  \"completed_at\": \"2017-05-14T12:15:30.000000Z\",\n  \"sent_at\": \"2017-05-14T12:15:30.000000Z\",\n  \"notification_type\": \"email\",\n  \"template_id\": \"fc782469-c730-4e09-9d43-cba1bafd1215\",\n  \"template_version\": 1\n}",
      "attributes": {
        "ApproximateReceiveCount": "1",
        "SentTimestamp": "1545082650636",
        "SenderId": "AIDAIENQZJOLO23YVJ4VO",
        "ApproximateFirstReceiveTimestamp": "1545082650649"
      },
      "messageAttributes": {
      },
      "md5OfBody": "e4e68fb7bd0e697a0ae8f1bb342846b3",
      "eventSource": "aws:sqs",
      "eventSourceARN": "arn:aws:sqs:eu-west-2:123456789012:my-queue",
      "awsRegion": "eu-west-2"
    }
  ]
}
