{
  "Records": [
    {
        "messageId": "059f36b4-87a3-44ab-83d2-661975830a7d",
        "receiptHandle": "AQEBwJnKyrHigUMZj6rYigCgxlaS3SLy0a",
        "body": "{\"amount\":1870,\"reference\":\"HRTAB12CD34\",\"status\":\"SUCCESS\",\"transactionId\":\"68B68A05E2B9C9971C0A\"}",
        "attributes": {
            "ApproximateReceiveCount": "1",
            "SentTimestamp": "1545082649183",
            "SenderId": "AIDAIENQZJOLO23YVJ4VO",
            "ApproximateFirstReceiveTimestamp": "1545082649185"
        },
        "messageAttributes": {},
        "md5OfBody": "098f6bcd4621d373cade4e832627b4f6",
        "eventSource": "aws:sqs",
        "eventSourceARN": "arn:aws:sqs:us-east-2:123456789012:my-queue",
        "awsRegion": "us-east-2"
    },
    {
        "messageId": "059f36b4-87a3-44ab-83d2-661975830a8d",
        "receiptHandle": "AQEBwJnKyrHigUMZj6rYigCgxlaS3SLy0a",
        "body": "{\"amount\":1870,\"reference\":\"HRT1A16B400\",\"status\":\"SUCCESS\",\"transactionId\":\"DB7FD94639FE048DE8FF\"}",
        "attributes": {
            "ApproximateReceiveCount": "1",
            "SentTimestamp": "1545082649183",
            "SenderId": "AIDAIENQZJOLO23YVJ4VO",
            "ApproximateFirstReceiveTimestamp": "1545082649185"
        },
        "messageAttributes": {},
        "md5OfBody": "098f6bcd4621d373cade4e832627b4f6",
        "eventSource": "aws:sqs",
        "eventSourceARN": "arn:aws:sqs:us-east-2:123456789012:my-queue",
        "awsRegion": "us-east-2"
    },
    {
        "messageId": "059f36b4-87a3-44ab-83d2-661975830a9d",
        "receiptHandle": "AQEBwJnKyrHigUMZj6rYigCgxlaS3SLy0a",
        "body": "{\"amount\":1870,\"reference\":\"HRT731224BA\",\"status\":\"SUCCESS\",\"transactionId\":\"E3F3E0DA65FF32C30BA0\"}",
        "attributes": {
            "ApproximateReceiveCount": "1",
            "SentTimestamp": "1545082649183",
            "SenderId": "AIDAIENQZJOLO23YVJ4VO",
            "ApproximateFirstReceiveTimestamp": "1545082649185"
        },
        "messageAttributes": {},
        "md5OfBody": "098f6bcd4621d373cade4e832627b4f6",
        "eventSource": "aws:sqs",
        "eventSourceARN": "arn:aws:sqs:us-east-2:123456789012:my-queue",
        "awsRegion": "us-east-2"
    }
  ]
}