{
  "Records": [
    {
      "messageId": "2e1424d4-f796-459a-8184-9c92662be6da",
      "receiptHandle": "AQEBzWwaftRI0KuVm4tP+/7q1rGgNqicHq...",
      "body": "{\"citizenId\":\"64400001-894a-13d7-8189-4ac406490140\",\"certificate\":{\"id\":\"c0a80865-85ab-1b54-8185-bb3432d90015\",\"type\":\"HRT_PPC\",\"status\":\"ACTIVE\",\"reference\":\"HRTF44F7E97\",\"startDate\":\"2022-12-12\",\"endDate\":\"2023-12-12\"}}",
      "attributes": {
        "ApproximateReceiveCount": "1",
        "SentTimestamp": "1545082650636",
        "SenderId": "AIDAIENQZJOLO23YVJ4VO",
        "ApproximateFirstReceiveTimestamp": "1545082650649"
      },
      "messageAttributes": {
        "eventName": {
          "dataType": "string",
          "stringValue": "certificateStatusChange"
        },
        "source": {
          "dataType": "string",
          "stringValue": "health-charge-exemption-certificate-api"
        },
        "eventType": {
          "dataType": "string",
          "stringValue": "issue-certificate"
        },
        "correlationId": {
          "dataType": "string",
          "stringValue": "a580305a-dae9-46a4-a420-ddee91054d7a"
        }
      },
      "md5OfBody": "e4e68fb7bd0e697a0ae8f1bb342846b3",
      "eventSource": "aws:sqs",
      "eventSourceARN": "arn:aws:sqs:eu-west-2:123456789012:my-queue",
      "awsRegion": "eu-west-2"
    }
  ]
}
