{
    "id": "c0a80196-85cf-1c6d-8185-cf8cf96a0006",
    "certificateId": "c0a80196-85cf-1df8-8185-cf8cf77a0008",
    "method": "CARD",
    "amount": 1870,
    "date": "2023-01-20",
    "status": "PENDING",
    "transactionId": "906944761072A2088F71",
    "_meta": {
        "channel": "ONLINE",
        "createdTimestamp": "2023-01-20T14:20:00.7465054",
        "createdBy": "ONLINE",
        "updatedTimestamp": "2023-01-20T14:20:00.7465054",
        "updatedBy": "ONLINE"
    },
    "_links": {
        "self": {
            "href": "http://localhost:8110/v1/payments/c0a80196-85cf-1c6d-8185-cf8cf96a0006"
        },
        "payment": {
            "href": "http://localhost:8110/v1/payments/c0a80196-85cf-1c6d-8185-cf8cf96a0006"
        }
    }
}