{
  "header": {
      "uri": "https://api.address-lookup.com",
      "query": "postcode=NE158NT",
      "offset": 0,
      "totalresults": 0,
      "format": "JSON",
      "dataset": "DPA",
      "lr": "EN,CY",
      "maxresults": 100,
      "epoch": "96",
      "lastupdate": "2022-11-14",
      "output_srs": "EPSG:27700"
  }
}