{
  "exemptions": {
    "hrt-ppcs": [
      {
        "citizens": [
          {
            "id": "c0a80005-859c-1146-8185-b08e73b00003",
            "firstName": "HRT",
            "lastName": "EMPTY",
            "dateOfBirth": "1997-03-24",
            "addresses": [
              {
                  "id": "c0a80005-8617-1c07-8186-17fe5f1200f8",
                  "addressLine1": "Stella House",
                  "addressLine2": "Goldcrest Way",
                  "townOrCity": "Newcastle upon Tyne",
                  "country": "England",
                  "postcode": "NE15 8NY",
                  "type": "POSTAL"
              }
            ],
            "certificates": []
          }
        ]
      }
    ],
    "others": []
  }
}