{
  "exemptions": {
    "hrt-ppcs": [
      {
        "citizens": [
          {
            "id": "c0a80005-859c-1146-8185-b08e84980012",
            "firstName": "HRT",
            "lastName": "MIXED",
            "dateOfBirth": "1997-03-24",
            "addresses": [
              {
                  "id": "c0a80005-8617-1c07-8186-17fe5f1200f8",
                  "addressLine1": "Stella House",
                  "addressLine2": "Goldcrest Way",
                  "townOrCity": "Newcastle upon Tyne",
                  "country": "England",
                  "postcode": "NE15 8NY",
                  "type": "POSTAL"
              }
            ],
            "certificates": [
              {
                "id": "c0a80005-8687-1c06-8186-87513fbc0000",
                "reference": "HRT7DDB232E",
                "type": "HRT_PPC",
                "status": "ACTIVE",
                "startDate": "2022-03-31",
                "endDate": "2099-03-31"
              }
            ]
          }
        ]
      },
      {
        "citizens": [
          {
            "id": "c0a80005-859c-1146-8185-b08e84980013",
            "firstName": "HRT",
            "lastName": "mixed",
            "dateOfBirth": "1997-03-24",
            "addresses": [
              {
                  "id": "c0a80005-8617-1c07-8186-17fe5f1201f8",
                  "addressLine1": "Stella House",
                  "addressLine2": "Goldcrest Way",
                  "townOrCity": "Newcastle upon Tyne",
                  "country": "England",
                  "postcode": "NE15 8NY",
                  "type": "POSTAL"
              }
            ],
            "certificates": [
              {
                "id": "c0a80005-8687-1c06-8186-87513fbc0001",
                "reference": "HRT7DDB232F",
                "type": "HRT_PPC",
                "status": "ACTIVE",
                "startDate": "2022-01-01",
                "endDate": "2023-01-01"
              }
            ]
          }
        ]
      }
    ],
    "others": [
      {
        "citizens": [
          {
            "firstName": "maternity",
            "lastName": "active",
            "dateOfBirth": "1997-03-24",
            "certificates": [
              {
                "reference": "20000047038",
                "type": "MATERNITY",
                "startDate": "2019-08-18",
                "endDate": "2099-12-31",
                "status": "ACTIVE"
              },
              {
                "reference": "20000047039",
                "type": "MATERNITY",
                "startDate": "2019-08-18",
                "endDate": "2023-01-01",
                "status": "ACTIVE"
              }
            ]
          }
        ]
      }
    ]
  }
}