^C:\USERS\MULTI\DESKTOP\STUDIO_OPENCV_SAMPLE\STUDIO_OPENCV_SAMPLE\X64\DEBUG\SHAPEDETECTINGHOG.OBJ
C:\USERS\MULTI\DESKTOP\STUDIO_OPENCV_SAMPLE\X64\DEBUG\STUDIO_OPENCV_SAMPLE.EXE
C:\USERS\MULTI\DESKTOP\STUDIO_OPENCV_SAMPLE\X64\DEBUG\STUDIO_OPENCV_SAMPLE.ILK
C:\USERS\MULTI\DESKTOP\STUDIO_OPENCV_SAMPLE\X64\DEBUG\STUDIO_OPENCV_SAMPLE.PDB
