{
  "connection": "default",
  "collectionName": "resuals",
  "info": {
    "name": "result",
    "description": ""
  },
  "options": {
    "increments": true,
    "timestamps": [
      "created_at",
      "updated_at"
    ],
    "comment": ""
  },
  "attributes": {
    "IsWin": {
      "type": "boolean"
    },
    "IdUser": {
      "type": "string"
    }
  }
}