{
  "files": {
    "main.css": "/static/css/main.71e0a05a.chunk.css",
    "main.js": "/static/js/main.5b0b310b.chunk.js",
    "main.js.map": "/static/js/main.5b0b310b.chunk.js.map",
    "runtime-main.js": "/static/js/runtime-main.9b89de3f.js",
    "runtime-main.js.map": "/static/js/runtime-main.9b89de3f.js.map",
    "static/js/2.ed39ed38.chunk.js": "/static/js/2.ed39ed38.chunk.js",
    "static/js/2.ed39ed38.chunk.js.map": "/static/js/2.ed39ed38.chunk.js.map",
    "index.html": "/index.html",
    "static/css/main.71e0a05a.chunk.css.map": "/static/css/main.71e0a05a.chunk.css.map",
    "static/js/2.ed39ed38.chunk.js.LICENSE.txt": "/static/js/2.ed39ed38.chunk.js.LICENSE.txt",
    "static/media/App.css": "/static/media/img-8.fabdf94d.jpg"
  },
  "entrypoints": [
    "static/js/runtime-main.9b89de3f.js",
    "static/js/2.ed39ed38.chunk.js",
    "static/css/main.71e0a05a.chunk.css",
    "static/js/main.5b0b310b.chunk.js"
  ]
}