{
  "version": "1.0",
  "defaultProvider": "cdnjs",
  "libraries": [
    {
      "provider": "cdnjs",
      "library": "twitter-bootstrap@4.1.3",
      "destination": "wwwroot/lib/twitter-bootstrap/"
    },
    {
      "provider": "cdnjs",
      "library": "popper.js@1.14.5",
      "destination": "wwwroot/lib/popper.js/"
    },
    {
      "provider": "cdnjs",
      "library": "jquery-validate@1.18.0",
      "destination": "wwwroot/lib/jquery-validate/"
    },
    {
      "library": "toastr.js@2.1.4",
      "destination": "wwwroot/lib/toastr.js/"
    },
    {
      "library": "font-awesome@4.7.0",
      "destination": "wwwroot/lib/font-awesome/"
    }
  ]
}