<svg width="24" height="24" viewBox="0 0 24 24" fill="none" xmlns="http://www.w3.org/2000/svg">
<path d="M23.888 5.832C23.8196 5.80296 23.7405 5.8184 23.688 5.871L13.941 15.616C12.8672 16.6892 11.1268 16.6892 10.053 15.616L0.310002 5.871C0.257819 5.81788 0.178318 5.80238 0.110002 5.832C0.042964 5.86087 -0.000337523 5.92701 1.98205e-06 6V18C1.98205e-06 19.1046 0.895432 20 2 20H22C23.1046 20 24 19.1046 24 18V6C24.0003 5.92644 23.956 5.86004 23.888 5.832Z" fill="#C3996B"/>
<path d="M11.1151 14.556C11.6038 15.0432 12.3945 15.0432 12.8831 14.556L22.5691 4.87C22.7029 4.73626 22.7497 4.53851 22.6901 4.359C22.5801 4.03 22.2741 4 22.0001 4H2.00014C1.72514 4 1.41714 4.03 1.30914 4.359C1.24958 4.53851 1.29641 4.73626 1.43014 4.87L11.1151 14.556Z" fill="#C3996B"/>
</svg>
