<?xml version="1.0" encoding="UTF-8"?>
<svg width="119px" height="87px" viewBox="0 0 119 87" version="1.1" xmlns="http://www.w3.org/2000/svg" xmlns:xlink="http://www.w3.org/1999/xlink">
    <!-- Generator: Sketch 51 (57462) - http://www.bohemiancoding.com/sketch -->
    <title>Logo</title>
    <desc>Created with Sketch.</desc>
    <defs>
        <filter x="-13.1%" y="-1.5%" width="123.8%" height="104.9%" filterUnits="objectBoundingBox" id="filter-1">
            <feOffset dx="1" dy="1" in="SourceAlpha" result="shadowOffsetOuter1"></feOffset>
            <feGaussianBlur stdDeviation="3.5" in="shadowOffsetOuter1" result="shadowBlurOuter1"></feGaussianBlur>
            <feColorMatrix values="0 0 0 0 0.768627764   0 0 0 0 0.696402996   0 0 0 0 0.61600311  0 0 0 0.45629529 0" type="matrix" in="shadowBlurOuter1" result="shadowMatrixOuter1"></feColorMatrix>
            <feMerge>
                <feMergeNode in="shadowMatrixOuter1"></feMergeNode>
                <feMergeNode in="SourceGraphic"></feMergeNode>
            </feMerge>
        </filter>
    </defs>
    <g id="Symbols" stroke="none" stroke-width="1" fill="none" fill-rule="evenodd">
        <g id="Nav-home" transform="translate(-21.000000, -26.000000)" fill="#FFFFFF">
            <g id="Nav/bg-Copy" filter="url(#filter-1)">
                <g id="Sticky">
                    <g id="Logo" transform="translate(27.000000, 31.000000)">
                        <path d="M25.2717368,70.0419549 L25.2717368,71.7838314 L23.1601524,71.7838314 L23.1601524,70.0419549 L22.622296,70.0419549 L22.622296,73.9783991 L23.1601524,73.9783991 L23.1601524,72.2069992 L25.2816971,72.2069992 L25.2816971,73.9783991 L25.8195535,73.9783991 L25.8195535,70.0419549 L25.2717368,70.0419549 Z M33.5786303,70.0419549 L33.5786303,70.4848048 L34.8535492,70.4848048 L34.8535492,73.9390347 L35.3914056,73.9390347 L35.3914056,70.4848048 L36.6663245,70.4848048 L36.6663245,70.0419549 L33.5786303,70.0419549 Z M38.7679486,70.0419549 L38.7679486,73.9783991 L41.1982628,73.9783991 L41.1982628,73.5453902 L39.305805,73.5453902 L39.305805,72.2168403 L40.8396918,72.2168403 L40.8396918,71.8035137 L39.305805,71.8035137 L39.305805,70.5044871 L41.1982628,70.5044871 L41.1982628,70.0714782 L38.7679486,70.0419549 Z M43.5090533,70.0419549 L43.5090533,73.9783991 L45.7501216,73.9783991 L45.7501216,73.5355491 L44.0767906,73.5355491 L44.0767906,70.0813193 L43.5090533,70.0419549 Z M65.5412455,70.0419549 L65.5412455,72.4136625 C65.5437245,72.5673457 65.5201584,72.7203555 65.4715234,72.8663536 C65.4277586,72.9976509 65.3564889,73.1183655 65.262357,73.2206336 C65.1712537,73.3193622 65.058947,73.3966999 64.933667,73.4469791 C64.6520396,73.5566447 64.3387876,73.5566447 64.0571602,73.4469791 C63.9332112,73.394306 63.8213859,73.3172999 63.7284702,73.2206336 C63.6343383,73.1183655 63.5630686,72.9976509 63.5193038,72.8663536 C63.4710291,72.7202707 63.4474722,72.5673208 63.4495817,72.4136625 L63.4495817,70.0419549 L62.9117253,70.0419549 L62.9117253,72.4136625 C62.9097365,72.6283981 62.9468482,72.8417371 63.0212886,73.0434936 C63.0881358,73.2300144 63.193255,73.4008828 63.330058,73.5453902 C63.4696214,73.6911923 63.6395327,73.8053493 63.8280732,73.879988 C64.24793,74.040004 64.7130163,74.040004 65.1328731,73.879988 C65.3214136,73.8053493 65.4913249,73.6911923 65.6308883,73.5453902 C65.7840246,73.4080408 65.9061951,73.2403901 65.9894592,73.0533347 C66.0626799,72.8512596 66.099754,72.6381372 66.0990225,72.4235036 L66.0990225,70.051796 L65.5412455,70.0419549 Z M68.6289397,73.9783991 L69.1667961,73.9783991 L69.1667961,70.0419549 L68.6289397,70.0419549 L68.6289397,73.9783991 Z M71.358063,70.0419549 L71.358063,70.4848048 L72.6429422,70.4848048 L72.6429422,73.9390347 L73.1708383,73.9390347 L73.1708383,70.4848048 L74.4457572,70.4848048 L74.4457572,70.0419549 L71.358063,70.0419549 Z M76.5573416,70.0419549 L76.5573416,73.9783991 L78.9876558,73.9783991 L78.9876558,73.5453902 L77.0951981,73.5453902 L77.0951981,72.2168403 L78.6290849,72.2168403 L78.6290849,71.8035137 L77.0951981,71.8035137 L77.0951981,70.5044871 L78.9876558,70.5044871 L78.9876558,70.0714782 L76.5573416,70.0419549 Z M29.0068508,73.1123814 C28.8807846,72.9726786 28.7857765,72.8084041 28.7279623,72.630167 C28.6592645,72.4238339 28.6256086,72.2076883 28.6283592,71.9904948 C28.624499,71.7700061 28.6581689,71.5504441 28.7279623,71.3409815 C28.7865735,71.163092 28.8814924,70.9989717 29.0068508,70.858767 C29.1281267,70.7261076 29.2778545,70.6218799 29.4451041,70.5536926 C29.8166772,70.4108968 30.2289264,70.4108968 30.6004994,70.5536926 C30.7679128,70.6215851 30.9177027,70.725856 31.0387528,70.858767 C31.1641111,70.9989717 31.2590301,71.163092 31.3176413,71.3409815 C31.3856799,71.550854 31.4193056,71.7701281 31.4172443,71.9904948 C31.4187558,72.2076007 31.3851305,72.4235495 31.3176413,72.630167 C31.2595573,72.8082866 31.1645795,72.9725086 31.0387528,73.1123814 C30.9186491,73.2463418 30.7685944,73.350797 30.6004994,73.4174558 C30.2278991,73.5547357 29.8177044,73.5547357 29.4451041,73.4174558 C29.2773553,73.350169 29.1274365,73.2458084 29.0068508,73.1123814 Z M28.6283592,70.5143282 C28.4546894,70.6961612 28.3192696,70.91024 28.2299471,71.1441592 C28.0477984,71.6637161 28.0477984,72.2287034 28.2299471,72.7482603 C28.3197402,72.981949 28.4551054,73.1959414 28.6283592,73.3780914 C28.8031683,73.5564526 29.013416,73.6971741 29.2458981,73.791418 C29.4988502,73.8927507 29.769798,73.9429455 30.0427224,73.9390347 C30.3157636,73.9443144 30.5869875,73.8940685 30.8395467,73.791418 C31.0731668,73.6992824 31.2838359,73.5582789 31.4570855,73.3780914 C31.6303394,73.1959414 31.7657045,72.981949 31.8554977,72.7482603 C32.0407982,72.229232 32.0407982,71.6631875 31.8554977,71.1441592 C31.7661752,70.91024 31.6307553,70.6961612 31.4570855,70.5143282 C31.2836324,70.334378 31.0730192,70.1934119 30.8395467,70.1010015 C30.5869875,69.9983511 30.3157636,69.9481051 30.0427224,69.9533849 C29.7698441,69.9500023 29.499001,70.0001777 29.2458981,70.1010015 C29.0135518,70.1954952 28.8033528,70.3361841 28.6283592,70.5143282 Z M51.2282888,73.4961847 C51.1405166,73.4655843 51.0594047,73.4188352 50.9892415,73.3584091 C50.8336337,73.2209576 50.7463574,73.0233428 50.7501942,72.8171481 C50.7518463,72.648592 50.8038195,72.484268 50.8995988,72.3447747 C51.0130486,72.1870486 51.1634019,72.0587519 51.3378521,71.9708125 L52.5032077,73.1320636 C52.3784475,73.2537908 52.2336114,73.35363 52.0749146,73.4272969 C51.8991072,73.5028331 51.7088009,73.5397673 51.5171376,73.5355491 C51.424799,73.5506019 51.3305877,73.5506019 51.2382491,73.5355491 L51.2282888,73.4961847 Z M51.4075743,70.0616371 C51.2817674,70.1073106 51.1665843,70.1776017 51.0689239,70.2683004 C50.9785521,70.3545668 50.9073223,70.4584571 50.8597576,70.5733748 C50.8121316,70.692365 50.7884489,70.8193899 50.7900354,70.947337 C50.7887192,71.0889589 50.8158009,71.2294365 50.8697179,71.3606637 C50.9308558,71.5071963 51.0148796,71.6433463 51.1187255,71.7641492 C50.9952759,71.8163482 50.8783053,71.8823887 50.7701148,71.9609714 C50.6697174,72.03449 50.5793299,72.1204882 50.5011866,72.2168403 C50.4260626,72.3125211 50.3656492,72.4186373 50.3219011,72.5317558 C50.2106683,72.7929361 50.2106683,73.0873877 50.3219011,73.348568 C50.3879402,73.4796175 50.4793002,73.5966298 50.5908293,73.6930069 C50.7027024,73.7871978 50.8309429,73.8605538 50.9693209,73.9095113 C51.1072381,73.9557536 51.2519733,73.9790331 51.397614,73.9783991 C51.6543378,73.9814358 51.908843,73.9311438 52.1446368,73.8307824 C52.3663368,73.7364272 52.5688337,73.6030447 52.742255,73.437138 L53.1406671,73.8307824 C53.1716263,73.8638518 53.2088502,73.8905997 53.2502305,73.9095113 L53.3797144,73.9095113 L53.857809,73.9095113 L53.0311038,73.082858 C53.1504406,72.9098448 53.2443385,72.720983 53.3099923,72.5219147 C53.374503,72.3213629 53.4080804,72.1123563 53.4095954,71.9019248 L53.1107862,71.9019248 C53.0851668,71.8920436 53.0567232,71.8920436 53.0311038,71.9019248 C53.0227281,71.9275153 53.0227281,71.9550631 53.0311038,71.9806536 C53.0175559,72.1173415 52.9908748,72.2524456 52.9514214,72.3841392 C52.909544,72.5178761 52.8527537,72.6466006 52.7820962,72.7679425 L51.6466216,71.6263737 L51.4673361,71.4295515 C51.4221341,71.3742128 51.3821276,71.3149212 51.3478124,71.2524115 C51.3188417,71.1957257 51.2954921,71.1364024 51.2780903,71.0752715 C51.2697305,71.0132181 51.2697305,70.9503437 51.2780903,70.8882904 C51.263062,70.8135724 51.263062,70.7366628 51.2780903,70.6619448 C51.3036617,70.5917553 51.3444554,70.5279382 51.397614,70.4749637 C51.4521394,70.4235814 51.5164713,70.3834369 51.5868597,70.3568704 C51.6691043,70.3411965 51.7536228,70.3411965 51.8358673,70.3568704 C51.9081911,70.3425551 51.9826703,70.3425551 52.054994,70.3568704 C52.1126773,70.3818412 52.1663644,70.4149941 52.2143589,70.4552815 C52.2579588,70.4952528 52.2949309,70.541745 52.3239222,70.593057 C52.3497961,70.6397008 52.3698626,70.6892666 52.383684,70.7406737 C52.3767549,70.763126 52.3767549,70.7871092 52.383684,70.8095615 L52.4534062,70.8095615 L52.7621756,70.7505148 C52.753563,70.6407368 52.7230997,70.5337189 52.6725329,70.4355993 C52.6212934,70.3342264 52.5501974,70.2439111 52.4633665,70.1698893 C52.3728725,70.0894434 52.2682199,70.0260691 52.1545971,69.9829082 C52.0273328,69.9354905 51.8921839,69.9121225 51.7561849,69.9140204 C51.6063775,69.9126623 51.4576675,69.9393769 51.3179315,69.9927493 L51.4075743,70.0616371 Z M58.9873655,69.9927493 C58.8465887,70.0458823 58.7179248,70.1261713 58.608874,70.228936 C58.2993334,70.5409723 58.2055645,71.0042063 58.3698267,71.4098692 C58.4188211,71.5211346 58.4899521,71.6215343 58.5789931,71.7051026 C58.6678034,71.7854464 58.7685826,71.8518285 58.8778022,71.9019248 L59.2264128,72.0298592 L59.5750235,72.1381114 C59.679047,72.1698714 59.7792451,72.212771 59.8738326,72.2660459 C59.9566163,72.3124262 60.0280332,72.3762683 60.082999,72.453027 C60.139825,72.5372639 60.1677581,72.63731 60.1626814,72.7384192 C60.1640904,72.8398962 60.1437226,72.9405168 60.1029196,73.0336525 C60.067974,73.1201272 60.0134606,73.1975525 59.9435547,73.259998 C59.8716092,73.3254663 59.7868697,73.3757016 59.6945471,73.4076147 C59.5850453,73.44177 59.4707148,73.4583821 59.3558968,73.4568202 C59.2238828,73.4602179 59.0923206,73.4402197 58.9674449,73.3977736 C58.8737004,73.3601266 58.7836753,73.3140056 58.6985167,73.259998 L58.5192313,73.1222225 C58.4839409,73.0888258 58.4383648,73.0680424 58.3897473,73.0631758 L58.3200252,73.0631758 L58.2702237,73.1123814 L58.1208191,73.3584091 C58.2720297,73.5184394 58.4551661,73.645771 58.6586755,73.7323713 C58.8786843,73.8262491 59.1162676,73.8731971 59.3558968,73.8701469 C59.5463556,73.871397 59.7354241,73.8380388 59.9136738,73.7717358 C60.0699101,73.7121073 60.2122393,73.621705 60.3320066,73.5060258 C60.4464354,73.3951089 60.5348368,73.2607341 60.5909745,73.1123814 C60.6515632,72.9587222 60.6819859,72.7950699 60.6806172,72.630167 C60.6853673,72.4914418 60.6581192,72.3534664 60.6009348,72.2266814 C60.5527817,72.1178039 60.4814391,72.0204621 60.3917684,71.9412892 C60.3006018,71.8666834 60.2001913,71.8038511 60.0929593,71.7543081 L59.7443486,71.6165326 L59.395738,71.4984392 C59.2919748,71.4659877 59.1918491,71.4231191 59.0969289,71.3705048 C59.0122438,71.3228937 58.9378037,71.2593738 58.8778022,71.1835237 C58.8217406,71.1026227 58.7937781,71.0059251 58.7981198,70.9079726 C58.7825502,70.8299952 58.7825502,70.7497634 58.7981198,70.6717859 C58.8291651,70.5995438 58.8769252,70.5355022 58.937564,70.4848048 C59.0045754,70.4275597 59.0824515,70.3840695 59.166651,70.3568704 C59.2722055,70.339966 59.3798263,70.339966 59.4853807,70.3568704 C59.5909352,70.339966 59.698556,70.339966 59.8041105,70.3568704 L60.0331975,70.4552815 L60.1925623,70.5536926 C60.2283655,70.5638108 60.2663224,70.5638108 60.3021257,70.5536926 L60.3718478,70.5536926 L60.4216493,70.4946459 L60.5511333,70.2486182 C60.414127,70.1186249 60.2513383,70.0180994 60.0730387,69.9533849 C59.8792523,69.8797021 59.6730892,69.84297 59.4654601,69.8451326 C59.2886932,69.8419483 59.1129258,69.8720056 58.9475243,69.9337026 L58.9873655,69.9927493 Z M81.5374936,69.9337026 C81.3970669,69.9875244 81.2685319,70.0677329 81.159002,70.1698893 C80.8446004,70.4793678 80.7502097,70.9456735 80.9199548,71.3508226 C80.9721264,71.462811 81.0466596,71.563231 81.1390814,71.6460559 C81.2277933,71.7265238 81.3285929,71.7929194 81.4378906,71.8428781 L81.7865012,71.9708125 L82.1351118,72.0790648 C82.2395265,72.1097715 82.3398438,72.1527221 82.4339209,72.2069992 C82.5175235,72.252251 82.5891764,72.3163041 82.6430873,72.3939803 C82.701271,72.4775986 82.7293332,72.5781067 82.7227698,72.6793725 C82.7259368,72.780059 82.7090147,72.8803768 82.6729682,72.9746058 C82.6371317,73.0606036 82.5827468,73.1378463 82.5136034,73.2009514 C82.4425739,73.2676197 82.3575589,73.3180183 82.2645958,73.348568 C82.0282138,73.4238319 81.7738756,73.4238319 81.5374936,73.348568 C81.443442,73.3115818 81.3533543,73.2654286 81.2685654,73.2107925 L81.0793196,73.0730169 C81.0444915,73.0389559 80.998665,73.0180583 80.9498357,73.0139703 L80.8801135,73.0139703 L80.8203517,73.0631758 L80.6709472,73.3092036 C80.8223468,73.4690192 81.0054349,73.5963171 81.2088036,73.6831658 C81.4289013,73.7767615 81.6664233,73.8236975 81.9060248,73.8209413 C82.0964453,73.8217497 82.2854334,73.7884057 82.4638019,73.7225302 C82.6199127,73.662658 82.762195,73.5722855 82.8821346,73.4568202 C82.9949043,73.3445713 83.0830592,73.2105712 83.1411025,73.0631758 C83.2016913,72.9095167 83.2321139,72.7458643 83.2307453,72.5809614 C83.2332294,72.4424236 83.2060762,72.3049289 83.1510628,72.1774759 C83.0984571,72.0685916 83.02389,71.9714748 82.9319361,71.8920837 C82.8418466,71.8160244 82.7412285,71.7530622 82.633127,71.7051026 L82.2845164,71.567327 L81.9359058,71.4492337 C81.8289351,71.4168336 81.7255005,71.3739768 81.6271363,71.3212992 C81.5423006,71.2738992 81.4678216,71.2103462 81.4080096,71.1343181 C81.3512725,71.0537324 81.3232434,70.9568046 81.3283272,70.858767 C81.3127576,70.7807896 81.3127576,70.7005578 81.3283272,70.6225804 C81.3590415,70.5501523 81.4068548,70.4860393 81.4677715,70.4355993 C81.5344645,70.3779092 81.6124372,70.334365 81.6968585,70.3076648 C81.9045579,70.2446414 82.1266185,70.2446414 82.3343179,70.3076648 L82.5634049,70.4060759 L82.7227698,70.5044871 C82.758573,70.5146052 82.7965299,70.5146052 82.8323331,70.5044871 L82.9020552,70.5044871 C82.9228296,70.4886433 82.9398302,70.4684867 82.9518568,70.4454404 L83.0813407,70.1994126 C82.9441577,70.0696437 82.7814191,69.9691492 82.6032461,69.9041793 C82.4094598,69.8304965 82.2032966,69.7937644 81.9956676,69.7959271 C81.8189006,69.7927428 81.6431332,69.8228 81.4777318,69.8844971 L81.5374936,69.9337026 Z M44.3755997,62.8677852 L57.0749872,62.8677852 L57.0749872,62.3658885 L44.5648455,62.3658885 L44.3755997,62.8677852 Z M52.6625726,53.4793656 C52.6625726,53.4793656 52.6625726,53.5876179 52.6625726,53.5876179 C53.2900717,53.5876179 53.399635,53.6958701 53.399635,54.2371312 L53.399635,58.5967432 C53.399635,59.1380043 53.2900717,59.2462565 52.6625726,59.2462565 C52.6625726,59.2462565 52.6625726,59.3643498 52.6625726,59.3643498 L57.0251857,59.3643498 C57.134749,59.3643498 57.1646299,59.3643498 57.1646299,59.2265743 C57.1712476,58.7887068 57.2045087,58.3516288 57.264233,57.9177065 C57.264233,57.9177065 57.1546696,57.9177065 57.1447093,57.9177065 C57.0558901,58.7253234 56.3420311,59.3224625 55.5211798,59.2757798 L55.0331249,59.2757798 C54.6147921,59.2757798 54.4853082,59.1380043 54.4853082,58.7246776 L54.4853082,56.628521 L55.4016561,56.628521 C56.1287583,56.628521 56.4873293,56.9139133 56.4873293,57.425651 C56.4873293,57.425651 56.5968926,57.425651 56.5968926,57.425651 C56.5968926,57.0910532 56.5968926,56.8155021 56.5968926,56.5005866 C56.5968926,56.1856711 56.5968926,56.08726 56.5968926,55.6837744 C56.5968926,55.6837744 56.477369,55.6837744 56.477369,55.6837744 C56.477369,56.1364655 56.1287583,56.3824933 55.4215767,56.3824933 L54.4853082,56.3824933 L54.4853082,54.4733178 C54.4853082,54.0796734 54.644673,53.9320567 55.1227676,53.9320567 L55.5112195,53.9320567 C56.1769041,53.8791774 56.7679041,54.3506449 56.8558605,55.0047378 C56.8558605,55.0047378 56.9654238,55.0047378 56.9654238,55.0047378 L56.9654238,53.7844401 C56.9654238,53.7253934 56.9654238,53.6958701 56.8757811,53.6958701 L52.6625726,53.4793656 Z M46.0688514,58.4983321 L46.0688514,54.2666545 C46.0688514,53.7352345 46.3577002,53.6565056 47.1146833,53.6565056 C48.4792449,53.6565056 49.3358311,54.9161678 49.3358311,56.539951 C49.3358311,58.1637343 48.3398007,59.2167331 47.0549215,59.2167331 C46.2381765,59.2167331 46.0588911,58.9903876 46.0588911,58.4983321 L46.0688514,58.4983321 Z M44.3955203,53.4695245 C44.3955203,53.4695245 44.3955203,53.597459 44.3955203,53.597459 C45.0230195,53.597459 45.1325828,53.7057112 45.1325828,54.2469723 L45.1325828,58.6065843 C45.1325828,59.1478454 45.0230195,59.2560976 44.3955203,59.2560976 C44.3955203,59.2560976 44.3955203,59.3741909 44.3955203,59.3741909 L45.5907568,59.3741909 C46.088772,59.3741909 46.7561123,59.4332376 47.1644848,59.4332376 C48.0090232,59.4686113 48.8309107,59.1581159 49.4361198,58.5750518 C50.041329,57.9919877 50.3762232,57.1880288 50.3617424,56.3529699 C50.3617424,54.7291867 49.0370219,53.4892067 47.0150802,53.4892067 L44.4054806,53.4892067 L44.3955203,53.4695245 Z M12.6022302,53.0266745 C12.6022302,53.0266745 12.6022302,53.0266745 12.6022302,53.1250857 C12.6022302,53.2234968 12.6022302,53.2234968 12.6022302,53.2234968 C12.8971318,53.213039 13.1920833,53.2428435 13.478737,53.3120668 C13.6449909,53.3521953 13.7840524,53.4642827 13.8572285,53.6171412 C13.9343096,53.8418561 13.9680935,54.0788514 13.9568316,54.31586 L13.9568316,61.6474875 C13.9677155,61.8877026 13.9339571,62.1278551 13.8572285,62.3560474 C13.7936939,62.5141046 13.6561574,62.6316316 13.4886973,62.670963 C13.2012208,62.7346548 12.9065788,62.7611199 12.6121905,62.7496919 C12.6121905,62.7496919 12.6121905,62.7496919 12.6121905,62.848103 C12.6121905,62.9465141 12.6121905,62.9465141 12.6121905,62.9465141 L19.4648796,62.9465141 C19.5366092,62.9540239 19.6083853,62.9327487 19.6640857,62.8874674 C19.6853368,62.8269087 19.6853368,62.761045 19.6640857,62.7004863 C19.6672022,61.9891303 19.7204526,61.2788523 19.8234506,60.5748064 C19.8234506,60.5748064 19.7935697,60.5748064 19.7338078,60.5748064 C19.7338078,60.5748064 19.6640857,60.5748064 19.6640857,60.5748064 C19.6585152,61.1701107 19.463361,61.7485673 19.1063087,62.228113 C18.7230725,62.5881809 18.2106542,62.7829064 17.6819852,62.7693741 L16.5166297,62.7693741 C16.1912449,62.8048269 15.8629541,62.7358137 15.5803611,62.5725519 C15.3979913,62.348408 15.3153391,62.0608118 15.3512741,61.7754219 L15.3512741,58.1243699 L17.18397,58.1243699 C17.61553,58.0859928 18.0474881,58.1935575 18.4090874,58.4294443 C18.6817826,58.6830628 18.8244465,59.0444902 18.7975393,59.4135554 C18.7975393,59.4135554 18.7975393,59.4135554 18.8971423,59.4135554 C18.9967453,59.4135554 18.9967453,59.4135554 18.9967453,59.4135554 C18.9967453,59.2364154 18.9967453,58.9707054 18.9967453,58.6361076 L18.9967453,57.9177065 C18.9967453,57.7110432 18.9967453,57.5437443 18.9967453,57.425651 L18.9967453,56.6186799 C18.9967453,56.6186799 18.9967453,56.6186799 18.8971423,56.6186799 C18.7975393,56.6186799 18.7975393,56.6186799 18.7975393,56.6186799 C18.8369477,56.9519378 18.7017937,57.2820699 18.4389683,57.4945388 C18.0855039,57.7043644 17.6748466,57.8006424 17.2636525,57.7700899 L15.3313535,57.7700899 L15.3313535,54.5422056 C15.318642,54.3316853 15.3491336,54.1207985 15.4209962,53.9222156 C15.493171,53.7783543 15.6233353,53.6711821 15.7795672,53.6269823 C16.0324746,53.558621 16.2944522,53.5287546 16.5564709,53.5384123 L17.4628585,53.5384123 C17.944014,53.51467 18.4156069,53.6770463 18.7776187,53.9911034 C19.1411893,54.3513121 19.357521,54.8313577 19.3851972,55.3393355 C19.3851972,55.3393355 19.3851972,55.3393355 19.4748399,55.3393355 C19.5644827,55.3393355 19.5644827,55.3393355 19.5644827,55.3393355 L19.5644827,53.3711134 C19.5680561,53.331806 19.5530682,53.2930693 19.5238672,53.2661411 C19.4946662,53.239213 19.4545209,53.227108 19.4150781,53.2333379 L12.6022302,53.0266745 Z M26.7359015,53.0266745 C26.7359015,53.0266745 26.7359015,53.0266745 26.7359015,53.1250857 C26.7359015,53.2234968 26.7359015,53.2136556 26.7359015,53.2136556 C27.0307736,53.2040594 27.3256069,53.2338519 27.6124082,53.3022256 C27.7786621,53.3423542 27.9177236,53.4544416 27.9908998,53.6073001 C28.0699008,53.83156 28.1037372,54.0689235 28.0905028,54.3060189 L28.0905028,61.6376464 C28.1045979,61.8772577 28.0742171,62.1173957 28.0008601,62.3462063 C27.9314017,62.5019009 27.7906877,62.6153202 27.6223685,62.6512808 C27.335018,62.715762 27.0402703,62.7422366 26.7458618,62.7300096 C26.7458618,62.7300096 26.7458618,62.7300096 26.7458618,62.8284207 C26.7458618,62.9268319 26.7458618,62.9268319 26.7458618,62.9268319 L34.2658912,62.9268319 C34.3377267,62.9355163 34.4099629,62.9141048 34.4650973,62.8677852 C34.4841136,62.8102332 34.4841136,62.7481972 34.4650973,62.6906452 C34.4720332,61.9342887 34.5185769,61.1787934 34.6045416,60.4271898 L34.5248591,60.4271898 C34.5248591,60.4271898 34.4650973,60.4271898 34.4650973,60.4271898 C34.3725861,61.0312889 34.0863006,61.590109 33.6483524,62.0214497 C33.2148228,62.4140992 32.6424501,62.6226358 32.0547038,62.6020752 L30.720023,62.6020752 C30.4486347,62.6153715 30.1767507,62.5888401 29.9132384,62.5233463 C29.7639615,62.4868748 29.6394406,62.3855554 29.5745881,62.2477952 C29.5041518,62.0420633 29.4737363,61.8250244 29.4849454,61.608123 L29.4849454,54.3552245 C29.4693092,54.1148131 29.5031934,53.8737661 29.5845484,53.6466645 C29.6541049,53.4891192 29.7940753,53.3726599 29.9630399,53.331749 C30.246337,53.2626812 30.5379787,53.2328724 30.8295864,53.243179 C30.8295864,53.243179 30.8295864,53.243179 30.8295864,53.1447679 C30.8295864,53.0463568 30.8295864,53.0463568 30.8295864,53.0463568 L26.7359015,53.0266745 Z M76.537421,53.0266745 C76.3282547,53.0266745 76.1688898,53.154609 76.0493661,53.420319 L72.832188,61.2440019 L69.2066374,53.9615801 C69.0909212,53.7269622 68.9542556,53.5030097 68.7982649,53.2923845 C68.7147529,53.1938292 68.5895882,53.1392703 68.4596146,53.1447679 L66.4675538,53.1447679 C66.4675538,53.1447679 66.4675538,53.1447679 66.4675538,53.243179 C66.4675538,53.3415901 66.4675538,53.3415901 66.4675538,53.3415901 C67.0217636,53.3246142 67.5426232,53.6025876 67.8321154,54.0698323 L67.7125918,61.2735253 C67.7396055,61.6999739 67.620295,62.1229648 67.3739414,62.4741408 C67.1197851,62.7472584 66.752107,62.8889369 66.377911,62.8579441 C66.377911,62.8579441 66.377911,62.8579441 66.377911,62.9563552 C66.377911,63.0547663 66.377911,63.0547663 66.377911,63.0547663 L67.0253308,63.0547663 L67.9018375,63.0547663 L69.4755656,63.0547663 C69.4755656,63.0547663 69.4755656,63.0547663 69.4755656,62.9563552 C69.4755656,62.8579441 69.4755656,62.8579441 69.4755656,62.8579441 C69.0768117,62.9027283 68.6786544,62.7691913 68.3898924,62.493823 C68.1473784,62.1382035 68.0381685,61.7100722 68.081123,61.2833664 L68.1906864,54.75871 L72.2544904,62.936673 C72.2818051,62.9801816 72.3327431,63.0034101 72.3839743,62.9957196 C72.4374263,63.0015517 72.4889631,62.9741332 72.5134583,62.9268319 L76.1190883,54.6898222 L76.4477783,61.7360575 C76.4771436,61.9705378 76.4567913,62.2084903 76.3880165,62.4347763 C76.3284782,62.5881246 76.1993115,62.7048067 76.0394058,62.7496919 C75.7764778,62.8189334 75.5045199,62.8487893 75.2326212,62.8382619 C75.2326212,62.8382619 75.2326212,62.8382619 75.2326212,62.936673 C75.2326212,63.0350841 75.2326212,63.0350841 75.2326212,63.0350841 L75.9597234,63.0350841 L77.0453965,63.0350841 L79.0374573,63.0350841 C79.0374573,63.0350841 79.0374573,63.0350841 79.0374573,62.936673 C79.0374573,62.8382619 79.0374573,62.8382619 79.0374573,62.8382619 C78.7463566,62.8499641 78.4549701,62.8234906 78.1709109,62.759533 C78.0063427,62.7207674 77.8698256,62.607757 77.8023796,62.4544585 C77.7229727,62.2261592 77.6793083,61.9872197 77.6728957,61.7458986 L77.3143247,54.4437945 C77.2677307,54.1157933 77.3912562,53.7866355 77.6430148,53.5679356 C77.9945423,53.372865 78.3962419,53.2839063 78.79841,53.3120668 C78.79841,53.3120668 78.79841,53.3120668 78.79841,53.2136556 C78.79841,53.1152445 78.79841,53.1152445 78.79841,53.1152445 L76.8063492,53.1152445 L76.537421,53.0266745 Z M90.890219,53.1152445 L84.3064581,53.1152445 C84.3064581,53.1152445 84.3064581,53.1152445 84.3064581,53.2136556 C84.3064581,53.3120668 84.3064581,53.3120668 84.3064581,53.3120668 C84.6013975,53.3004437 84.8965129,53.3302647 85.1829648,53.4006368 C85.3461384,53.442114 85.4815922,53.5542443 85.5514961,53.7057112 C85.6304971,53.9299711 85.6643335,54.1673347 85.6510991,54.40443 L85.6510991,61.7360575 C85.6651942,61.9756688 85.6348134,62.2158068 85.5614564,62.4446174 C85.4945543,62.6041013 85.3534111,62.7215364 85.1829648,62.759533 C84.895506,62.8233356 84.6008492,62.849802 84.3064581,62.8382619 C84.3064581,62.8382619 84.3064581,62.8382619 84.3064581,62.936673 C84.3064581,63.0350841 84.3064581,63.0350841 84.3064581,63.0350841 L91.1591472,63.0350841 C91.2295748,63.0465044 91.3016506,63.0287011 91.3583533,62.9858785 C91.3788568,62.9251976 91.3788568,62.8595783 91.3583533,62.7988974 C91.3608827,62.0875189 91.4141362,61.3772003 91.5177181,60.6732175 C91.5177181,60.6732175 91.4878372,60.6732175 91.4280754,60.6732175 C91.4280754,60.6732175 91.3583533,60.6732175 91.3583533,60.6732175 C91.2625697,61.2401546 90.9951752,61.7651128 90.5914099,62.1789074 C90.2081736,62.5389753 89.6957553,62.7337008 89.1670864,62.7201685 L88.0017308,62.7201685 C87.676275,62.7570569 87.3475286,62.6879479 87.0654623,62.5233463 C86.8830924,62.2992025 86.8004402,62.0116062 86.8363753,61.7262164 L86.8363753,58.0554821 L88.6491506,58.0554821 C89.0805848,58.0186652 89.5120309,58.1261024 89.874268,58.3605565 C90.1469632,58.614175 90.2896271,58.9756024 90.2627198,59.3446676 C90.2627198,59.3446676 90.2627198,59.3446676 90.3623229,59.3446676 C90.4619259,59.3446676 90.4619259,59.3446676 90.4619259,59.3446676 C90.4619259,59.1675276 90.4619259,58.9116587 90.4619259,58.5672198 L90.4619259,57.8488188 C90.4619259,57.6323143 90.4619259,57.4748566 90.4619259,57.3567632 L90.4619259,56.5301099 C90.4619259,56.5301099 90.4619259,56.5301099 90.3623229,56.5301099 C90.2627198,56.5301099 90.2627198,56.5301099 90.2627198,56.5301099 C90.3021282,56.8633678 90.1669743,57.1934999 89.9041489,57.4059688 C89.5506844,57.6157944 89.1400272,57.7120724 88.728833,57.6815199 L86.8662562,57.6815199 L86.8662562,54.4634767 C86.8555924,54.2522255 86.8895116,54.0410919 86.9658592,53.8434867 C87.0370193,53.6988374 87.1675967,53.5913251 87.3244302,53.5482534 C87.5771237,53.4788051 87.8392729,53.4489191 88.1013339,53.4596834 L88.8981582,53.4596834 C89.3793137,53.4359411 89.8509066,53.5983174 90.2129183,53.9123745 C90.5736037,54.2665434 90.7898566,54.7394087 90.8204968,55.2409244 C90.8204968,55.2409244 90.8204968,55.2409244 90.9101396,55.2409244 C90.9997823,55.2409244 90.9997823,55.2409244 90.9997823,55.2409244 L90.9997823,53.2727023 C91.0060876,53.2337315 90.993836,53.1940667 90.9665817,53.1652151 C90.9393275,53.1363636 90.9001215,53.121555 90.8603381,53.1250857 L90.890219,53.1152445 Z M3.3590682,53.0758801 C2.8446633,53.0735492 2.33442223,53.1670312 1.85506231,53.3514312 C1.40219137,53.5249003 1.00605147,53.8175989 0.709627362,54.1977667 C0.407559798,54.5871334 0.246248868,55.065275 0.251453382,55.55584 C0.242555951,55.9700431 0.34939226,56.378654 0.560222804,56.7367733 C0.757129824,57.0573199 1.01403654,57.3378715 1.3172059,57.5634266 C1.61601502,57.779931 2.02438748,58.0554821 2.54232328,58.3703976 C2.97687897,58.6139168 3.39599053,58.8834079 3.79732157,59.1773687 C4.10997313,59.4210438 4.3763896,59.7175922 4.58418558,60.0532275 C4.79679935,60.4142141 4.90369947,60.8264762 4.892955,61.2440019 C4.94517219,61.7509416 4.74898366,62.2520017 4.3650589,62.5922341 C3.98330718,62.8736905 3.51645587,63.019353 3.04033848,63.0055607 C2.33393812,63.0457226 1.64895589,62.7582708 1.18772195,62.228113 C0.715984535,61.6506563 0.376209683,60.9792387 0.191691559,60.2598909 C0.156277145,60.2336479 0.107582326,60.2336479 0.0721679119,60.2598909 C0.0124060884,60.2598909 -0.00751451938,60.2598909 0.00244578453,60.3386198 L0.191691559,62.5528697 C0.183775273,62.6149513 0.183775273,62.6777691 0.191691559,62.7398508 C0.216175069,62.7861371 0.254407946,62.8239124 0.301254902,62.848103 C0.665745298,63.0173502 1.05069582,63.1397217 1.44668985,63.2122241 C1.84741761,63.3107361 2.25886215,63.3603118 2.67180723,63.3598407 C3.29268003,63.3725048 3.9085876,63.2481077 4.47462224,62.9957196 C4.94966162,62.7834985 5.35383056,62.4421888 5.6399778,62.0116086 C5.90923616,61.5947558 6.04784182,61.108594 6.03838995,60.6141709 C6.05021204,60.1757109 5.92878644,59.7438098 5.68977932,59.3741909 C5.47334741,59.0386563 5.19652941,58.7451383 4.8730344,58.5081732 C4.55430467,58.2719865 4.1160513,57.9964354 3.55827428,57.6716788 C3.00049726,57.3469221 2.63196602,57.1107355 2.3431172,56.894231 C2.05038017,56.682908 1.80036819,56.4191973 1.60605471,56.1167833 C1.37974959,55.8031478 1.25475276,55.4292142 1.24748377,55.0441022 C1.23135801,54.5911506 1.38773859,54.1486924 1.68573715,53.8041223 C2.02191695,53.4581664 2.49640717,53.277854 2.98057665,53.3120668 C3.43079918,53.2961075 3.87320229,53.4314031 4.23557495,53.6958701 C4.55762855,53.9400786 4.81978204,54.2529165 5.00251835,54.6110934 C5.16694138,54.9204628 5.28440265,55.2520503 5.35112898,55.5952044 C5.35112898,55.5952044 5.35112898,55.6640922 5.46069233,55.6640922 C5.57025567,55.6640922 5.55033506,55.6640922 5.55033506,55.5952044 L5.45073202,53.6761878 C5.45073202,53.5580945 5.37104959,53.4596834 5.20172443,53.3907956 C4.59284268,53.1537049 3.94379956,53.0334656 3.28934607,53.0365157 L3.3590682,53.0758801 Z M98.9082636,57.5339032 L98.9082636,54.3552245 C98.8961477,54.1117293 98.9299217,53.8681291 99.0078667,53.6368234 C99.0589679,53.492131 99.1718868,53.3769644 99.3166361,53.3219079 C99.5265985,53.2606957 99.745337,53.2340962 99.9640558,53.243179 C100.484384,53.2152341 100.991937,53.4086617 101.358498,53.774599 C101.744417,54.2823352 101.925474,54.9137109 101.866474,55.5459989 C101.926425,56.1051314 101.765887,56.6655749 101.41826,57.1107355 C100.985915,57.4528116 100.435778,57.6151717 99.8843734,57.5634266 C99.5656437,57.5634266 99.2568743,57.5634266 98.9680254,57.5634266 L98.9082636,57.5339032 Z M100.342547,53.0463568 L96.3584258,53.0463568 C96.3584258,53.0463568 96.3584258,53.0463568 96.3584258,53.154609 C96.3584258,53.2628612 96.3584258,53.2530201 96.3584258,53.2530201 C96.6528981,53.2379107 96.9480454,53.2644212 97.2349326,53.331749 C97.4011865,53.3718776 97.5402479,53.4839649 97.6134241,53.6368234 C97.6914444,53.8613168 97.7252537,54.0984902 97.7130271,54.3355423 L97.7130271,61.6671697 C97.7270546,61.9075198 97.6932143,62.1482539 97.6134241,62.3757297 C97.5402479,62.5285882 97.4011865,62.6406755 97.2349326,62.6808041 C96.9477664,62.7470458 96.6532184,62.7768095 96.3584258,62.7693741 C96.3584258,62.7693741 96.3584258,62.7693741 96.3584258,62.8579441 C96.3584258,62.9465141 96.3584258,62.9563552 96.3584258,62.9563552 L97.185131,62.9563552 L98.3006851,62.9563552 L100.292746,62.9563552 C100.292746,62.9563552 100.292746,62.9563552 100.292746,62.8579441 C100.292746,62.759533 100.292746,62.759533 100.292746,62.759533 C99.9983751,62.7703024 99.7038186,62.743845 99.4162391,62.6808041 C99.2499916,62.6469182 99.1096905,62.5374797 99.0377476,62.3855708 C98.961019,62.1573784 98.9272605,61.917226 98.9381445,61.6770108 L98.9381445,57.9472299 L99.7050879,57.9472299 C99.965987,57.9452128 100.22611,57.9188527 100.481992,57.868501 C101.478022,60.1516387 102.862504,62.6020752 103.778852,62.936673 L106,62.936673 C106,62.936673 106,62.936673 106,62.8382619 C106,62.7398508 106,62.7398508 106,62.7398508 C105.499914,62.68422 105.019434,62.515876 104.595597,62.2477952 C103.778852,61.8443097 102.304727,59.3741909 101.487982,57.4846977 C101.969313,57.233657 102.380015,56.8684484 102.683219,56.4218577 C102.974656,56.0016547 103.130879,55.5042938 103.131432,54.9948967 C103.153204,54.4115626 102.876122,53.856632 102.39437,53.5187301 C101.777794,53.1402219 101.05701,52.9613222 100.332587,53.0069923 L100.342547,53.0463568 Z" id="Shape" fill-rule="nonzero"></path>
                        <path d="M43.61,36.39 L43.61,28.89 L53.07,35 L53.07,42.41 L43.61,36.39 Z M40.07,26.09 L43.25,24.09 L63,36.6 L53.83,42.46 L53.83,34.63 L42.89,27.53 L42.89,36.39 L40.09,38.16 L40.07,26.09 Z M43.62,23.43 L43.62,12.35 L63.25,24.9 L63.25,35.9 L43.62,23.43 Z M40.06,10.08 L42.87,11.87 L42.87,23.44 L40.06,25.22 L40.06,10.08 Z M64,36.36 L64,24.49 L43.91,11.65 L53.08,5.83 L53.08,13.66 L64.02,20.66 L64.02,11.86 L66.84,10.08 L66.84,38.17 L64,36.36 Z M53.82,13.25 L53.82,5.83 L63.3,11.83 L63.3,19.28 L53.82,13.25 Z M40.38,9.4 L53.45,1.1 L66.51,9.4 L63.68,11.2 L53.73,4.9 L53.45,4.72 L43.21,11.22 L40.38,9.4 Z M39.32,9.2 L39.32,39.51 L43.23,37 L53.46,43.53 L63.67,37 L66.98,39.1 L67.56,39.47 L67.56,9.2 L53.44,0.2 L39.32,9.2 Z" id="Combined-Shape"></path>
                    </g>
                </g>
            </g>
        </g>
    </g>
</svg>