<?xml version="1.0" encoding="UTF-8"?>
<svg width="14px" height="14px" viewBox="0 0 14 14" version="1.1" xmlns="http://www.w3.org/2000/svg" xmlns:xlink="http://www.w3.org/1999/xlink">
    <!-- Generator: Sketch 52.3 (67297) - http://www.bohemiancoding.com/sketch -->
    <title>instagram-connect-icon</title>
    <desc>Created with Sketch.</desc>
    <g id="Page-1" stroke="none" stroke-width="1" fill="none" fill-rule="evenodd">
        <g id="instagram-connect-icon" fill="#C3996B" fill-rule="nonzero">
            <path d="M11.3932656,0 L2.60678906,0 C1.16941016,0 0,1.16938281 0,2.60676172 L0,11.3932383 C0,12.8306172 1.16941016,14 2.60678906,14 L11.3932656,14 C12.8306172,14 14,12.8306172 14,11.3932383 L14,2.60676172 C14,1.16938281 12.8306172,0 11.3932656,0 Z M6.99999998,10 C5.34577198,10 4,8.65417411 4,6.99999998 C4,5.34582585 5.34577198,4 6.99999998,4 C8.65422797,4 10,5.34579891 10,6.99999998 C10,8.65420104 8.65422797,10 6.99999998,10 Z M11.7898437,2.79011718 C11.713582,2.86640625 11.6080351,2.91015625 11.5000001,2.91015625 C11.3919922,2.91015625 11.2861719,2.86640625 11.2098828,2.79011718 C11.1335937,2.71382812 11.0898438,2.60800781 11.0898438,2.5 C11.0898438,2.39201953 11.1335937,2.28641796 11.2098828,2.21015625 C11.2861719,2.1335664 11.3919922,2.08984375 11.5000001,2.08984375 C11.6077345,2.08984375 11.713582,2.13359375 11.7898437,2.21015625 C11.8664336,2.28641797 11.9101562,2.39199218 11.9101562,2.5 C11.9101562,2.60800781 11.8664336,2.71382812 11.7898437,2.79011718 Z" id="Shape"></path>
            <circle id="Oval" cx="7" cy="7" r="2"></circle>
        </g>
    </g>
</svg>