{
	"info": {
		"_postman_id": "53ec7947-a714-458b-a04a-36b93c11c0eb",
		"name": "Posts API",
		"schema": "https://schema.getpostman.com/json/collection/v2.1.0/collection.json",
		"_exporter_id": "31050171"
	},
	"item": [
		{
			"name": "Toggle URL",
			"event": [
				{
					"listen": "test",
					"script": {
						"exec": [
							""
						],
						"type": "text/javascript"
					}
				},
				{
					"listen": "prerequest",
					"script": {
						"exec": [
							"const BASE_URL = \"baseUrl\";\r",
							"const LOCALHOST = \"http://localhost:5000\";\r",
							"const REMOTE = \"https://ikioio8wba.execute-api.ap-southeast-1.amazonaws.com\";\r",
							"\r",
							"const current = pm.environment.get(BASE_URL);\r",
							"\r",
							"if (current === LOCALHOST) {\r",
							"    pm.environment.set(BASE_URL, REMOTE);\r",
							"} else {\r",
							"    pm.environment.set(BASE_URL, LOCALHOST);\r",
							"}\r",
							"\r",
							"console.info(pm.environment.get(BASE_URL));"
						],
						"type": "text/javascript"
					}
				}
			],
			"request": {
				"method": "GET",
				"header": [],
				"url": {
					"raw": "localhost",
					"host": [
						"localhost"
					]
				}
			},
			"response": []
		},
		{
			"name": "Create",
			"request": {
				"method": "POST",
				"header": [],
				"body": {
					"mode": "raw",
					"raw": "{\r\n    \"name\": \"nguoi dung\",\r\n    \"content\": \"cung duoc\"\r\n}",
					"options": {
						"raw": {
							"language": "json"
						}
					}
				},
				"url": {
					"raw": "{{baseUrl}}/api/posts",
					"host": [
						"{{baseUrl}}"
					],
					"path": [
						"api",
						"posts"
					]
				}
			},
			"response": []
		},
		{
			"name": "Get All",
			"request": {
				"method": "GET",
				"header": [],
				"url": {
					"raw": "{{baseUrl}}/api/posts",
					"host": [
						"{{baseUrl}}"
					],
					"path": [
						"api",
						"posts"
					]
				}
			},
			"response": []
		},
		{
			"name": "Get",
			"request": {
				"method": "GET",
				"header": [],
				"url": {
					"raw": "{{baseUrl}}/api/posts/:id",
					"host": [
						"{{baseUrl}}"
					],
					"path": [
						"api",
						"posts",
						":id"
					],
					"variable": [
						{
							"key": "id",
							"value": "4192da76-7347-4ca8-83e5-362c3fe027c6"
						}
					]
				}
			},
			"response": []
		},
		{
			"name": "Delete",
			"request": {
				"method": "DELETE",
				"header": [],
				"url": {
					"raw": "{{baseUrl}}/api/posts/:id",
					"host": [
						"{{baseUrl}}"
					],
					"path": [
						"api",
						"posts",
						":id"
					],
					"variable": [
						{
							"key": "id",
							"value": "4192da76-7347-4ca8-83e5-362c3fe027c6"
						}
					]
				}
			},
			"response": []
		},
		{
			"name": "Update",
			"request": {
				"method": "PUT",
				"header": [],
				"body": {
					"mode": "raw",
					"raw": "{\r\n    \"name\": \"nguyen\",\r\n    \"content\": \"this is cool\"\r\n}",
					"options": {
						"raw": {
							"language": "json"
						}
					}
				},
				"url": {
					"raw": "{{baseUrl}}/api/posts/:id",
					"host": [
						"{{baseUrl}}"
					],
					"path": [
						"api",
						"posts",
						":id"
					],
					"variable": [
						{
							"key": "id",
							"value": "b05fa322-829a-44c9-8dac-dc24f7f42c03"
						}
					]
				}
			},
			"response": []
		}
	]
}