{
  "required": [
      "scan_execution_policy"
  ],
  "type": "object",
  "properties": {
      "scan_execution_policy": {
          "type": "array",
          "additionalItems": false,
          "items": {
              "maxItems": 5,
              "required": [
                  "name",
                  "enabled",
                  "rules",
                  "actions"
              ],
              "type": "object",
              "properties": {
                  "name": {
                      "minLength": 1,
                      "type": "string"
                  },
                  "description": {
                      "type": "string"
                  },
                  "enabled": {
                      "type": "boolean"
                  },
                  "rules": {
                      "type": "array",
                      "additionalItems": false,
                      "items": {
                          "type": "object",
                          "required": [],
                          "properties": {
                              "type": {
                                  "enum": [
                                      "pipeline"
                                  ],
                                  "type": "string"
                              },
                              "branches": {
                                  "type": "array",
                                  "additionalItems": false,
                                  "items": {
                                      "minLength": 1,
                                      "type": "string"
                                  }
                              }
                          },
                          "additionalProperties": false
                      }
                  },
                  "actions": {
                      "type": "array",
                      "additionalItems": false,
                      "items": {
                          "required": [
                              "scan",
                              "site_profile"
                          ],
                          "type": "object",
                          "properties": {
                              "scan": {
                                  "enum": [
                                      "dast"
                                  ],
                                  "type": "string"
                              },
                              "scanner_profile": {
                                  "type": "string"
                              },
                              "site_profile": {
                                  "type": [
                                      "string",
                                      "null"
                                  ]
                              }
                          },
                          "additionalProperties": false
                      }
                  }
              },
              "additionalProperties": false
          }
      }
  },
  "additionalProperties": false
}
