<svg width="17" height="17" viewBox="0 0 17 17" fill="none" xmlns="http://www.w3.org/2000/svg">
<path d="M14.8286 2.35294C14.4572 1.92436 14.0162 1.58439 13.5309 1.35244C13.0456 1.12049 12.5254 1.0011 12.0001 1.0011C11.4748 1.0011 10.9546 1.12049 10.4693 1.35244C9.98401 1.58439 9.54304 1.92436 9.1716 2.35294C8.8916 2.676 8.6806 3.04291 8.5006 3.42481C8.32309 3.03129 8.0967 2.6698 7.8286 2.35179C7.07844 1.48625 6.061 1 5.0001 1C3.93921 1 2.92177 1.48625 2.1716 2.35179C1.42144 3.21732 1 4.39124 1 5.61529C1 6.83934 1.42144 8.01326 2.1716 8.87879L8.5006 16L14.8286 8.87879C15.2003 8.45048 15.4951 7.94185 15.6963 7.38197C15.8974 6.82209 16.001 6.22195 16.001 5.61587C16.001 5.00978 15.8974 4.40964 15.6963 3.84976C15.4951 3.28989 15.2003 2.78125 14.8286 2.35294Z" stroke="white" stroke-miterlimit="10" stroke-linecap="round" stroke-linejoin="round"/>
</svg>
