<svg width="16" height="16" viewBox="0 0 16 16" fill="none" xmlns="http://www.w3.org/2000/svg">
<path d="M15 7H1C0.4 7 0 7.4 0 8C0 8.6 0.4 9 1 9H15C15.6 9 16 8.6 16 8C16 7.4 15.6 7 15 7Z" fill="white"/>
<path d="M15 1H1C0.4 1 0 1.4 0 2C0 2.6 0.4 3 1 3H15C15.6 3 16 2.6 16 2C16 1.4 15.6 1 15 1Z" fill="white"/>
<path d="M15 13H1C0.4 13 0 13.4 0 14C0 14.6 0.4 15 1 15H15C15.6 15 16 14.6 16 14C16 13.4 15.6 13 15 13Z" fill="white"/>
</svg>
