com\restservice\model\Backlog.class
com\restservice\model\Task.class
com\restservice\repository\BacklogRepository.class
com\restservice\EmployeeModelAssembler.class
com\restservice\EmployeeRepository.class
com\restservice\services\errorhandler\ContentNotFoundExceptionAdvice.class
com\restservice\services\assampler\BacklogModelAssempler.class
com\restservice\services\assampler\ProjectModelAssempler.class
com\restservice\services\assampler\UserModelAssempler.class
com\restservice\services\errorhandler\ContentNotFoundException.class
com\restservice\EmployeeNotFoundException.class
com\restservice\repository\UserRepository.class
com\restservice\controllers\BacklogController.class
com\restservice\EmployeeController.class
com\restservice\controllers\UserController.class
com\restservice\Employee.class
com\restservice\GreetingController.class
com\restservice\controllers\TaskController.class
com\restservice\repository\ProjectRepository.class
com\restservice\repository\TaskRepository.class
com\restservice\Main.class
com\restservice\model\User.class
com\restservice\controllers\ProjectController.class
com\restservice\Greeting.class
com\restservice\LoadDatabase.class
com\restservice\services\assampler\TaskModelAssempler.class
com\restservice\model\Project.class
