{
  "companies":
    [
      { 
        "companyID":"21a301f1-c641-4b5b-8442-ede6a273c653",
        "name":"Hudson, Feest and Hammes",
        "lat":"47.2301",
        "lng":"98.1218",
        "address":"Suriname",
        "photos":["https://via.placeholder.com/400","https://via.placeholder.com/400","https://via.placeholder.com/400","https://via.placeholder.com/400"],
        "banner":"https://via.placeholder.com/728x400",
        "logo":"https://via.placeholder.com/200",
        "intro":"De-engineered uniform local area network",
        "createdAt":1636704690224,
        "updatedAt":1636704690224
      },
      {
        "companyID":"1938daa8-9488-4386-8a21-eaf21868eb18",
        "name":"O'Connell - Wolf",
        "lat":"69.5576",
        "lng":"-141.1402",
        "address":"Togo",
        "photos":["https://via.placeholder.com/400","https://via.placeholder.com/400","https://via.placeholder.com/400","https://via.placeholder.com/400"],
        "banner":"https://via.placeholder.com/728x400",
        "logo":"https://via.placeholder.com/200",
        "intro":"Cloned attitude-oriented algorithm",
        "createdAt":1636704690224,
        "updatedAt":1636704690224
      },
      {
        "companyID":"81354451-3ad4-477d-8380-4844a4d5d22e",
        "name":"Marks - Schulist",
        "lat":"84.0040",
        "lng":"146.6363",
        "address":"Niger",
        "photos":["https://via.placeholder.com/400","https://via.placeholder.com/400","https://via.placeholder.com/400","https://via.placeholder.com/400"],
        "banner":"https://via.placeholder.com/728x400",
        "logo":"https://via.placeholder.com/200",
        "intro":"Operative bi-directional throughput",
        "createdAt":1636704690225,
        "updatedAt":1636704690225
      },
      {
        "companyID":"b1876727-5ed1-4b67-9aa9-b68c9dcaedc5",
        "name":"Roob, McKenzie and Armstrong",
        "lat":"56.7557",
        "lng":"127.4040",
        "address":"Burundi",
        "photos":["https://via.placeholder.com/400","https://via.placeholder.com/400","https://via.placeholder.com/400","https://via.placeholder.com/400"],
        "banner":"https://via.placeholder.com/728x400",
        "logo":"https://via.placeholder.com/200",
        "intro":"Synchronised explicit ability",
        "createdAt":1636704690225,
        "updatedAt":1636704690225
      },
      {
        "companyID":"f882d4b7-4428-4a77-a64a-a64289587ffa",
        "name":"Halvorson - Conroy",
        "lat":"48.5969",
        "lng":"115.4724",
        "address":"Lithuania",
        "photos":["https://via.placeholder.com/400","https://via.placeholder.com/400","https://via.placeholder.com/400","https://via.placeholder.com/400"],
        "banner":"https://via.placeholder.com/728x400",
        "logo":"https://via.placeholder.com/200",
        "intro":"Ameliorated transitional structure",
        "createdAt":1636704690225,
        "updatedAt":1636704690225
      }
    ]
}