{
  "project_info": {
    "project_number": "117794470811",
    "project_id": "foodfever-20f50",
    "storage_bucket": "foodfever-20f50.appspot.com"
  },
  "client": [
    {
      "client_info": {
        "mobilesdk_app_id": "1:117794470811:android:da43380c002d84441bff3e",
        "android_client_info": {
          "package_name": "com.unimob.foodfever"
        }
      },
      "oauth_client": [
        {
          "client_id": "117794470811-9v8v320ipu6hupjgptbiveole439765g.apps.googleusercontent.com",
          "client_type": 1,
          "android_info": {
            "package_name": "com.unimob.foodfever",
            "certificate_hash": "8835ca034f88795edaf05bd4dc2fc054a5e33b6a"
          }
        },
        {
          "client_id": "117794470811-peienmo9ii0l966guujp2ivrig79e109.apps.googleusercontent.com",
          "client_type": 1,
          "android_info": {
            "package_name": "com.unimob.foodfever",
            "certificate_hash": "5b62de29ec263760d2ed486efc3e25367f2b44d3"
          }
        },
        {
          "client_id": "117794470811-s5muq0m4vfvk1sqbi5u9smcelqpjfhua.apps.googleusercontent.com",
          "client_type": 1,
          "android_info": {
            "package_name": "com.unimob.foodfever",
            "certificate_hash": "5f59bf0f3e86d3ac9eb6c743eaaf48cf4f7eb694"
          }
        },
        {
          "client_id": "117794470811-r8dliij0nevjfqp6j23mi39j449m0npk.apps.googleusercontent.com",
          "client_type": 3
        }
      ],
      "api_key": [
        {
          "current_key": "AIzaSyB55IK0pcD93MJ0OWMOREkMlm-AZ3owe6E"
        }
      ],
      "services": {
        "appinvite_service": {
          "other_platform_oauth_client": [
            {
              "client_id": "117794470811-r8dliij0nevjfqp6j23mi39j449m0npk.apps.googleusercontent.com",
              "client_type": 3
            }
          ]
        }
      }
    }
  ],
  "configuration_version": "1"
}