id,name,model_id:id,group_id:id,perm_read,perm_write,perm_create,perm_unlink
access_bms_sms_config_user,bms_sms_config_user,model_bms_sms_config,client_sms_brand_name.client_sms_brand_name_groups_user,1,0,0,0
access_bms_sms_config_manager,bms_sms_config_manager,model_bms_sms_config,client_sms_brand_name.client_sms_brand_name_groups_manager,1,1,0,0
