id,name,model_id:id,group_id:id,perm_read,perm_write,perm_create,perm_unlink
,,,,,,,
access_brandname_send_sms_user,brandname_send_sms_user,model_at_send_sms,client_sms_brand_name_groups_user,1,1,1,0
access_brandname_send_sms_manager,brandname_send_sms_manager,model_at_send_sms,client_sms_brand_name_groups_manager,1,1,1,0
,,,,,,,
access_brandname_send_sms_log_user,brandname_send_sms_log_user,model_at_send_sms_log,client_sms_brand_name_groups_user,1,0,0,0
access_brandname_send_sms_log_manager,brandname_send_sms_log_manager,model_at_send_sms_log,client_sms_brand_name_groups_manager,1,0,0,0
,,,,,,,
access_brandname_brand_user,brandname_brand_user,model_at_brand_name,client_sms_brand_name_groups_user,1,0,0,0
access_brandname_brand_manager,brandname_brand_manager,model_at_brand_name,client_sms_brand_name_groups_manager,1,1,1,1
