{
  "extends": ["gitlab>vito-templates/renovate-bot//containers-renovate"],
  "packageRules": [
    {
      "matchPackageNames": ["debian"],
      "matchUpdateTypes": ["patch", "digest"],
      "automerge": true,
      "platformAutomerge": true
    },
    {
      "matchPackageNames": ["debian"],
      "matchUpdateTypes": ["major", "minor"],
      "enabled": false
    },
    {
      "matchDatasources": ["repology"],
      "groupName": "packages"
    },
    {
      "matchDatasources": ["docker"],
      "groupName": "containers",
      "extends": ["schedule:daily"]
    }
  ],
  "assignees": ["vitoyucepi"]
}
