{
  "extends": ["gitlab>vito-templates/renovate-bot//containers-renovate"],
  "packageRules": [
    {
      "matchPackageNames": [
        "registry.gitlab.com/vito-containers/liquidsoap/alpine-opam",
        "registry.gitlab.com/vito-foss/liquidsoap/liqme"
      ],
      "matchUpdateTypes": ["patch", "digest"],
      "automerge": true
    }
  ],
  "assignees": ["vitoyucepi"]
}
