{
  "project_info": {
    "project_number": "131982394714",
    "firebase_url": "https://loyloy7.firebaseio.com",
    "project_id": "loyloy7",
    "storage_bucket": "loyloy7.appspot.com"
  },
  "client": [
    {
      "client_info": {
        "mobilesdk_app_id": "1:131982394714:android:6fd73252b33aa520181f63",
        "android_client_info": {
          "package_name": "com.loyloy7"
        }
      },
      "oauth_client": [
        {
          "client_id": "131982394714-tnpps40m1tsl2llmkcg7ppe83cn66hrp.apps.googleusercontent.com",
          "client_type": 1,
          "android_info": {
            "package_name": "com.loyloy7",
            "certificate_hash": "50313cab760ba253d44a6d60d4a3359447970422"
          }
        },
        {
          "client_id": "131982394714-sctpreu9mrgjk6cgnhm36fhe4nc9emj3.apps.googleusercontent.com",
          "client_type": 1,
          "android_info": {
            "package_name": "com.loyloy7",
            "certificate_hash": "5e8f16062ea3cd2c4a0d547876baa6f38cabf625"
          }
        }
      ],
      "api_key": [
        {
          "current_key": "AIzaSyAtbWN6Z6WLxXATnqbHe4PN0By992di9os"
        }
      ],
      "services": {
        "appinvite_service": {
          "other_platform_oauth_client": [
            {
              "client_id": "131982394714-ri9vo1fglua796ikigm7t1rlp4jp9lsk.apps.googleusercontent.com",
              "client_type": 3
            }
          ]
        }
      }
    }
  ],
  "configuration_version": "1"
}