{
  "retry_join": ["consul"],
  "data_dir": "/var/lib/consul",
  "ui": false,
  "services": [{
    "name": "mavproxy",
    "tags": ["public"],
    "address": "",
    "port": 14550,
    "checks": [{
      "name": "MAVProxy Check",
      "tcp": "localhost:14550",
      "interval": "10s",
      "timeout": "1s"
    }]
  }]
}
