<svg width="44" height="44" viewBox="0 0 44 44" fill="none" xmlns="http://www.w3.org/2000/svg">
<path d="M33.8422 34.7828V41.1708C33.8422 41.6559 33.6495 42.1212 33.3066 42.4642C32.9637 42.8073 32.4986 42.9999 32.0137 42.9999H2.81437C2.33188 42.9962 1.8704 42.8019 1.53053 42.4592C1.19067 42.1166 0.999986 41.6535 1 41.1708V8.3165C0.999986 7.8338 1.19067 7.37069 1.53053 7.02806C1.8704 6.68543 2.33188 6.49108 2.81437 6.48737H8.28574" stroke="#005463" stroke-width="2" stroke-linecap="round" stroke-linejoin="round"/>
<path d="M26.5422 6.48737H32.0136C32.4985 6.48737 32.9636 6.68009 33.3065 7.02312C33.6494 7.36615 33.8421 7.83138 33.8421 8.3165V14.7045" stroke="#005463" stroke-width="2" stroke-linecap="round" stroke-linejoin="round"/>
<path d="M17.414 6.48743C17.9576 6.49021 18.4899 6.33131 18.943 6.0309C19.3962 5.73048 19.7499 5.30209 19.9593 4.80017C20.1686 4.29825 20.2241 3.74542 20.1187 3.21189C20.0133 2.67835 19.7518 2.18821 19.3674 1.80365C18.983 1.41908 18.493 1.15745 17.9597 1.05204C17.4263 0.946618 16.8737 1.00215 16.372 1.21156C15.8702 1.42096 15.442 1.77484 15.1417 2.22819C14.8414 2.68154 14.6826 3.21393 14.6853 3.75777C14.6853 4.48172 14.9729 5.17603 15.4846 5.68794C15.9963 6.19985 16.6903 6.48743 17.414 6.48743V6.48743Z" stroke="#005463" stroke-width="2" stroke-linecap="round" stroke-linejoin="round"/>
<path d="M20.0019 4.6723H24.7137C25.1963 4.67229 25.6592 4.86308 26.0017 5.20308C26.3442 5.54307 26.5385 6.00471 26.5422 6.48739V8.31652C26.5422 8.80164 26.3496 9.26691 26.0067 9.60994C25.6638 9.95297 25.1987 10.1457 24.7137 10.1457H10.1141C9.62916 10.1457 9.16411 9.95297 8.8212 9.60994C8.4783 9.26691 8.28564 8.80164 8.28564 8.31652V6.48739C8.28936 6.00471 8.48363 5.54307 8.82614 5.20308C9.16864 4.86308 9.63158 4.67229 10.1141 4.6723H14.84" stroke="#005463" stroke-width="2" stroke-linecap="round" stroke-linejoin="round"/>
<path d="M6.47144 17.4483H28.3287" stroke="#005463" stroke-width="2" stroke-linecap="round" stroke-linejoin="round"/>
<path d="M6.47144 24.7507H23.7434" stroke="#005463" stroke-width="2" stroke-linecap="round" stroke-linejoin="round"/>
<path d="M6.47144 32.0533H21.0289" stroke="#005463" stroke-width="2" stroke-linecap="round" stroke-linejoin="round"/>
<path d="M31.1417 32.0393L24.7561 33.8684L26.5846 27.4804L37.4991 16.5619C38.1034 15.9573 38.9231 15.6177 39.7777 15.6177C40.6323 15.6177 41.452 15.9573 42.0563 16.5619C42.6606 17.1664 43.0001 17.9863 43.0001 18.8412C43.0001 19.6962 42.6606 20.5161 42.0563 21.1206L31.1417 32.0393Z" stroke="#005463" stroke-width="2" stroke-linecap="round" stroke-linejoin="round"/>
</svg>
