<svg width="244" height="58" viewBox="0 0 244 58" fill="none" xmlns="http://www.w3.org/2000/svg">
<path d="M0.24 57H-0.76V58H0.24V57ZM0.24 0.999996V-3.8147e-06H-0.76V0.999996H0.24ZM38 3.4L37.5211 4.27792L37.5278 4.28148L38 3.4ZM44.88 9.96L44.0138 10.4597L44.0174 10.4659L44.0211 10.4721L44.88 9.96ZM44.88 28.6L44.0255 28.0806L44.0217 28.0868L44.0181 28.093L44.88 28.6ZM38 35.08L37.5278 34.1985L37.5211 34.2021L38 35.08ZM14 37.48V36.48H13V37.48H14ZM14 57V58H15V57H14ZM14 26.52H13V27.52H14V26.52ZM31.36 24.52L30.6529 23.8129L31.36 24.52ZM31.36 14.36L30.6529 15.0671L30.6598 15.074L30.6669 15.0808L31.36 14.36ZM14 12.36V11.36H13V12.36H14ZM1.24 57V0.999996H-0.76V57H1.24ZM0.24 2H27.6V-3.8147e-06H0.24V2ZM27.6 2C31.4656 2 34.7611 2.77241 37.5211 4.27789L38.4789 2.5221C35.3722 0.827585 31.7344 -3.8147e-06 27.6 -3.8147e-06V2ZM37.5278 4.28148C40.3601 5.7988 42.5125 7.85743 44.0138 10.4597L45.7462 9.46028C44.0475 6.5159 41.6132 4.2012 38.4722 2.51852L37.5278 4.28148ZM44.0211 10.4721C45.5724 13.0744 46.36 16.0672 46.36 19.48H48.36C48.36 15.7462 47.4942 12.3923 45.7389 9.44794L44.0211 10.4721ZM46.36 19.48C46.36 22.6674 45.5783 25.526 44.0255 28.0806L45.7345 29.1194C47.4884 26.234 48.36 23.0126 48.36 19.48H46.36ZM44.0181 28.093C42.518 30.6431 40.365 32.6786 37.5278 34.1985L38.4722 35.9615C41.6083 34.2814 44.042 31.9969 45.7419 29.107L44.0181 28.093ZM37.5211 34.2021C34.7611 35.7076 31.4656 36.48 27.6 36.48V38.48C31.7344 38.48 35.3722 37.6524 38.4789 35.9579L37.5211 34.2021ZM27.6 36.48H14V38.48H27.6V36.48ZM13 37.48V57H15V37.48H13ZM14 56H0.24V58H14V56ZM14 27.52H25.12V25.52H14V27.52ZM25.12 27.52C28.0811 27.52 30.4705 26.8237 32.0671 25.2271L30.6529 23.8129C29.5828 24.8829 27.8123 25.52 25.12 25.52V27.52ZM32.0671 25.2271C33.6482 23.646 34.44 21.682 34.44 19.4H32.44C32.44 21.1714 31.8451 22.6207 30.6529 23.8129L32.0671 25.2271ZM34.44 19.4C34.44 17.1176 33.6473 15.172 32.0531 13.6392L30.6669 15.0808C31.846 16.2146 32.44 17.6291 32.44 19.4H34.44ZM32.0671 13.6529C30.4736 12.0594 28.1142 11.36 25.2 11.36V13.36C27.8325 13.36 29.5798 13.994 30.6529 15.0671L32.0671 13.6529ZM25.2 11.36H14V13.36H25.2V11.36ZM13 12.36V26.52H15V12.36H13ZM67.5969 54.76L67.1101 55.6336L67.1198 55.6389L67.5969 54.76ZM58.9569 46.04L58.0752 46.5119L58.078 46.5171L58.9569 46.04ZM55.9169 0.999996V-3.8147e-06H54.9169V0.999996H55.9169ZM69.6769 0.999996H70.6769V-3.8147e-06H69.6769V0.999996ZM71.0369 39.4L71.9411 38.973L71.0369 39.4ZM74.8769 43.88L75.419 43.0397L74.8769 43.88ZM86.5569 43.88L87.099 44.7203L86.5569 43.88ZM90.3969 39.4L91.3011 39.827L90.3969 39.4ZM91.7569 0.999996V-3.8147e-06H90.7569V0.999996H91.7569ZM105.517 0.999996H106.517V-3.8147e-06H105.517V0.999996ZM102.477 46.04L103.356 46.5171L103.359 46.5119L102.477 46.04ZM93.8369 54.76L94.3193 55.636L94.3236 55.6336L93.8369 54.76ZM80.7169 56.8C75.8401 56.8 71.6365 55.8151 68.074 53.8811L67.1198 55.6389C71.0239 57.7582 75.567 58.8 80.7169 58.8V56.8ZM68.0836 53.8864C64.5148 51.8981 61.7713 49.1285 59.8357 45.5629L58.078 46.5171C60.1957 50.4182 63.2122 53.4619 67.1102 55.6336L68.0836 53.8864ZM59.8385 45.5681C57.9032 41.9521 56.9169 37.6669 56.9169 32.68H54.9169C54.9169 37.9331 55.9572 42.5546 58.0752 46.5119L59.8385 45.5681ZM56.9169 32.68V0.999996H54.9169V32.68H56.9169ZM55.9169 2H69.6769V-3.8147e-06H55.9169V2ZM68.6769 0.999996V32.68H70.6769V0.999996H68.6769ZM68.6769 32.68C68.6769 35.3578 69.1513 37.7489 70.1326 39.827L71.9411 38.973C71.1091 37.2111 70.6769 35.1222 70.6769 32.68H68.6769ZM70.1326 39.827C71.1125 41.902 72.512 43.5444 74.3347 44.7203L75.419 43.0397C73.935 42.0823 72.7746 40.738 71.9411 38.973L70.1326 39.827ZM74.3347 44.7203C76.1712 45.9051 78.3119 46.48 80.7169 46.48V44.48C78.6418 44.48 76.8892 43.9882 75.419 43.0397L74.3347 44.7203ZM80.7169 46.48C83.1218 46.48 85.2625 45.9051 87.099 44.7203L86.0147 43.0397C84.5446 43.9882 82.7919 44.48 80.7169 44.48V46.48ZM87.099 44.7203C88.9217 43.5444 90.3213 41.902 91.3011 39.827L89.4926 38.973C88.6591 40.738 87.4987 42.0823 86.0147 43.0397L87.099 44.7203ZM91.3011 39.827C92.2825 37.7489 92.7569 35.3578 92.7569 32.68H90.7569C90.7569 35.1222 90.3246 37.2111 89.4926 38.973L91.3011 39.827ZM92.7569 32.68V0.999996H90.7569V32.68H92.7569ZM91.7569 2H105.517V-3.8147e-06H91.7569V2ZM104.517 0.999996V32.68H106.517V0.999996H104.517ZM104.517 32.68C104.517 37.6669 103.531 41.9521 101.595 45.5681L103.359 46.5119C105.477 42.5546 106.517 37.9331 106.517 32.68H104.517ZM101.598 45.5629C99.6624 49.1285 96.9189 51.8981 93.3502 53.8864L94.3236 55.6336C98.2215 53.4619 101.238 50.4182 103.356 46.5171L101.598 45.5629ZM93.3545 53.884C89.8498 55.8141 85.6494 56.8 80.7169 56.8V58.8C85.9176 58.8 90.4639 57.7592 94.3193 55.6359L93.3545 53.884ZM132.161 55.72L131.775 56.6427L131.787 56.6475L132.161 55.72ZM122.721 49.56L122.021 50.2742L122.028 50.2811L122.721 49.56ZM116.481 40.36L117.401 39.9695L116.481 40.36ZM116.481 17.64L117.399 18.0356L117.401 18.0305L116.481 17.64ZM122.721 8.43999L122.028 7.71886L122.021 7.72578L122.721 8.43999ZM132.161 2.36L132.534 3.28759L132.546 3.28267L132.161 2.36ZM152.481 1.48L152.175 2.43221L152.186 2.43563L152.197 2.4388L152.481 1.48ZM160.401 5.24L159.833 6.06351L159.844 6.07069L159.854 6.07761L160.401 5.24ZM166.481 11L167.169 11.7256L167.8 11.1269L167.294 10.4188L166.481 11ZM157.201 19.8L156.39 20.3861L157.06 21.3116L157.889 20.5256L157.201 19.8ZM151.121 14.2L151.601 13.3229L151.121 14.2ZM137.681 13.64L138.084 14.555L138.096 14.5495L137.681 13.64ZM132.881 17.16L133.613 17.8405L133.619 17.834L133.625 17.8275L132.881 17.16ZM129.601 22.44L128.67 22.0728L128.668 22.0795L128.665 22.0861L129.601 22.44ZM129.601 35.64L128.662 35.9857L128.668 36.0008L128.674 36.0157L129.601 35.64ZM132.881 40.92L132.136 41.5875L132.142 41.594L132.148 41.6004L132.881 40.92ZM137.681 44.44L137.255 45.3448L137.271 45.3523L137.287 45.3591L137.681 44.44ZM151.121 43.8L151.601 44.6771L151.609 44.6727L151.617 44.6682L151.121 43.8ZM157.201 38.2L157.889 37.4744L157.068 36.6965L156.396 37.6056L157.201 38.2ZM166.481 47L167.288 47.5905L167.807 46.8801L167.169 46.2744L166.481 47ZM160.401 52.76L159.842 51.9307L159.833 51.9365L160.401 52.76ZM152.481 56.6L152.77 57.5574L152.781 57.5538L152.481 56.6ZM143.761 56.88C139.718 56.88 135.98 56.1809 132.534 54.7925L131.787 56.6475C135.488 58.1391 139.483 58.88 143.761 58.88V56.88ZM132.546 54.7973C129.084 53.3503 126.042 51.3643 123.413 48.8389L122.028 50.2811C124.839 52.9823 128.091 55.103 131.775 56.6427L132.546 54.7973ZM123.421 48.8458C120.85 46.327 118.844 43.3711 117.401 39.9695L115.56 40.7505C117.104 44.3889 119.258 47.5663 122.021 50.2742L123.421 48.8458ZM117.401 39.9695C115.963 36.5803 115.241 32.9273 115.241 29H113.241C113.241 33.1793 114.011 37.0997 115.56 40.7505L117.401 39.9695ZM115.241 29C115.241 25.0173 115.964 21.3667 117.399 18.0356L115.562 17.2444C114.01 20.8466 113.241 24.7694 113.241 29H115.241ZM117.401 18.0305C118.844 14.6289 120.85 11.673 123.421 9.15421L122.021 7.72578C119.258 10.4337 117.104 13.6111 115.56 17.2495L117.401 18.0305ZM123.413 9.1611C126.039 6.63825 129.077 4.68078 132.534 3.28752L131.787 1.43248C128.098 2.91922 124.842 5.01508 122.028 7.71889L123.413 9.1611ZM132.546 3.28267C135.989 1.84407 139.723 1.12 143.761 1.12V-0.880001C139.478 -0.880001 135.479 -0.110743 131.775 1.43733L132.546 3.28267ZM143.761 1.12C146.644 1.12 149.448 1.55741 152.175 2.43221L152.786 0.527784C149.86 -0.410744 146.85 -0.880001 143.761 -0.880001V1.12ZM152.197 2.4388C154.979 3.26315 157.523 4.47172 159.833 6.06351L160.968 4.41649C158.479 2.70161 155.743 1.40351 152.765 0.521202L152.197 2.4388ZM159.854 6.07761C162.21 7.61396 164.144 9.44896 165.667 11.5812L167.294 10.4188C165.617 8.07103 163.498 6.06604 160.947 4.40239L159.854 6.07761ZM165.793 10.2744L156.513 19.0744L157.889 20.5256L167.169 11.7256L165.793 10.2744ZM158.011 19.2139C156.129 16.6119 153.996 14.6343 151.601 13.3229L150.64 15.0771C152.726 16.219 154.646 17.9747 156.39 20.3861L158.011 19.2139ZM151.601 13.3229C149.207 12.012 146.587 11.36 143.761 11.36V13.36C146.267 13.36 148.554 13.9347 150.64 15.0771L151.601 13.3229ZM143.761 11.36C141.44 11.36 139.27 11.8137 137.265 12.7305L138.096 14.5495C139.824 13.7596 141.708 13.36 143.761 13.36V11.36ZM137.277 12.7251C135.327 13.5851 133.613 14.8453 132.136 16.4925L133.625 17.8275C134.922 16.3814 136.407 15.2948 138.084 14.5549L137.277 12.7251ZM132.148 16.4795C130.671 18.0703 129.513 19.9384 128.67 22.0728L130.531 22.8072C131.288 20.8882 132.317 19.2364 133.613 17.8405L132.148 16.4795ZM128.665 22.0861C127.87 24.187 127.481 26.4955 127.481 29H129.481C129.481 26.7044 129.837 24.6397 130.536 22.7939L128.665 22.0861ZM127.481 29C127.481 31.5049 127.871 33.8367 128.662 35.9857L130.539 35.2943C129.837 33.3899 129.481 31.2951 129.481 29H127.481ZM128.674 36.0157C129.516 38.0934 130.67 39.9527 132.136 41.5875L133.625 40.2525C132.318 38.794 131.285 37.1333 130.527 35.2643L128.674 36.0157ZM132.148 41.6004C133.62 43.1859 135.324 44.4361 137.255 45.3448L138.106 43.5352C136.411 42.7372 134.915 41.6408 133.613 40.2395L132.148 41.6004ZM137.287 45.3591C139.287 46.2165 141.449 46.64 143.761 46.64V44.64C141.699 44.64 139.807 44.2635 138.075 43.5209L137.287 45.3591ZM143.761 46.64C146.587 46.64 149.207 45.988 151.601 44.6771L150.64 42.9229C148.554 44.0653 146.267 44.64 143.761 44.64V46.64ZM151.617 44.6682C153.997 43.3079 156.124 41.3393 158.005 38.7944L156.396 37.6056C154.651 39.9674 152.724 41.7321 150.624 42.9318L151.617 44.6682ZM156.513 38.9256L165.793 47.7256L167.169 46.2744L157.889 37.4744L156.513 38.9256ZM165.674 46.4095C164.148 48.4946 162.208 50.3361 159.842 51.9307L160.959 53.5893C163.5 51.8772 165.613 49.8787 167.288 47.5905L165.674 46.4095ZM159.833 51.9365C157.518 53.5313 154.969 54.7683 152.18 55.6461L152.781 57.5538C155.752 56.6184 158.483 55.2954 160.968 53.5835L159.833 51.9365ZM152.192 55.6427C149.46 56.4674 146.651 56.88 143.761 56.88V58.88C146.844 58.88 149.848 58.4393 152.77 57.5573L152.192 55.6427ZM188.567 55.72L188.181 56.6427L188.193 56.6475L188.567 55.72ZM179.127 49.56L178.427 50.2742L178.434 50.2811L179.127 49.56ZM172.887 40.36L173.807 39.9695L172.887 40.36ZM172.887 17.64L173.805 18.0356L173.807 18.0305L172.887 17.64ZM179.127 8.43999L178.434 7.71886L178.427 7.72578L179.127 8.43999ZM188.567 2.36L188.941 3.28759L188.952 3.28267L188.567 2.36ZM208.887 1.48L208.581 2.43221L208.592 2.43563L208.603 2.4388L208.887 1.48ZM216.807 5.24L216.24 6.06351L216.25 6.07069L216.261 6.07761L216.807 5.24ZM222.887 11L223.575 11.7256L224.206 11.1269L223.701 10.4188L222.887 11ZM213.607 19.8L212.797 20.3861L213.466 21.3116L214.295 20.5256L213.607 19.8ZM207.527 14.2L208.007 13.3229L207.527 14.2ZM194.087 13.64L194.491 14.555L194.503 14.5495L194.087 13.64ZM189.287 17.16L190.02 17.8405L190.026 17.834L190.031 17.8275L189.287 17.16ZM186.007 22.44L185.077 22.0728L185.074 22.0795L185.072 22.0861L186.007 22.44ZM186.007 35.64L185.069 35.9857L185.074 36.0008L185.08 36.0157L186.007 35.64ZM189.287 40.92L188.542 41.5875L188.548 41.594L188.554 41.6004L189.287 40.92ZM194.087 44.44L193.661 45.3448L193.677 45.3523L193.693 45.3591L194.087 44.44ZM207.527 43.8L208.007 44.6771L208.015 44.6727L208.023 44.6682L207.527 43.8ZM213.607 38.2L214.295 37.4744L213.475 36.6965L212.803 37.6056L213.607 38.2ZM222.887 47L223.694 47.5905L224.214 46.8801L223.575 46.2744L222.887 47ZM216.807 52.76L216.248 51.9307L216.24 51.9365L216.807 52.76ZM208.887 56.6L209.176 57.5574L209.187 57.5538L208.887 56.6ZM200.167 56.88C196.125 56.88 192.386 56.1809 188.941 54.7925L188.193 56.6475C191.894 58.1391 195.889 58.88 200.167 58.88V56.88ZM188.952 54.7973C185.49 53.3503 182.448 51.3643 179.82 48.8389L178.434 50.2811C181.246 52.9823 184.497 55.103 188.181 56.6427L188.952 54.7973ZM179.827 48.8458C177.257 46.327 175.251 43.3711 173.807 39.9695L171.966 40.7505C173.51 44.3889 175.664 47.5663 178.427 50.2742L179.827 48.8458ZM173.807 39.9695C172.37 36.5803 171.647 32.9273 171.647 29H169.647C169.647 33.1793 170.417 37.0997 171.966 40.7505L173.807 39.9695ZM171.647 29C171.647 25.0173 172.37 21.3667 173.805 18.0356L171.968 17.2444C170.417 20.8466 169.647 24.7694 169.647 29H171.647ZM173.807 18.0305C175.251 14.6289 177.257 11.673 179.827 9.15421L178.427 7.72578C175.664 10.4337 173.51 13.6111 171.966 17.2495L173.807 18.0305ZM179.82 9.1611C182.446 6.63825 185.483 4.68078 188.941 3.28752L188.193 1.43248C184.504 2.91922 181.248 5.01508 178.434 7.71889L179.82 9.1611ZM188.952 3.28267C192.395 1.84407 196.129 1.12 200.167 1.12V-0.880001C195.884 -0.880001 191.886 -0.110743 188.181 1.43733L188.952 3.28267ZM200.167 1.12C203.051 1.12 205.854 1.55741 208.581 2.43221L209.192 0.527784C206.266 -0.410744 203.257 -0.880001 200.167 -0.880001V1.12ZM208.603 2.4388C211.385 3.26315 213.929 4.47172 216.24 6.06351L217.374 4.41649C214.885 2.70161 212.149 1.40351 209.171 0.521202L208.603 2.4388ZM216.261 6.07761C218.616 7.61396 220.55 9.44896 222.073 11.5812L223.701 10.4188C222.024 8.07103 219.904 6.06604 217.353 4.40239L216.261 6.07761ZM222.199 10.2744L212.919 19.0744L214.295 20.5256L223.575 11.7256L222.199 10.2744ZM214.417 19.2139C212.535 16.6119 210.402 14.6343 208.007 13.3229L207.047 15.0771C209.132 16.219 211.052 17.9747 212.797 20.3861L214.417 19.2139ZM208.007 13.3229C205.613 12.012 202.994 11.36 200.167 11.36V13.36C202.673 13.36 204.96 13.9347 207.047 15.0771L208.007 13.3229ZM200.167 11.36C197.846 11.36 195.677 11.8137 193.671 12.7305L194.503 14.5495C196.23 13.7596 198.114 13.36 200.167 13.36V11.36ZM193.683 12.7251C191.734 13.5851 190.019 14.8453 188.542 16.4925L190.031 17.8275C191.328 16.3814 192.813 15.2948 194.491 14.5549L193.683 12.7251ZM188.554 16.4795C187.077 18.0703 185.919 19.9384 185.077 22.0728L186.937 22.8072C187.695 20.8882 188.723 19.2364 190.02 17.8405L188.554 16.4795ZM185.072 22.0861C184.277 24.187 183.887 26.4955 183.887 29H185.887C185.887 26.7044 186.244 24.6397 186.942 22.7939L185.072 22.0861ZM183.887 29C183.887 31.5049 184.277 33.8367 185.069 35.9857L186.945 35.2943C186.244 33.3899 185.887 31.2951 185.887 29H183.887ZM185.08 36.0157C185.922 38.0934 187.077 39.9527 188.542 41.5875L190.031 40.2525C188.724 38.794 187.691 37.1333 186.934 35.2643L185.08 36.0157ZM188.554 41.6004C190.026 43.1859 191.73 44.4361 193.661 45.3448L194.513 43.5352C192.817 42.7372 191.321 41.6408 190.02 40.2395L188.554 41.6004ZM193.693 45.3591C195.693 46.2165 197.855 46.64 200.167 46.64V44.64C198.105 44.64 196.214 44.2635 194.481 43.5209L193.693 45.3591ZM200.167 46.64C202.994 46.64 205.613 45.988 208.007 44.6771L207.047 42.9229C204.96 44.0653 202.673 44.64 200.167 44.64V46.64ZM208.023 44.6682C210.404 43.3079 212.53 41.3393 214.411 38.7944L212.803 37.6056C211.057 39.9674 209.13 41.7321 207.031 42.9318L208.023 44.6682ZM212.919 38.9256L222.199 47.7256L223.575 46.2744L214.295 37.4744L212.919 38.9256ZM222.08 46.4095C220.554 48.4946 218.614 50.3361 216.248 51.9307L217.366 53.5893C219.906 51.8772 222.02 49.8787 223.694 47.5905L222.08 46.4095ZM216.24 51.9365C213.925 53.5313 211.375 54.7683 208.587 55.6461L209.187 57.5538C212.159 56.6184 214.889 55.2954 217.374 53.5835L216.24 51.9365ZM208.598 55.6427C205.866 56.4674 203.057 56.88 200.167 56.88V58.88C203.25 58.88 206.254 58.4393 209.176 57.5573L208.598 55.6427ZM230.065 57H229.065V58H230.065V57ZM230.065 0.999996V-3.8147e-06H229.065V0.999996H230.065ZM243.825 0.999996H244.825V-3.8147e-06H243.825V0.999996ZM243.825 57V58H244.825V57H243.825ZM231.065 57V0.999996H229.065V57H231.065ZM230.065 2H243.825V-3.8147e-06H230.065V2ZM242.825 0.999996V57H244.825V0.999996H242.825ZM243.825 56H230.065V58H243.825V56Z" fill="#404146"/>
</svg>
