<svg width="97" height="83" viewBox="0 0 97 83" fill="none" xmlns="http://www.w3.org/2000/svg">
<path d="M70.5876 19.7547C71.352 19.8309 71.352 20.7618 70.5876 20.838L64.1751 21.4766C55.8949 22.3012 49.3666 27.7803 48.3842 34.7297L47.6233 40.1115C47.5325 40.7532 46.4234 40.7532 46.3326 40.1115L45.5717 34.7297C44.5892 27.7803 38.0609 22.3012 29.7808 21.4766L23.3684 20.838C22.6039 20.7618 22.6039 19.8309 23.3684 19.7547L29.7808 19.1162C38.0609 18.2916 44.5892 12.8125 45.5717 5.86302L46.3326 0.481148C46.4234 -0.160384 47.5325 -0.160384 47.6233 0.481148L48.3842 5.86302C49.3666 12.8125 55.8949 18.2916 64.1751 19.1162L70.5876 19.7547Z" fill="#07A081"/>
<path d="M95.6342 40.4829C96.3986 40.5591 96.3986 41.49 95.6342 41.5662L89.2217 42.2048C80.9415 43.0294 74.4132 48.5085 73.4308 55.4579L72.6699 60.8398C72.5791 61.4814 71.47 61.4814 71.3792 60.8398L70.6183 55.4579C69.6358 48.5085 63.1075 43.0294 54.8274 42.2048L48.415 41.5662C47.6505 41.49 47.6505 40.5591 48.415 40.4829L54.8274 39.8444C63.1075 39.0198 69.6358 33.5407 70.6183 26.5912L71.3792 21.2094C71.47 20.5678 72.5791 20.5678 72.6699 21.2094L73.4308 26.5912C74.4132 33.5407 80.9415 39.0198 89.2217 39.8444L95.6342 40.4829Z" fill="#07A081"/>
<path d="M71.4513 61.2112C72.2156 61.2873 72.2156 62.2183 71.4513 62.2944L65.0388 62.933C56.7586 63.7576 50.2303 69.2367 49.2478 76.1861L48.487 81.568C48.3962 82.2096 47.287 82.2096 47.1963 81.568L46.4354 76.1861C45.4529 69.2367 38.9246 63.7576 30.6445 62.933L24.2321 62.2944C23.4676 62.2183 23.4676 61.2873 24.2321 61.2112L30.6445 60.5726C38.9246 59.748 45.4529 54.2689 46.4354 47.3194L47.1963 41.9376C47.287 41.296 48.3962 41.296 48.487 41.9376L49.2478 47.3194C50.2303 54.2689 56.7586 59.748 65.0388 60.5726L71.4513 61.2112Z" fill="#07A081"/>
<path d="M48.5638 40.9148C49.3282 40.991 49.3282 41.9219 48.5638 41.9981L42.1514 42.6367C33.8712 43.4612 27.3429 48.9404 26.3604 55.8897L25.5996 61.2716C25.5088 61.9132 24.3996 61.9132 24.3088 61.2716L23.548 55.8897C22.5655 48.9404 16.0372 43.4612 7.75709 42.6367L1.34465 41.9981C0.580176 41.9219 0.580176 40.991 1.34465 40.9148L7.75709 40.2762C16.0372 39.4516 22.5655 33.9725 23.548 27.0231L24.3088 21.6412C24.3996 20.9997 25.5088 20.9997 25.5996 21.6412L26.3604 27.0231C27.3429 33.9725 33.8712 39.4516 42.1514 40.2762L48.5638 40.9148Z" fill="#07A081"/>
</svg>
