<svg width="236" height="56" viewBox="0 0 236 56" fill="none" xmlns="http://www.w3.org/2000/svg">
<path d="M0.24 56H-0.76V57H0.24V56ZM0.24 -3.8147e-06V-1H-0.76V-3.8147e-06H0.24ZM17.52 -3.8147e-06L18.4134 -0.449343L18.1364 -1H17.52V-3.8147e-06ZM31.04 26.88L30.1466 27.3293L31.0427 29.1108L31.9344 27.3272L31.04 26.88ZM44.48 -3.8147e-06V-1H43.862L43.5856 -0.447218L44.48 -3.8147e-06ZM61.76 -3.8147e-06H62.76V-1H61.76V-3.8147e-06ZM61.76 56V57H62.76V56H61.76ZM48.8 56H47.8V57H48.8V56ZM48.8 18H49.8L47.9154 17.5337L48.8 18ZM30.88 52L29.9944 52.4645L30.8778 54.1488L31.7646 52.4663L30.88 52ZM12.88 17.68L13.7656 17.2155L11.88 17.68H12.88ZM12.88 56V57H13.88V56H12.88ZM1.24 56V-3.8147e-06H-0.76V56H1.24ZM0.24 0.999996H17.52V-1H0.24V0.999996ZM16.6266 0.449335L30.1466 27.3293L31.9334 26.4307L18.4134 -0.449343L16.6266 0.449335ZM31.9344 27.3272L45.3744 0.44721L43.5856 -0.447218L30.1456 26.4328L31.9344 27.3272ZM44.48 0.999996H61.76V-1H44.48V0.999996ZM60.76 -3.8147e-06V56H62.76V-3.8147e-06H60.76ZM61.76 55H48.8V57H61.76V55ZM49.8 56V18H47.8V56H49.8ZM47.9154 17.5337L29.9954 51.5337L31.7646 52.4663L49.6847 18.4663L47.9154 17.5337ZM31.7656 51.5355L13.7656 17.2155L11.9944 18.1445L29.9944 52.4645L31.7656 51.5355ZM11.88 17.68V56H13.88V17.68H11.88ZM12.88 55H0.24V57H12.88V55ZM68.1444 56L67.2127 55.6367L66.681 57H68.1444V56ZM89.9844 -3.8147e-06V-1H89.301L89.0527 -0.36335L89.9844 -3.8147e-06ZM105.664 -3.8147e-06L106.598 -0.358715L106.351 -1H105.664V-3.8147e-06ZM127.184 56V57H128.64L128.118 55.6413L127.184 56ZM112.304 56L111.36 56.3281L111.593 57H112.304V56ZM107.664 42.64L108.609 42.3119L108.376 41.64H107.664V42.64ZM87.1844 42.64V41.64H86.4771L86.2415 42.3069L87.1844 42.64ZM82.4644 56V57H83.1717L83.4073 56.3331L82.4644 56ZM90.9444 32L90.0015 31.6668L89.5303 33H90.9444V32ZM103.984 32V33H105.393L104.928 31.6704L103.984 32ZM97.5044 13.44L98.4485 13.1104L97.5102 10.4228L96.5615 13.1068L97.5044 13.44ZM69.076 56.3633L90.916 0.363342L89.0527 -0.36335L67.2127 55.6367L69.076 56.3633ZM89.9844 0.999996H105.664V-1H89.9844V0.999996ZM104.731 0.358707L126.251 56.3587L128.118 55.6413L106.598 -0.358715L104.731 0.358707ZM127.184 55H112.304V57H127.184V55ZM113.249 55.6719L108.609 42.3119L106.72 42.9681L111.36 56.3281L113.249 55.6719ZM107.664 41.64H87.1844V43.64H107.664V41.64ZM86.2415 42.3069L81.5215 55.6669L83.4073 56.3331L88.1273 42.9731L86.2415 42.3069ZM82.4644 55H68.1444V57H82.4644V55ZM90.9444 33H103.984V31H90.9444V33ZM104.928 31.6704L98.4485 13.1104L96.5603 13.7696L103.04 32.3296L104.928 31.6704ZM96.5615 13.1068L90.0015 31.6668L91.8872 32.3332L98.4472 13.7732L96.5615 13.1068ZM133.599 56H132.599V57H133.599V56ZM133.599 -3.8147e-06V-1H132.599V-3.8147e-06H133.599ZM171.039 2.32L170.58 3.20799L170.586 3.21126L170.592 3.21443L171.039 2.32ZM177.999 8.64L177.145 9.15941L177.151 9.1693L177.157 9.17905L177.999 8.64ZM177.679 27.36L176.857 26.7908L176.855 26.7942L177.679 27.36ZM170.159 33.52L169.756 32.6049L168.778 33.0361L169.273 33.9835L170.159 33.52ZM181.919 56V57H183.571L182.805 55.5365L181.919 56ZM166.559 56L165.663 56.443L165.938 57H166.559V56ZM156.399 35.44L157.296 34.997L157.021 34.44H156.399V35.44ZM147.359 35.44V34.44H146.359V35.44H147.359ZM147.359 56V57H148.359V56H147.359ZM147.359 24.64H146.359V25.64H147.359V24.64ZM164.639 22.8L163.962 22.0641L163.955 22.071L163.947 22.078L164.639 22.8ZM164.639 13.2L163.947 13.922L163.963 13.9367L163.979 13.9507L164.639 13.2ZM147.359 11.36V10.36H146.359V11.36H147.359ZM134.599 56V-3.8147e-06H132.599V56H134.599ZM133.599 0.999996H160.799V-1H133.599V0.999996ZM160.799 0.999996C164.502 0.999996 167.754 1.74475 170.58 3.20799L171.499 1.432C168.351 -0.198092 164.777 -1 160.799 -1V0.999996ZM170.592 3.21443C173.419 4.62791 175.594 6.60834 177.145 9.15941L178.854 8.12059C177.098 5.23166 174.633 2.99875 171.487 1.42557L170.592 3.21443ZM177.157 9.17905C178.751 11.6696 179.559 14.5456 179.559 17.84H181.559C181.559 14.2011 180.661 10.9437 178.842 8.10094L177.157 9.17905ZM179.559 17.84C179.559 21.2227 178.654 24.1949 176.857 26.7908L178.502 27.9292C180.544 24.9784 181.559 21.604 181.559 17.84H179.559ZM176.855 26.7942C175.098 29.3542 172.74 31.2899 169.756 32.6049L170.563 34.4351C173.872 32.9768 176.527 30.8058 178.504 27.9258L176.855 26.7942ZM169.273 33.9835L181.033 56.4635L182.805 55.5365L171.045 33.0565L169.273 33.9835ZM181.919 55H166.559V57H181.919V55ZM167.456 55.557L157.296 34.997L155.503 35.883L165.663 56.443L167.456 55.557ZM156.399 34.44H147.359V36.44H156.399V34.44ZM146.359 35.44V56H148.359V35.44H146.359ZM147.359 55H133.599V57H147.359V55ZM147.359 25.64H159.519V23.64H147.359V25.64ZM159.519 25.64C161.855 25.64 163.828 24.9622 165.331 23.522L163.947 22.078C162.89 23.0911 161.451 23.64 159.519 23.64V25.64ZM165.316 23.5359C166.875 22.1018 167.639 20.2252 167.639 18H165.639C165.639 19.7215 165.07 21.0448 163.962 22.0641L165.316 23.5359ZM167.639 18C167.639 15.731 166.881 13.8403 165.3 12.4493L163.979 13.9507C165.065 14.9064 165.639 16.2157 165.639 18H167.639ZM165.331 12.478C163.828 11.0378 161.855 10.36 159.519 10.36V12.36C161.451 12.36 162.89 12.9089 163.947 13.922L165.331 12.478ZM159.519 10.36H147.359V12.36H159.519V10.36ZM146.359 11.36V24.64H148.359V11.36H146.359ZM203.289 56H202.289V57H203.289V56ZM203.289 11.76H204.289V10.76H203.289V11.76ZM185.289 11.76H184.289V12.76H185.289V11.76ZM185.289 -3.8147e-06V-1H184.289V-3.8147e-06H185.289ZM235.049 -3.8147e-06H236.049V-1H235.049V-3.8147e-06ZM235.049 11.76V12.76H236.049V11.76H235.049ZM217.049 11.76V10.76H216.049V11.76H217.049ZM217.049 56V57H218.049V56H217.049ZM204.289 56V11.76H202.289V56H204.289ZM203.289 10.76H185.289V12.76H203.289V10.76ZM186.289 11.76V-3.8147e-06H184.289V11.76H186.289ZM185.289 0.999996H235.049V-1H185.289V0.999996ZM234.049 -3.8147e-06V11.76H236.049V-3.8147e-06H234.049ZM235.049 10.76H217.049V12.76H235.049V10.76ZM216.049 11.76V56H218.049V11.76H216.049ZM217.049 55H203.289V57H217.049V55Z" fill="#07A081"/>
</svg>
