{
    "ipfs": "ipfs://QmeM7bfrgrNJwffwghtgmx7dagtVBVxSGcZp4waX4vXk",
    "arweawe": "8jwrwvZSMMrrFnn9ciGZIQFpjbIP0BFIpZWXmVs3GKg",
    "tokenName": "mystic#4",
    "tokenHash": "asset19s9d6urvg2vhw6ftuq2v7vzwj5n2yzsxcgpp34",
    "buyingTx": "1f3k304b4b5f4ec3e85a9772e98aa6bef640c34439915a42100de3380ed2e548",
    "mintTx": "2a3k304b4b5f4ec3e85a9772e98aa6bef640c34439915a42100de3380ed2e548",
    "rarity": "0.00000002",
    "attributes": [
        {
            "name": "melody14",
            "probabilty": "0.1",
            "media": "link/to/media"
        },
        {
            "name": "bass01",
            "probabilty": "0.2",
            "media": "link/to/media"
        },
        {
            "name": "layerX06",
            "probabilty": "0.05",
            "media": "link/to/media"
        },
        {
            "name": "layerY09",
            "probabilty": "0.2",
            "media": "link/to/media"
        },
        {
            "name": "layerZ17",
            "probabilty": "0.01",
            "media": "link/to/media"
        },
        {
            "name": "signature36",
            "probabilty": "0.01",
            "media": "link/to/media"
        }
    ]

}