{
    "projectName": "ANTELOPE",
    
    "contactUrl": "https://www.tib.eu/en/imprint",
    "repoUrl": "https://gitlab.com/nfdi4culture/antelope/auxiliary-service-repositories/antelope-documentation",
    "appUrl": "https://service.tib.eu/annotation",
    "appUrlGitLab": "https://gitlab.com/nfdi4culture/antelope/annotation-service",
    "appUrlGitHub": "",
    
    
    "deploySite": "https://nfdi4culture.gitlab.io",
    "deployBase": "/antelope/auxiliary-service-repositories/antelope-documentation"
}