<?xml version="1.0" encoding="utf-8"?>
<svg width="11" height="11" viewBox="0 0 11 11" fill="none" xmlns="http://www.w3.org/2000/svg">
  <path d="M 1.949 1.947 L 9.051 9.054" stroke="#7B7B7B" stroke-width="1.5" style="transform-box: fill-box; transform-origin: 50% 50%;"/>
  <path d="M 1.95 1.948 L 9.053 9.055" stroke="#7B7B7B" stroke-width="1.5" style="transform-box: fill-box; transform-origin: 50% 50%;" transform="matrix(0, 1, -1, 0, 0.000001, 0)"/>
</svg>