Lsoa,LsoaName,Ward,WardName,La,LaName
E01019283,Copeland 008B,E05003193,Haverigg,E07000029,Copeland
E01019289,Copeland 008C,E05003196,Holborn Hill,E07000029,Copeland
E01019290,Copeland 008D,E05003196,Holborn Hill,E07000029,Copeland
E01019293,Copeland 008E,E05003198,Millom Without,E07000029,Copeland
E01019298,Copeland 008F,E05003201,Newtown,E07000029,Copeland
E01019299,Copeland 008G,E05003201,Newtown,E07000029,Copeland
E01027558,Craven 001A,E05006191,Bentham,E07000163,Craven
E01027559,Craven 001B,E05006191,Bentham,E07000163,Craven
E01027570,Craven 001D,E05006198,Ingleton and Clapham,E07000163,Craven
