{
    "alwaysDefault": [],
    "modules": [
        {
            "module": "ModuleExample",
            "tables": [
                "table_a",
                "table_b"
            ]
        }
    ]
}