{
  "domainMessageType": "CqrsEvent",
  "ordered": false,
  "id": "7b1d810a-f61b-464e-9791-ae29b380b70d",
  "timestamp": "2021-09-16 14:38:45.118",
  "payloadClass": "sample.event.product.event.product.ProductDomainEvent",
  "payload": "{\"id\":\"7b1d810a-f61b-464e-9791-ae29b380b70d\",\"domainMessageType\":\"CqrsEvent\",\"traceHeader\":{\"traceId\":\"3ce4ec67-8656-4657-a82b-aa6beba2d15c\",\"parentMessageId\":\"c530e3dd-8ff2-4ad9-9061-4610b075e42d\",\"userId\":\"2g@1:1:1-o1\",\"loginUser\":{\"id\":\"1234\",\"name\":\"Steve Jobs\"},\"userType\":null,\"parentService\":\"sample.event.product\",\"service\":\"sample.event.product\",\"parentMessage\":\"ProductEvent\",\"messageId\":\"7b1d810a-f61b-464e-9791-ae29b380b70d\",\"message\":\"ProductDomainEvent\",\"time\":1631770725118},\"cqrsEventType\":\"DomainEvent\",\"commandId\":null,\"ordered\":false,\"producedTimestamp\":\"2021-09-16 14:38:45.118\",\"domainEventType\":\"DomainEvent\",\"eventType\":\"Registered\",\"name\":\"dokdo belongs to korea\",\"description\":\"텅 부분에 브랜드명을 새겨 넣어 브랜드 고유의 아이덴티티를 드러낸 모델로 소가죽, 고탄성 스판 소재로 출시되었습니다.\",\"category\":\"Sneakers\",\"color\":\"#ff0000\",\"size\":240,\"material\":\"cowhide\",\"nameValues\":null,\"actorKey\":{\"id\":\"2g@1:1:1-o1\",\"type\":\"Actor\"}}",
  "serviceName": "sample.event.product",
  "traceId": "3ce4ec67-8656-4657-a82b-aa6beba2d15c",
  "userId": "2g@1:1:1-o1",
  "loginUserId": "1234",
  "loginUserName": "Steve Jobs",
  "userType": null,
  "parentService": "sample.event.product",
  "parentMessage": "ProductEvent",
  "parentMessageId": "c530e3dd-8ff2-4ad9-9061-4610b075e42d",
  "traceTime": 1631770725118,
  "cqrsCommandType": null,
  "requestTime": 0,
  "waitingTime": 0,
  "requestFailed": false,
  "failureMessage": null
}
