{
  "index": "Giới thiệu",
  "contribution": "Đóng góp cho nội dung",
  "fontend-vs-backend": "Giới thiệu FontEnd, Backend",
  "be": "Backend developer",
  "fe": "FontEnd developer",
  "git": "GIT",
  "sql": "SQL",
  "csharp": "C#",
  "about": {
    "title": "About us",
    "type": "page"
  }
}
