#In-silico ESI-MS/MS [M+H]+ Spectra
#PREDICTED BY CFM-ID 4.0.8
#SMILES=[nH]1c(nc2c(c1=O)nc(n2[C@@H]1O[C@H](CO)[C@@H](C1)O)Nc1c(cc(cc1)C)C)N
#InChiKey=WMRFYSQGZZOGAD-JHJVBQTASA-N
energy0
271.13019 30.00 10 61 63 28 58 38 79 43 56 21 39 54 62 44 48 51 (20.704 0.082524 0.04046 0.035361 0.028947 0.027176 0.026933 0.01482 0.01163 0.0086637 0.0063052 0.0032989 0.0032038 0.0017897 0.0015785 0.00053099)
387.17753 100.00 0 208 175 205 275 266 248 143 270 236 148 163 164 196 193 267 173 174 171 166 (68.457 0.98812 0.2114 0.093613 0.046585 0.046226 0.038006 0.029067 0.015284 0.012212 0.010121 0.0092128 0.0086597 0.0074079 0.0056733 0.0050514 0.0040245 0.0031416 0.002064 0.00042541)
energy1
165.05194 4.09 17 (2.2245)
254.10364 5.42 20 22 45 53 (2.4264 0.47328 0.027574 0.023628)
255.09889 21.55 18 19 77 (5.88 5.8291 0.023232)
271.13019 100.00 10 28 21 63 38 58 56 79 62 39 61 44 43 51 48 54 (51.534 0.71883 0.42513 0.36592 0.31547 0.21406 0.17712 0.14634 0.14347 0.093887 0.082332 0.081906 0.057849 0.052932 0.016343 0.0066391)
343.15131 3.22 100 (1.7508)
369.16696 6.31 87 176 98 96 1 94 99 93 101 (2.5715 0.55999 0.085333 0.082617 0.064501 0.023075 0.020327 0.01637 0.011338)
387.17753 8.81 0 208 175 148 196 163 193 164 236 205 248 143 266 267 275 270 173 171 166 174 (3.2483 1.1961 0.1663 0.041532 0.035207 0.024171 0.013411 0.012901 0.011708 0.010771 0.008419 0.0068005 0.0050722 0.0041165 0.0038043 0.0036909 0.0020748 0.0016894 0.00025224 4.0423e-05)
energy2
43.01784 5.27 218 (0.84489)
45.03349 8.35 211 (1.3384)
55.01784 5.14 220 (0.82301)
57.03349 26.91 222 (4.3117)
89.05971 10.56 195 (1.6918)
91.05423 17.02 125 (2.7261)
93.06988 6.22 115 (0.99599)
97.10118 9.17 64 (1.4688)
104.04948 9.60 124 (1.5376)
106.06513 15.72 112 111 (1.5688 0.94975)
120.08078 20.46 118 13 (2.1431 1.134)
122.09643 9.69 12 113 122 121 119 120 123 (1.1789 0.20391 0.04945 0.034661 0.03005 0.029871 0.024778)
126.12773 5.09 103 (0.81508)
165.05194 12.73 17 (2.0401)
167.06759 6.88 82 (1.1022)
209.07815 4.80 202 (0.76823)
245.11454 6.76 59 76 57 (0.78808 0.27452 0.021115)
255.09889 27.23 19 18 77 (2.9124 1.4403 0.0096393)
269.11454 7.64 9 47 78 55 37 (1.1269 0.038264 0.025703 0.017165 0.01641)
271.13019 100.00 10 28 63 39 44 21 48 54 58 79 51 61 56 62 38 43 (9.1473 1.8016 1.4793 0.62951 0.53786 0.5303 0.26718 0.25196 0.2465 0.24032 0.22117 0.15431 0.15339 0.12909 0.11526 0.1148)
295.13019 13.45 188 (2.1552)
297.14584 53.15 97 (8.5146)
299.12510 7.63 225 227 226 (0.53364 0.47818 0.21068)
300.13427 5.29 147 (0.84812)
313.14075 12.25 198 197 (1.3734 0.58939)
317.17205 4.86 200 (0.77873)
327.15640 28.94 95 181 182 207 (1.5095 1.1481 1.1158 0.86253)
343.15131 5.12 100 (0.82008)
367.15131 5.06 235 (0.81096)
385.16188 11.03 162 170 192 234 (1.3084 0.2441 0.14584 0.069434)

0 387.1775296361 Cc1ccc([NH2+]c2nc3c(=O)[nH]c(N)nc3n2C2CC(O)C(CO)O2)c(C)c1
1 369.1669649521 CC1CCC(=[NH+]C2=NC3=CN=C(N)N=C3N2C2C=C(O)C(=C=O)O2)C(C)C1
2 255.1352709001 CC1=CC(C)C=CC1=[NH+]C1=NC2=CN=C(N)N=C2N1
3 117.0546205681 OC1CCOC1=C[OH2+]
4 99.0440558841 C=C1OCC=C1[OH2+]
5 117.0546205681 CCC(O)C(=O)C=[OH+] Intermediate Fragment 
6 99.0440558841 CC=C(O)C#C[OH2+]
7 117.0546205681 O=CCC(O)C=C[OH2+] Intermediate Fragment 
8 115.0389705041 OC1CCOC1=C=[OH+]
9 269.1145354561 [CH2+]C1=CCC(=NC2=NC3=C(O)N=C(N)N=C3N2)C(C)=C1
10 271.1301855201 CC1=CCC(=[NH+]C2=NC3=C(O)N=C(N)N=C3N2)C(C)=C1
11 253.1196208361 [CH2+]C1=CCC(=NC2=NC3=CN=C(N)N=C3N2)C(C)=C1
12 122.0964258041 CC1=CC(C)C=CC1=[NH2+]
13 120.0807757401 C=C1C=CC(=[NH2+])C(C)=C1
14 150.0410361681 [NH3+]C1=NC(=O)C2=NC=NC2=N1
15 107.0855267721 CC1=CC=CC([CH4+])=C1
16 105.0698767081 [CH2+]C1=CC(C)=CC=C1
17 165.0519352001 NC1=NC(=O)C2=NC([NH3+])=NC2=N1
18 255.0988853921 [CH2+]C1=CC=CCC1=NC1=NC2=C(O)N=C(N)N=C2N1
19 255.0988853921 [CH2+]C1=CCC(=NC2=NC3=C(O)N=C(N)N=C3N2)C=C1
20 254.1036364241 [CH2+]C1=CCC(=NC2=NC3=C(O)N=CN=C3N2)C(C)=C1
21 271.1301855201 CC1=CCC(=[NH+]C2=NC(=C=O)C(=NC(=N)N)N2)C(C)=C1 Intermediate Fragment 
22 254.1036364241 CC1=CCC(=NC2=NC(C#[O+])=C(N=C=N)N2)C(C)=C1
23 229.1083874561 CC1=CC(C)C=CC1=NC1=NC(=C=O)C(=[NH2+])N1
24 227.0927373921 C=C1C=CC(=NC2=NC(=C=O)C(=[NH2+])N2)C(C)=C1
25 212.0818383601 C=C1C=CC(=[NH+]C2=NC(=C=O)C=N2)C(C)=C1
26 210.0661882961 [CH+]=C1C=CC(=NC2=NC(=C=O)C=N2)C(C)=C1
27 243.1352709001 CC1=CC(C)C=CC1=NC1=NC(=NC(N)=[NH2+])C=N1
28 271.1301855201 CC1=CCC(=[NH+]C2=NC(=NC(N)=NC=O)C=N2)C(C)=C1 Intermediate Fragment 
29 228.1243718681 C=C1C=CC(=NC2=NC=C([NH+]=CN)N2)C(C)=C1
30 226.1087218041 C=C1C=CC(=NC2=NC=C([NH+]=C=N)N2)C(C)=C1
31 224.0930717401 [CH+]=C1C=CC(=NC2=NC=C(N=C=N)N2)C(C)=C1
32 201.1134728361 CC1=CC(C)C=CC1=NC1=NC(=[NH2+])C=N1
33 199.0978227721 C=C1C=CC(=NC2=NC(=[NH2+])C=N2)C(C)=C1
34 186.1025738041 C=C1C=CC(=[NH+]C2=NC=CN2)C(C)=C1
35 184.0869237401 [CH+]=C1C=CC(=NC2=NC=CN2)C(C)=C1
36 241.1196208361 C=C1C=CC(=NC2=NC(=NC(N)=[NH2+])C=N2)C(C)=C1
37 269.1145354561 CC1=CCC(=NC2=NC(=NC(N)=NC#[O+])C=N2)C(C)=C1
38 271.1301855201 [CH2+]C1=CCC(=NC2=NC(C(=O)N=C(N)N)=CN2)C(C)=C1 Intermediate Fragment 
39 271.1301855201 CC1=CCC(=[NH+]C2=NC(=C(O)N=C=N)C(=N)N2)C(C)=C1 Intermediate Fragment 
40 242.1036364241 C=C1C=CC(=NC2=NC(=N)C(C([NH3+])=O)=N2)C(C)=C1
41 244.1192864881 CC1=CC(C)C=CC1=NC1=NC(=N)C(C([NH3+])=O)=N1
42 225.0770873281 [CH+]=C1C=CC(=NC2=NC(=C=O)C(=N)N2)C(C)=C1
43 271.1301855201 CC1=CCC(=[NH+]C2=NC(C(N)=O)=C(N=C=N)N2)C(C)=C1 Intermediate Fragment 
44 271.1301855201 [CH2+]C1=CCC(=NC(=N)NC2=NC(N)=NC(O)=C2)C(C)=C1 Intermediate Fragment 
45 254.1036364241 [CH2+]C1=CC(C)=C(N=C=NC2=NC(N)=NC(O)=C2)C=C1
46 145.0760247081 C=C1C=CC(=NC#[NH+])C(C)=C1
47 269.1145354561 [CH+]=C1C=CC(=NC(=N)NC2=NC(N)=NC(O)=C2)C(C)=C1
48 271.1301855201 [CH2+]C1=CCC(=NC(N)=NC2=C(O)N=C(N)N=C2)C(C)=C1 Intermediate Fragment 
49 147.0916747721 CC1=CC(C)C=CC1=NC#[NH+]
50 125.0457872001 NC1=NC(=O)C(=[NH2+])C=N1
51 271.1301855201 CC1=CC(C)=C([NH+]=C=NC2=C(O)N=C(N)N=C2N)C=C1 Intermediate Fragment 
52 140.0566862321 NC1=NC(=O)C(=[NH2+])C(N)=N1
53 254.1036364241 [CH2+]C1=CC(C)=C(N=C=NC2=C(O)N=C(N)N=C2)C=C1
54 271.1301855201 CC1=CC(C)=C([NH+]=C=NC2=NC(N)=NC(O)=C2N)C=C1 Intermediate Fragment 
55 269.1145354561 [CH2+]C1=CC(C)=C(N=C=NC2=NC(N)=NC(O)=C2N)C=C1
56 271.1301855201 C=CC(C=CC(=C)C)=[NH+]C1=NC2=C(O)N=C(N)N=C2N1 Intermediate Fragment 
57 245.1145354561 C=C(C)C=CC=[NH+]C1=NC2=C(O)N=C(N)N=C2N1
58 271.1301855201 C=C(C)C(C=C=CC)=[NH+]C1=NC2=C(O)N=C(N)N=C2N1 Intermediate Fragment 
59 245.1145354561 C=CC(=[NH+]C1=NC2=C(O)N=C(N)N=C2N1)C(=C)C
60 243.0988853921 C#CC(=[NH+]C1=NC2=C(O)N=C(N)N=C2N1)C(=C)C
61 271.1301855201 C=CC(=[NH+]C1=NC2=C(O)N=C(N)N=C2N1)C(C)=C=CC Intermediate Fragment 
62 271.1301855201 [CH2+]C(C)=C=C(C)C(C)=NC1=NC2=C(O)N=C(N)N=C2N1 Intermediate Fragment 
63 271.1301855201 C=CC(C)=CC(C)=C=[NH+]C1=NC2=C(O)N=C(N)N=C2N1 Intermediate Fragment 
64 97.1011768361 CCC(C)=C=[CH2+]C
65 175.0362851361 C#[N+]C1=NC2=NC(N)=NC(=O)C2=N1
66 177.0519352001 C=[NH+]C1=NC2=NC(N)=NC(=O)C2=N1
67 179.0675852641 C[NH2+]C1=NC2=NC(N)=NC(=O)C2=N1
68 181.0832353281 C[NH2+]C1N=C2C(=O)N=C(N)N=C2N1
69 203.0675852641 CC=C=[NH+]C1=NC2=NC(N)=NC(=O)C2=N1
70 215.0675852641 [CH2+]C(C)=C=NC1=NC2=NC(N)=NC(=O)C2=N1
71 217.0832353281 CC(C)=C=[NH+]C1=NC2=NC(N)=NC(=O)C2=N1
72 219.0988853921 CC(C)C=[NH+]C1=NC2=NC(N)=NC(=O)C2=N1
73 221.1145354561 CC(C)C[NH2+]C1=NC2=NC(N)=NC(=O)C2=N1
74 241.0832353281 [CH2+]C#CC(C)=C=NC1=NC2=C(O)N=C(N)N=C2N1
75 243.0988853921 CC#CC(C)=C=[NH+]C1=NC2=C(O)N=C(N)N=C2N1
76 245.1145354561 CC=CC(C)=C=[NH+]C1=NC2=C(O)N=C(N)N=C2N1
77 255.0988853921 CC(=C=NC1=NC2=NC(N)=NC(=O)C2=N1)[C+]=C(C)C
78 269.1145354561 C#CC(C)=CC(C)=C=[NH+]C1=NC2=C(O)N=C(N)N=C2N1
79 271.1301855201 CC=C=C(C)C=CC=[NH+]C1=NC2=C(O)N=C(N)N=C2N1 Intermediate Fragment 
80 273.1458355841 CC1=CC(C)CCC1=[NH+]C1=NC2=C(O)N=C(N)N=C2N1
81 275.1614856481 CC1CCC(=[NH+]C2=NC3=C(O)N=C(N)N=C3N2)C(C)C1
82 167.0675852641 NC1=NC(=O)C2=NC([NH3+])NC2=N1
83 277.1771357121 CC1CCC([NH2+]C2=NC3=C(O)N=C(N)N=C3N2)C(C)C1
84 355.1513148881 CC1=CCC(=[NH+]C2=NC3=C(O)N=C(N)N=C3N2C2CC(O)=CO2)C(C)=C1
85 357.1669649521 CC1=CC(C)CCC1=[NH+]C1=NC2=C(O)N=C(N)N=C2N1C1CC(O)=CO1
86 359.1826150161 CC1CCC(=[NH+]C2=NC3=C(O)N=C(N)N=C3N2C2CC(O)=CO2)C(C)C1
87 369.1669649521 C=C1OC(N2C([NH+]=C3CCC(C)C=C3C)=NC3=C(O)N=C(N)N=C32)C=C1O
88 351.1564002681 C=C1C=CC(N2C([NH+]=C3CC=C(C)C=C3C)=NC3=C(O)N=C(N)N=C32)O1
89 124.1120758681 CC1=CC(C)CCC1=[NH2+]
90 250.0934656641 C=C1OC(N2C=NC3=C(O)N=C([NH3+])N=C32)CC1O
91 353.1356648241 C=C1OC(N2C([NH+]=C3CC=CC=C3C)=NC3=C(O)N=C(N)N=C32)C=C1O
92 353.1356648241 C=C1OC(N2C([NH+]=C3C=CC(C)=CC3)=NC3=C(O)N=C(N)N=C32)C=C1O
93 369.1669649521 C=C1OC(N2C(=NC(N)=NC=O)C=NC2=[NH+]C2=C(C)C=C(C)CC2)C=C1O Intermediate Fragment 
94 369.1669649521 CC(=O)C(O)=CCN1C([NH+]=C2CC=C(C)C=C2C)=NC2=C(O)N=C(N)N=C21 Intermediate Fragment 
95 327.1564002681 CC1=CC(C)CCC1=[NH+]C1=NC2=C(O)N=C(N)N=C2N1CC#CO
96 369.1669649521 C=C(C=O)OC(C)N1C([NH+]=C2CC=C(C)C=C2C)=NC2=C(O)N=C(N)N=C21 Intermediate Fragment 
97 297.1458355841 C=CN1C([NH+]=C2CC=C(C)C=C2C)=NC2=C(O)N=C(N)N=C21
98 369.1669649521 C#COC(C=C=O)N1C([NH+]=C2CCC(C)CC2C)=NC2=C(O)N=C(N)N=C21 Intermediate Fragment 
99 369.1669649521 C#CC(O)=CC(=O)N1C([NH+]=C2CCC(C)CC2C)=NC2=C(O)N=C(N)N=C21 Intermediate Fragment 
100 343.1513148881 CC1CCC(=[NH+]C2=NC3=C(O)N=C(N)N=C3N2C(=O)C#CO)C(C)C1
101 369.1669649521 C=C1OC(N2C([NH+]=C=C(C)C=C(C)CC)=NC3=C(O)N=C(N)N=C32)C=C1O Intermediate Fragment 
102 128.1433759961 CC1CCC([NH3+])C(C)C1
103 126.1277259321 CC1CCC(=[NH2+])C(C)C1
104 108.0807757401 CC1=CC=CCC1=[NH2+]
105 108.0807757401 CC1=CCC(=[NH2+])C=C1
106 124.1120758681 CCC(C)C=C(C)C#[NH+] Intermediate Fragment 
107 124.1120758681 CC(=[NH2+])C(C)=C=C(C)C Intermediate Fragment 
108 124.1120758681 CC=C=C(C)C(=[NH2+])CC Intermediate Fragment 
109 124.1120758681 C=C(C)C=CC(=[NH2+])CC Intermediate Fragment 
110 124.1120758681 CC=CC(C)CCC#[NH+] Intermediate Fragment 
111 106.0651256761 [CH2+]C1=CC=CCC1=N
112 106.0651256761 [CH2+]C1=CCC(=N)C=C1
113 122.0964258041 CCC(C)=C=C(C)C#[NH+] Intermediate Fragment 
114 95.0855267721 CC=C(C)C#[CH+]C
115 93.0698767081 C=C=C(C)C#[CH+]C
116 67.0542266441 C#CC(C)=[CH3+]
117 94.0651256761 CC=C=C(C)C#[NH+]
118 120.0807757401 C=CC(C)=C=C(C)C#[NH+]
119 122.0964258041 [CH2+]C(C)=C=C(C)C(C)=N Intermediate Fragment 
120 122.0964258041 C=CC(=[NH2+])C(C)=C=CC Intermediate Fragment 
121 122.0964258041 C=C(C)C(=[NH2+])C=C=CC Intermediate Fragment 
122 122.0964258041 C=CC(=[NH2+])C=CC(=C)C Intermediate Fragment 
123 122.0964258041 CC=C=C(C)CCC#[NH+] Intermediate Fragment 
124 104.0494756121 [CH+]=C1C=CC(=N)C=C1
125 91.0542266441 C#CC(=C)C#[CH+]C
126 118.0651256761 [CH+]=C1C=CC(=N)C(C)=C1
127 264.0727302201 [NH3+]C1=NC(O)=C2N=CN(C3CC(O)C(=C=O)O3)C2=N1
128 266.0883802841 [NH3+]C1=NC(O)=C2N=CN(C3CC(O)C(=CO)O3)C2=N1
129 268.1040303481 [NH3+]C1=NC(O)=C2N=CN(C3CC(O)C(CO)O3)C2=N1
130 268.1040303481 [NH3+]C1=NC(O)=C2N=CN(C(=O)CC(O)CCO)C2=N1 Intermediate Fragment 
131 113.1324769641 CC1CCCC([CH4+])C1
132 109.1011768361 CC1=CCCC([CH4+])=C1
133 275.0523291241 NC1=NC(O)=C2N=C([NH3+])N(C3=CC(=O)C(=C=O)O3)C2=N1
134 279.0836292521 NC1=NC(O)=C2N=C([NH3+])N(C3CC(O)C(=C=O)O3)C2=N1
135 281.0992793161 NC1=NC(O)=C2N=C([NH3+])N(C3CC(O)C(=CO)O3)C2=N1
136 371.1462295081 CC1CCCCC1=[NH+]C1=NC2=C(O)N=C(N)N=C2N1C1C=C(O)C(=C=O)O1
137 371.1462295081 CC1=CCCCC1=[NH+]C1=NC2=C(O)N=C(N)N=C2N1CC=C(O)C(=O)C=O Intermediate Fragment 
138 371.1462295081 CC1CCC(=[NH+]C2=NC3=C(O)N=C(N)N=C3N2C2C=C(O)C(=C=O)O2)CC1
139 257.1145354561 CC1C=CC(=[NH+]C2=NC3=C(O)N=C(N)N=C3N2)C=C1
140 371.1462295081 CC1C=CC(=[NH+]C2=NC3=C(O)N=C(N)N=C3N2CC=C(O)C(=O)C=O)CC1 Intermediate Fragment 
141 371.1462295081 CC1CCC(=[NH+]C2=NC3=C(O)N=C(N)N=C3N2C(=O)C=C(O)C#CO)CC1 Intermediate Fragment 
142 370.1509805401 CC1CCC(=[NH+]C2=NC3=C(O)N=CN=C3N2C2C=C(O)C(=C=O)O2)C(C)C1
143 387.1775296361 CC1CCC([NH2+]C2=NC(=C=O)C(=NC(=N)N)N2C2C=C(O)C(=C=O)O2)C(C)C1 Intermediate Fragment 
144 370.1509805401 CC1=CC(C)CCC1=NC1=NC(C=O)=C([NH+]=CN)N1C1C=C(O)C(=C=O)O1
145 345.1557315721 CC1CCC(NC2=NC(=C=O)C(=[NH2+])N2C2C=C(O)C(=C=O)O2)C(C)C1
146 328.1291824761 CC1=CC(C)CCC1=[NH+]C1=NC(C=O)=CN1C1C=C(O)C(=C=O)O1
147 300.1342678561 CC1=CC(C)CCC1=[NH+]C1=NC=CN1C1C=C(O)C(=C=O)O1
148 387.1775296361 CC1CCC([NH+]=C2N=CC(=NC(N)=NC=O)N2C2C=C(O)C(=C=O)O2)C(C)C1 Intermediate Fragment 
149 344.1717159841 CC1CCC(=NC2=NC=C([NH+]=CN)N2C2C=C(O)C(=C=O)O2)C(C)C1
150 317.1608169521 CC1CCC(N=C2N=CC(=[NH2+])N2C2C=C(O)C(=C=O)O2)C(C)C1
151 344.1717159841 CC1=CC(C)CCC1=NC1=NC=C([NH+]=CN)N1CC=C(O)C(=O)C=O Intermediate Fragment 
152 344.1717159841 CC1CCC(=NC2=NC=C([NH+]=CN)N2C(=O)C=C(O)C#CO)C(C)C1 Intermediate Fragment 
153 342.1560659201 CC1=CC(C)CCC1=NC1=NC=C([NH+]=CN)N1C1C=C(O)C(=C=O)O1
154 342.1560659201 CC1=CCC(=NC2=NC=C([NH+]=CN)N2CC=C(O)C(=O)C=O)C(C)=C1 Intermediate Fragment 
155 340.1404158561 CC1=CCC(=NC2=NC=C([NH+]=CN)N2C2C=C(O)C(=C=O)O2)C(C)=C1
156 299.1502522681 C=C1OC(N2C(=[NH2+])C=NC2=NC2=C(C)C=C(C)CC2)C=C1O
157 299.1502522681 CC1=C(N=C2N=CC(=[NH2+])N2C2C=CC(=C=O)O2)CCC(C)C1
158 317.1608169521 CC1CCC(N=C2N=CC(=[NH2+])N2C(=O)C=C(O)C#CO)C(C)C1 Intermediate Fragment 
159 302.1499179201 CC1CCC(=[NH+]C2=NC=CN2C2C=C(O)C(=C=O)O2)C(C)C1
160 359.1826150161 CC1CCC(N=C2N=CC(=NC(N)=[NH2+])N2C2C=C(O)C(=C=O)O2)C(C)C1
161 359.1826150161 CC1CCC(N=C2N=CC(=NC(N)=[NH2+])N2C(=O)C=C(O)C#CO)C(C)C1 Intermediate Fragment 
162 385.1618795721 CC1=C(N=C2N=CC(=NC(N)=[NH+]C=O)N2C2C=C(O)C(=C=O)O2)CCC(C)C1
163 387.1775296361 CC1CCC(=[NH+]C2=NC(C(=O)N=C(N)N)=CN2C2C=C(O)C(=C=O)O2)C(C)C1 Intermediate Fragment 
164 387.1775296361 CC1CCC(=[NH+]C2=NC(=C(O)N=CN)C(=N)N2C2C=C(O)C(=C=O)O2)C(C)C1 Intermediate Fragment 
165 343.1400815081 CC1CCC(=NC2=NC(=C=O)C(=[NH2+])N2C2C=C(O)C(=C=O)O2)C(C)C1
166 387.1775296361 CC1CCC(=[NH+]C(=N)N(C2=NC(N)=NC(O)=C2)C2C=C(O)C(=C=O)O2)C(C)C1 Intermediate Fragment 
167 370.1509805401 CC1=CC(C)=C(N=C[NH+](C2=NC(N)=NC(O)=C2)C2C=C(O)C(=C=O)O2)CC1
168 241.0931313161 NC1=NC(O)=CC([NH+]=C2CC(O)C(CO)O2)=N1
169 276.1342678561 CC1CCC(=NC(=[NH2+])N=C2C=C(O)C(=C=O)O2)C(C)C1
170 385.1618795721 CC1=CC(C)CCC1=NC(=[NH2+])N(C1=NC(N)=NC(O)=C1)C1C=C(O)C(=C=O)O1
171 387.1775296361 CC1CCC([NH2+]C(=NC2=C(O)N=C(N)N=C2)N=C2C=C(O)C(=C=O)O2)C(C)C1 Intermediate Fragment 
172 127.0614372641 NC1=NC(=O)C([NH3+])C=N1
173 387.1775296361 CC1CCC([NH2+]C=NC2=C(O)N=C(N)N=C2N=C2C=C(O)C(=C=O)O2)C(C)C1 Intermediate Fragment 
174 387.1775296361 CC1=C([NH+]=CN(C2=NC(N)=NC(O)=C2N)C2C=C(O)C(=C=O)O2)CCC(C)C1 Intermediate Fragment 
175 387.1775296361 CC1CCC(=[NH+]C2=NC3=C(O)N=C(N)N=C3N2CC=C(O)C(=O)C=O)C(C)C1 Intermediate Fragment 
176 369.1669649521 CC1=CC(C)CCC1=[NH+]C1=NC2=C(O)N=C(N)N=C2N1CC=C(O)C#CO
177 351.1564002681 C#CC(O)=CCN1C([NH+]=C2CC=C(C)C=C2C)=NC2=C(O)N=C(N)N=C21
178 331.1877003961 CC1CCC([NH2+]C2=NC3=C(O)N=C(N)N=C3N2CC#CO)C(C)C1
179 329.1720503321 CC1CCC(=[NH+]C2=NC3=C(O)N=C(N)N=C3N2CC#CO)C(C)C1
180 311.1614856481 C#CCN1C([NH+]=C2CCC(C)C=C2C)=NC2=C(O)N=C(N)N=C21
181 327.1564002681 CC1=CC(C)=C([NH+]=C2N=CC(=NC(N)=NC=O)N2CC#CO)CC1 Intermediate Fragment 
182 327.1564002681 CCC(C)=CC(C)=C=[NH+]C1=NC2=C(O)N=C(N)N=C2N1CC#CO Intermediate Fragment 
183 325.1407502041 CC1=CCC(=[NH+]C2=NC3=C(O)N=C(N)N=C3N2CC#CO)C(C)=C1
184 63.0440558841 OCC[OH2+]
185 303.1927857761 CCN1C([NH+]=C2CCC(C)CC2C)=NC2=C(O)N=C(N)N=C21
186 301.1771357121 CCN1C([NH+]=C2CCC(C)C=C2C)=NC2=C(O)N=C(N)N=C21
187 299.1614856481 CCN1C([NH+]=C2CC=C(C)C=C2C)=NC2=C(O)N=C(N)N=C21
188 295.1301855201 C#CN1C([NH+]=C2CC=C(C)C=C2C)=NC2=C(O)N=C(N)N=C21
189 91.0389705041 OCC(=[OH+])CO
190 93.0546205681 OCC([OH2+])CO
191 281.1145354561 C=C1C=CC(=NC2=NC3=C(O)N=C(N)N=C3N2[CH2+])C(C)=C1
192 385.1618795721 CC1=CC(C)CCC1=[NH+]C1=NC2=C(O)N=C(N)N=C2N1CC=C(O)C(=O)C=O
193 387.1775296361 C=C(O)C(=C=O)OCN1C([NH+]=C2CCC(C)CC2C)=NC2=C(O)N=C(N)N=C21 Intermediate Fragment 
194 283.1301855201 C=C1C=CC(=[NH+]C2=NC3=C(O)N=C(N)N=C3N2C)C(C)=C1
195 89.0597059481 CC(O)C=C[OH2+]
196 387.1775296361 CC1CCC(=[NH+]C2=NC3=C(O)N=C(N)N=C3N2C(C)OC(=C=O)C=O)C(C)C1 Intermediate Fragment 
197 313.1407502041 CC(=O)N1C([NH+]=C2CC=C(C)C=C2C)=NC2=C(O)N=C(N)N=C21
198 313.1407502041 C=CC(C)=CC(C)=C=[NH+]C1=NC2=C(O)N=C(N)N=C2N1C(C)=O Intermediate Fragment 
199 315.1564002681 CC(=O)N1C([NH+]=C2CCC(C)C=C2C)=NC2=C(O)N=C(N)N=C21
200 317.1720503321 CC(=O)N1C([NH+]=C2CCC(C)CC2C)=NC2=C(O)N=C(N)N=C21
201 319.1877003961 CC(=O)N1C([NH2+]C2CCC(C)CC2C)=NC2=C(O)N=C(N)N=C21
202 209.0781499481 CC(=O)N1C([NH3+])=NC2=C(O)N=C(N)N=C21
203 357.1669649521 CC1=CC(C)CCC1=[NH+]C1=NC2=C(O)N=C(N)N=C2N1C(C)OC#CO
204 359.1826150161 CC1CCC(=[NH+]C2=NC3=C(O)N=C(N)N=C3N2C(C)OC#CO)C(C)C1
205 387.1775296361 CC1CCC([NH2+]C2=NC3=C(O)N=C(N)N=C3N2C(C=C=O)OC#CO)C(C)C1 Intermediate Fragment 
206 345.1669649521 CC1CCC([NH2+]C2=NC3=C(O)N=C(N)N=C3N2C(=O)C#CO)C(C)C1
207 327.1564002681 C#CC(=O)N1C([NH+]=C2CCC(C)CC2C)=NC2=C(O)N=C(N)N=C21
208 387.1775296361 CC1CCC([NH2+]C2=NC3=C(O)N=C(N)N=C3N2C(=O)C=C(O)C#CO)C(C)C1 Intermediate Fragment 
209 341.1356648241 CC1=CC(C)CCC1=[NH+]C1=NC2=C(O)N=C(N)N=C2N1C(=O)C#CO
210 323.1251001401 CC1=CCC(=NC2=NC3=C(O)N=C(N)N=C3N2[CH+]C#CO)C(C)=C1
211 45.0334912001 C=C[OH2+]
212 47.0491412641 CC[OH2+]
213 29.0385765801 C=[CH3+]
214 311.1251001401 [CH2+]C(=O)N1C(N=C2CC=C(C)C=C2C)=NC2=C(O)N=C(N)N=C21
215 68.9971056921 [O+]#CC#CO
216 41.0021910721 [C+]#CO
217 71.0127557561 O=CC#C[OH2+]
218 43.0178411361 C#C[OH2+]
219 73.0284058201 OCC#C[OH2+]
220 55.0178411361 C#CC=[OH+]
221 75.0440558841 OCC=C[OH2+]
222 57.0334912001 C#CC[OH2+]
223 303.1564002681 CC1CCC(=[NH+]C2=NC3=C(O)N=C(N)N=C3N2C=O)C(C)C1
224 301.1407502041 CC1=CC(C)CCC1=[NH+]C1=NC2=C(O)N=C(N)N=C2N1C=O
225 299.1251001401 CC1=CCC(=[NH+]C2=NC3=C(O)N=C(N)N=C3N2C=O)C(C)=C1
226 299.1251001401 CC1=CC(C)=C([NH+]=C2N=CC(=NC(N)=NC=O)N2C=O)C=C1 Intermediate Fragment 
227 299.1251001401 C=CC(C)=CC(C)=C=[NH+]C1=NC2=C(O)N=C(N)N=C2N1C=O Intermediate Fragment 
228 297.1094500761 CC1=CCC(=NC2=NC3=C(O)N=C(N)N=C3N2C#[O+])C(C)=C1
229 87.0440558841 CC(O)C#C[OH2+]
230 69.0334912001 C=CC#C[OH2+]
231 91.0753560121 CC(O)CC[OH2+]
232 73.0647913281 C=CC(C)[OH2+]
233 73.0647913281 CCC=C[OH2+]
234 385.1618795721 CC1CCC(=[NH+]C2=NC3=C(O)N=C(N)N=C3N2C(=O)C=C(O)C#CO)C(C)C1
235 367.1513148881 CC1=CCC(=[NH+]C2=NC3=C(O)N=C(N)N=C3N2CC=C(O)C#CO)C(C)=C1
236 387.1775296361 CCC(CCC(C)C)=[NH+]C1=NC2=C(O)N=C(N)N=C2N1C1C=C(O)C(=C=O)O1 Intermediate Fragment 
237 357.1305794441 C=C(C)CCC=[NH+]C1=NC2=C(O)N=C(N)N=C2N1C1C=C(O)C(=C=O)O1
238 359.1462295081 CC(C)CCC=[NH+]C1=NC2=C(O)N=C(N)N=C2N1C1C=C(O)C(=C=O)O1
239 361.1618795721 CC(C)CCC[NH2+]C1=NC2=C(O)N=C(N)N=C2N1C1C=C(O)C(=C=O)O1
240 371.1462295081 CC=CCC(CC)=[NH+]C1=NC2=C(O)N=C(N)N=C2N1C1C=C(O)C(=C=O)O1
241 345.1305794441 CCC(CC)=[NH+]C1=NC2=C(O)N=C(N)N=C2N1C1C=C(O)C(=C=O)O1
242 343.1149293801 C=CC(CC)=[NH+]C1=NC2=C(O)N=C(N)N=C2N1C1C=C(O)C(=C=O)O1
243 321.1305794441 CCC[NH2+]C1=NC2=C(O)N=C(N)N=C2N1C1CC(O)C(=C=O)O1
244 321.1305794441 CCC[NH2+]C1=NC2=C(O)N=C(N)N=C2N1C(=O)CC(O)C#CO Intermediate Fragment 
245 319.1149293801 CCC[NH2+]C1=NC2=C(O)N=C(N)N=C2N1C1C=C(O)C(=C=O)O1
246 317.0992793161 CCC=[NH+]C1=NC2=C(O)N=C(N)N=C2N1C1C=C(O)C(=C=O)O1
247 315.0836292521 CC=C=[NH+]C1=NC2=C(O)N=C(N)N=C2N1C1C=C(O)C(=C=O)O1
248 387.1775296361 CCCCC(=[NH+]C1=NC2=C(O)N=C(N)N=C2N1C1C=C(O)C(=C=O)O1)C(C)C Intermediate Fragment 
249 345.1305794441 CCCCC=[NH+]C1=NC2=C(O)N=C(N)N=C2N1C1C=C(O)C(=C=O)O1
250 231.0988853921 CC#CCC=[NH+]C1=NC2=C(O)N=C(N)N=C2N1
251 347.1462295081 CCCCC[NH2+]C1=NC2=C(O)N=C(N)N=C2N1C1C=C(O)C(=C=O)O1
252 347.1462295081 CCCCC[NH2+]C1=NC2=C(O)N=C(N)N=C2N1C(=O)C=C(O)C#CO Intermediate Fragment 
253 361.1618795721 CCC([NH2+]C1=NC2=C(O)N=C(N)N=C2N1C1C=C(O)C(=C=O)O1)C(C)C
254 361.1618795721 CCC([NH2+]C1=NC2=C(O)N=C(N)N=C2N1C(=O)C=C(O)C#CO)C(C)C Intermediate Fragment 
255 359.1462295081 CCC(=[NH+]C1=NC2=C(O)N=C(N)N=C2N1C1C=C(O)C(=C=O)O1)C(C)C
256 357.1305794441 C=C(C)C(CC)=[NH+]C1=NC2=C(O)N=C(N)N=C2N1C1C=C(O)C(=C=O)O1
257 347.1462295081 CC(C)C(C)[NH2+]C1=NC2=C(O)N=C(N)N=C2N1C1C=C(O)C(=C=O)O1
258 231.0988853921 C=C(C)C(C)=[NH+]C1=NC2=NC(N)=NC(=O)C2=N1
259 347.1462295081 CC(C)C(C)[NH2+]C1=NC2=C(O)N=C(N)N=C2N1C(=O)C=C(O)C#CO Intermediate Fragment 
260 345.1305794441 CC(=[NH+]C1=NC2=C(O)N=C(N)N=C2N1C1C=C(O)C(=C=O)O1)C(C)C
261 343.1149293801 C=C(C)C(C)=[NH+]C1=NC2=C(O)N=C(N)N=C2N1C1C=C(O)C(=C=O)O1
262 337.1618795721 CC(C)C[NH2+]C1=NC2=C(O)N=C(N)N=C2N1C1CC(O)C(=CO)O1
263 335.1462295081 CC(C)C[NH2+]C1=NC2=C(O)N=C(N)N=C2N1C1CC(O)C(=C=O)O1
264 333.1305794441 CC(C)C[NH2+]C1=NC2=C(O)N=C(N)N=C2N1C1C=C(O)C(=C=O)O1
265 331.1149293801 CC(C)C=[NH+]C1=NC2=C(O)N=C(N)N=C2N1C1C=C(O)C(=C=O)O1
266 387.1775296361 CCCC(C)C(CC)=[NH+]C1=NC2=C(O)N=C(N)N=C2N1C1C=C(O)C(=C=O)O1 Intermediate Fragment 
267 387.1775296361 CC(=[NH+]C1=NC2=C(O)N=C(N)N=C2N1C1C=C(O)C(=C=O)O1)C(C)CC(C)C Intermediate Fragment 
268 307.1149293801 CC[NH2+]C1=NC2=C(O)N=C(N)N=C2N1C1CC(O)C(=C=O)O1
269 307.1149293801 CC[NH2+]C1=NC2=C(O)N=C(N)N=C2N1C(=O)CC(O)C#CO Intermediate Fragment 
270 387.1775296361 CCC(C)CC(C)C=[NH+]C1=NC2=C(O)N=C(N)N=C2N1C1C=C(O)C(=C=O)O1 Intermediate Fragment 
271 99.1168269001 CCC(C)C=[CH2+]C
272 357.1305794441 CCCC(C)=C=[NH+]C1=NC2=C(O)N=C(N)N=C2N1C1C=C(O)C(=C=O)O1
273 359.1462295081 CCCC(C)C=[NH+]C1=NC2=C(O)N=C(N)N=C2N1C1C=C(O)C(=C=O)O1
274 361.1618795721 CCCC(C)C[NH2+]C1=NC2=C(O)N=C(N)N=C2N1C1C=C(O)C(=C=O)O1
275 387.1775296361 CCCC(C)CCC=[NH+]C1=NC2=C(O)N=C(N)N=C2N1C1C=C(O)C(=C=O)O1 Intermediate Fragment 
