#In-silico ESI-MS/MS [M+H]+ Spectra
#PREDICTED BY CFM-ID 4.0.8
#SMILES=O1[C@H](CO)[C@@H](C[C@@H]1n1ccc(nc1=O)NCCCCO)O
#InChiKey=DMIBUDQDBFBNHW-CKYFFXLPSA-N
energy0
55.05423 18.50 120 (6.3039)
73.06479 12.75 29 201 (4.3427 0.0014396)
112.05054 13.11 31 (4.4663)
152.08184 28.43 42 (9.6835)
166.09749 16.58 44 22 (5.5969 0.051926)
184.10805 100.00 3 49 45 68 52 65 66 (32.986 0.6191 0.19041 0.15231 0.097609 0.014241 0.0072064)
300.15540 54.52 0 217 136 210 216 234 212 235 233 230 (17.278 0.80863 0.32147 0.069478 0.03887 0.021089 0.014901 0.011117 0.0084014 0.00029279)
energy1
55.05423 31.38 120 (3.67)
57.03349 9.37 90 (1.096)
59.04914 8.29 89 (0.96897)
72.08078 13.52 94 (1.5816)
73.06479 12.02 29 201 (1.2665 0.13941)
99.04406 10.92 85 80 81 (0.9904 0.19832 0.08871)
112.05054 67.95 31 (7.9467)
124.05054 100.00 35 (11.694)
126.06619 13.02 36 (1.523)
128.08184 12.17 37 (1.4235)
138.06619 80.01 40 (9.3568)
140.08184 13.18 41 (1.5417)
141.10224 9.76 47 (1.1412)
150.06619 9.82 72 (1.1482)
152.08184 36.58 42 (4.2778)
166.09749 36.43 44 22 (4.0489 0.21086)
182.09240 20.32 7 48 156 64 75 (1.8125 0.23684 0.1683 0.12326 0.03587)
184.10805 89.96 3 45 52 49 68 66 65 (9.6403 0.44177 0.17286 0.15253 0.055206 0.051283 0.0056799)
208.10805 8.42 165 164 (0.90057 0.084282)
210.12370 31.93 158 157 (3.6202 0.11323)
226.11862 20.20 141 166 167 (2.2133 0.13711 0.011855)
228.13427 8.99 140 159 162 160 161 (0.93609 0.03785 0.031847 0.031187 0.013845)
236.10297 11.44 147 13 148 146 (0.61786 0.47168 0.21943 0.029422)
238.11862 19.36 143 144 (1.3562 0.90745)
240.13427 15.29 204 138 (1.3388 0.44868)
energy2
43.01784 11.04 171 (0.89984)
45.03349 22.38 83 (1.8246)
55.05423 15.30 120 (1.2473)
57.03349 69.65 90 (5.6788)
59.04914 18.44 89 (1.5032)
70.06513 9.29 96 (0.75748)
71.04914 27.35 199 30 (1.1697 1.0603)
72.08078 19.21 94 (1.5664)
73.06479 16.05 29 201 (1.0761 0.23214)
97.03964 25.13 26 (2.0489)
112.05054 40.18 31 (3.2758)
112.07569 12.39 56 (1.0105)
124.05054 80.42 35 (6.5566)
125.07094 15.89 110 (1.2956)
126.06619 23.65 36 (1.9283)
138.06619 62.17 40 (5.0688)
139.08659 12.70 46 (1.0358)
154.06110 12.38 124 183 (0.82778 0.18138)
164.08184 25.07 73 69 (1.545 0.49935)
166.09749 100.00 44 22 (7.8697 0.28337)
182.09240 21.89 64 156 7 48 75 (0.67219 0.46342 0.31926 0.2343 0.095343)
184.10805 63.53 52 3 66 45 49 68 65 (2.2609 1.3084 0.63486 0.60059 0.14619 0.13064 0.098066)
186.12370 28.15 6 (2.2947)
194.09240 30.33 187 186 (2.0903 0.38268)
196.10805 26.03 178 177 (1.8494 0.27254)
210.12370 32.59 158 157 (2.3331 0.32415)
214.15500 9.96 214 (0.81184)
216.17065 9.96 215 (0.81184)
240.13427 23.61 204 138 (1.9048 0.020093)
264.13427 10.32 207 203 206 14 15 (0.30585 0.28614 0.17414 0.058907 0.016493)

0 300.1553972241 O=c1nc([NH2+]CCCCO)ccn1C1CC(O)C(CO)O1
1 268.1291824761 OCCCC[NH2+]C1=NC(O)N(C2=CC(O)=CO2)C=C1
2 270.1448325401 OCCCC[NH2+]C1C=CN(C2=CC(O)=CO2)C(O)N1
3 184.1080531081 OCCCC[NH2+]C1=CC=NC(O)=N1
4 272.1604826041 OCCCC[NH2+]C1CCN(C2=CC(O)=CO2)C(O)N1
5 282.1448325401 C=C1OC(N2C=CC([NH2+]CCCCO)=NC2O)C=C1O
6 186.1237031721 OCCCC[NH2+]C1=CC=NC(O)N1
7 182.0924030441 OCCCC=[NH+]C1=CC=NC(O)=N1
8 180.0767529801 OCCC=C=[NH+]C1=CC=NC(O)=N1
9 193.0607685681 C=C1OC(N2C=CC=NC2=[OH+])C=C1O
10 195.0764186321 C=C1OC(N2C=CC=NC2[OH2+])C=C1O
11 197.0920686961 C=C1OC(N2C=CCNC2[OH2+])C=C1O
12 210.0873176641 C=C1OC(N2C=CC([NH3+])=NC2O)C=C1O
13 236.1029677281 C=C1OC(N2C=CC([NH2+]CC)=NC2=O)C=C1O
14 264.1342678561 C=C1OC(N2C=CC([NH2+]CCCC)=NC2=O)C=C1O
15 264.1342678561 C=C1C=CC(N2C=CC([NH2+]CCCCO)=NC2=O)O1
16 282.1448325401 C=C(CO)OC(=C)N1C=CC([NH2+]CCCCO)=NC1=O Intermediate Fragment 
17 282.1448325401 CC(=O)C(O)=C=CN1C=CC([NH2+]CCCCO)=NC1O Intermediate Fragment 
18 282.1448325401 C=C1OC(=NC=C=C(NCO)[NH2+]CCCCO)C=C1O Intermediate Fragment 
19 190.1550033001 OCCCC[NH2+]C1CCNC(O)N1
20 90.0913404241 [NH3+]CCCCO
21 188.1393532361 OCCCC[NH2+]C1CC=NC(O)N1
22 166.0974884241 OCCCC=[NH+]C1=CC=NC=N1
23 88.0756903601 [NH2+]=CCCCO
24 86.0600402961 [NH+]#CCCCO
25 82.0287401681 [NH+]#CC#CCO
26 97.0396392001 [OH2+]C1=NC=CC=N1
27 99.0552892641 [OH2+]C1N=CC=CN1
28 101.0709393281 [OH2+]C1N=CCCN1
29 73.0647913281 C=CCC[OH2+]
30 71.0491412641 C#CCC[OH2+]
31 112.0505382321 [NH3+]C1=CC=NC(O)=N1
32 114.0661882961 [NH3+]C1=CC=NC(O)N1
33 116.0818383601 [NH3+]C1CC=NC(O)N1
34 118.0974884241 [NH3+]C1CCNC(O)N1
35 124.0505382321 C=[NH+]C1=CC=NC(O)=N1
36 126.0661882961 C[NH2+]C1=CC=NC(O)=N1
37 128.0818383601 C[NH2+]C1=CC=NC(O)N1
38 130.0974884241 C[NH2+]C1CC=NC(O)N1
39 132.1131384881 C[NH2+]C1CCNC(O)N1
40 138.0661882961 CC=[NH+]C1=CC=NC(O)=N1
41 140.0818383601 CC[NH2+]C1=CC=NC(O)=N1
42 152.0818383601 CCC=[NH+]C1=CC=NC(O)=N1
43 154.0974884241 CCC[NH2+]C1=CC=NC(O)=N1
44 166.0974884241 CCCC=[NH+]C1=CC=NC(O)=N1
45 184.1080531081 N=C=C=C(N=CO)[NH2+]CCCCO Intermediate Fragment 
46 139.0865893921 [NH+]#CC#CNCCCCO
47 141.1022394561 [NH+]#CC=CNCCCCO
48 182.0924030441 [NH+]#CC=C(N=C=O)NCCCCO
49 184.1080531081 NC(=C=C=NC=O)[NH2+]CCCCO Intermediate Fragment 
50 167.0815040121 O=C[NH+]=C=C=C=NCCCCO
51 156.1131384881 [NH+]#CC=C(N)NCCCCO
52 184.1080531081 N=C(O)N=C=C=C[NH2+]CCCCO Intermediate Fragment 
53 124.0756903601 C#CC=[NH+]C=CCCO
54 122.0600402961 C#CC=[NH+]C#CCCO
55 114.0913404241 C#C[NH2+]CCCCO
56 112.0756903601 C#C[NH+]=CCCCO
57 110.0600402961 C#C[NH+]=C=CCCO
58 108.0443902321 C#C[NH+]=C=C=CCO
59 100.0756903601 C=[NH+]C=CCCO
60 98.0600402961 C=[NH+]C#CCCO
61 96.0443902321 C=[NH+]C#CC=CO
62 85.0396392001 C=C=[NH+]C(=N)O
63 137.0709393281 [NH+]#CC#CN=CCCCO
64 182.0924030441 N=C(O)[NH+]=C=C=C=NCCCCO
65 184.1080531081 C=C=NC(=O)N=C[NH2+]CCCCO Intermediate Fragment 
66 184.1080531081 C=NC(O)=NC(=C)[NH+]=CCCCO Intermediate Fragment 
67 129.1022394561 C=C([NH3+])N=CCCCO
68 184.1080531081 C=C=C(N=C(N)O)[NH+]=CCCCO Intermediate Fragment 
69 164.0818383601 OCCC=C=[NH+]C1=CC=NC=N1
70 122.0348881681 C#[N+]C1=CC=NC(O)=N1
71 136.0505382321 C=C=[NH+]C1=CC=NC(O)=N1
72 150.0661882961 CC=C=[NH+]C1=CC=NC(O)=N1
73 164.0818383601 CCC=C=[NH+]C1=CC=NC(O)=N1
74 165.0658539481 O=C[NH+]=C=C=C=NC=CCCO
75 182.0924030441 C=NC(O)=NC(=C)[NH+]=C=CCCO Intermediate Fragment 
76 155.0815040121 C=C(N=CCCCO)[NH+]=C=O
77 115.0389705041 OC1CCOC1=C=[OH+]
78 117.0546205681 OC1CCOC1=C[OH2+]
79 89.0597059481 [OH2+]C1CCOC1
80 99.0440558841 C=C1OCC=C1[OH2+]
81 99.0440558841 [OH+]=C=C1CCCO1
82 117.0546205681 OCCC(O)C#C[OH2+] Intermediate Fragment 
83 45.0334912001 C=C[OH2+]
84 89.0597059481 CC(O)C=C[OH2+]
85 99.0440558841 CC=C(O)C#C[OH2+]
86 117.0546205681 OCCCOC#C[OH2+] Intermediate Fragment 
87 117.0546205681 CCOC(=C=[OH+])CO Intermediate Fragment 
88 117.0546205681 CCC(O)C(=O)C=[OH+] Intermediate Fragment 
89 59.0491412641 CC=C[OH2+]
90 57.0334912001 CC#C[OH2+]
91 61.0284058201 OCC=[OH+]
92 119.0702706321 OC1CCOC1C[OH2+]
93 119.0702706321 OCCC(O)C=C[OH2+] Intermediate Fragment 
94 72.0807757401 CCCC=[NH2+]
95 56.0494756121 CCC#[NH+]
96 70.0651256761 CCCC#[NH+]
97 211.0713332521 OC1=CC(N2C=CCNC2O)OC1=C=[OH+]
98 181.0607685681 OC1=COC(N2C=CC=NC2[OH2+])=C1
99 193.0607685681 OC1N=CC=CN1C1C=CC(=C=[OH+])O1
100 211.0713332521 OC(=C=C(O)N1C=CCNC1O)C#C[OH2+] Intermediate Fragment 
101 211.0713332521 C=C(OC(=C=[OH+])CO)N1C=CC=NC1O Intermediate Fragment 
102 139.0502038841 C=C([OH2+])N1C=CC=NC1=O
103 121.0396392001 C#CN1C=CC=NC1=[OH+]
104 211.0713332521 O=C(C=[OH+])C(O)=C=CN1C=CCNC1O Intermediate Fragment 
105 193.0607685681 OC(=C=CN1C=CC=NC1O)C#C[OH2+]
106 155.0815040121 OC#CCN1C=CCNC1[OH2+]
107 153.0658539481 OC#CCN1C=CC=NC1[OH2+]
108 151.0502038841 OC#CCN1C=CC=NC1=[OH+]
109 127.0865893921 C#CN1CCCNC1[OH2+]
110 125.0709393281 C#CN1C=CCNC1[OH2+]
111 123.0552892641 C#CN1C=CC=NC1[OH2+]
112 211.0713332521 C=C=CN(C(N)O)C1C=C(O)C(=C=[OH+])O1 Intermediate Fragment 
113 211.0713332521 NC=C=CN(CO)C1C=C(O)C(=C=[OH+])O1 Intermediate Fragment 
114 213.0869833161 OC1=CC(N2CCCNC2O)OC1=C=[OH+]
115 213.0869833161 OC(=C=C(O)N1CCCNC1O)C#C[OH2+] Intermediate Fragment 
116 75.0440558841 OCC=C[OH2+]
117 215.1026333801 OC1CC(N2CCCNC2O)OC1=C=[OH+]
118 217.1182834441 OC1CC(N2CCCNC2O)OC1=C[OH2+]
119 219.1339335081 OC1CC(N2CCCNC2O)OC1C[OH2+]
120 55.0542266441 [CH2+]#CCC
121 228.0978823481 [NH3+]C1CCN(C2C=C(O)C(=C=O)O2)C(O)N1
122 210.0873176641 [NH3+]C1C=CN(C2C=CC(=C=O)O2)C(O)N1
123 228.0978823481 [NH3+]C1CCN(C(O)=C=C(O)C#CO)C(O)N1 Intermediate Fragment 
124 154.0611029161 C=C(O)N1C=CC([NH3+])=NC1=O
125 230.1135324121 [NH3+]C1CCN(C2CC(O)C(=C=O)O2)C(O)N1
126 232.1291824761 [NH3+]C1CCN(C2CC(O)C(=CO)O2)C(O)N1
127 234.1448325401 [NH3+]C1CCN(C2CC(O)C(CO)O2)C(O)N1
128 240.0978823481 C[NH2+]C1C=CN(C2C=C(O)C(=C=O)O2)C(O)N1
129 246.1448325401 C[NH2+]C1CCN(C2CC(O)C(=CO)O2)C(O)N1
130 248.1604826041 C[NH2+]C1CCN(C2CC(O)C(CO)O2)C(O)N1
131 254.1135324121 CC[NH2+]C1C=CN(C2C=C(O)C(=C=O)O2)C(O)N1
132 256.1291824761 CC[NH2+]C1CCN(C2C=C(O)C(=C=O)O2)C(O)N1
133 282.1448325401 CCCC[NH2+]C1C=CN(C2C=C(O)C(=C=O)O2)C(O)N1
134 168.1131384881 CCCC[NH2+]C1=CC=NC(O)=N1
135 282.1448325401 CCCC[NH2+]C1C=CN(C=C=C(O)C(=O)C=O)C(O)N1 Intermediate Fragment 
136 300.1553972241 OC#CC(O)=C=C(O)N1CCC([NH2+]CCCCO)NC1O Intermediate Fragment 
137 258.1448325401 OC#CC(O)N1C=CC([NH2+]CCCCO)NC1O
138 240.1342678561 C#CC(O)N1C=CC([NH2+]CCCCO)=NC1O
139 256.1291824761 OC#CC(O)N1C=CC([NH2+]CCCCO)=NC1O
140 228.1342678561 C=C(O)N1C=CC([NH2+]CCCCO)=NC1O
141 226.1186177921 C=C(O)N1C=CC([NH2+]CCCCO)=NC1=O
142 212.1029677281 O=C1N=C([NH+]=CCCCO)C=CN1CO
143 238.1186177921 C#CC(O)N1C=CC([NH2+]CCCCO)=NC1=O
144 238.1186177921 O=C1N=C([NH2+]CCCCO)C=CN1CC#CO
145 254.1135324121 O=C1N=C([NH2+]CCCCO)C=CN1C(O)C#CO
146 236.1029677281 CCCC=[NH+]C1=NC(=O)N(C(O)C#CO)C=C1
147 236.1029677281 C#CC(O)N1C=CC([NH+]=CCCCO)=NC1=O
148 236.1029677281 O=C1N=C([NH+]=CCCCO)C=CN1CC#CO
149 254.1135324121 OC#CC(O)=NC=C=C(N=CO)[NH2+]CCCCO Intermediate Fragment 
150 47.0491412641 CC[OH2+]
151 232.1655679841 C=C(O)N1CCC([NH2+]CCCCO)NC1O
152 230.1499179201 C=C(O)N1C=CC([NH2+]CCCCO)NC1O
153 141.0658539481 C=C([OH2+])N1C=CC=NC1O
154 160.1080531081 C=C(O)N1CCC([NH3+])NC1O
155 168.0767529801 C=C(O)N1C=CC([NH2+]C)=NC1=O
156 182.0924030441 C=C(O)N1C=CC([NH2+]CC)=NC1=O
157 210.1237031721 C=C(O)N1C=CC([NH2+]CCCC)=NC1=O
158 210.1237031721 C#CN1C=CC([NH2+]CCCCO)=NC1O
159 228.1342678561 C=C(O)N=C=C=C(NCO)[NH2+]CCCCO Intermediate Fragment 
160 228.1342678561 C=C(O)N(C=O)C=C=C(N)[NH2+]CCCCO Intermediate Fragment 
161 228.1342678561 C=C(O)N(C=C=C[NH2+]CCCCO)C(=N)O Intermediate Fragment 
162 228.1342678561 C=C(N=C(O)N(C)C(=C)O)[NH+]=CCCCO Intermediate Fragment 
163 180.0767529801 C=C(O)N1C=CC([NH+]=CC)=NC1=O
164 208.1080531081 C=C(O)N1C=CC([NH+]=CCCC)=NC1=O
165 208.1080531081 C#CN1C=CC([NH2+]CCCCO)=NC1=O
166 226.1186177921 C=C(O)N=C=C=C(N=CO)[NH2+]CCCCO Intermediate Fragment 
167 226.1186177921 C=C(N=C(O)N(C)C(=C)O)[NH+]=C=CCCO Intermediate Fragment 
168 224.1029677281 C=C(O)N1C=CC([NH+]=CCCCO)=NC1=O
169 68.9971056921 [O+]#CC#CO
170 71.0127557561 O=CC#C[OH2+]
171 43.0178411361 C#C[OH2+]
172 73.0284058201 OCC#C[OH2+]
173 55.0178411361 C#CC=[OH+]
174 77.0597059481 OCCC[OH2+]
175 216.1342678561 OCCCC[NH2+]C1=NC(O)N(CO)C=C1
176 214.1186177921 O=C1N=C([NH2+]CCCCO)C=CN1CO
177 196.1080531081 CCCC=[NH+]C1=NC(=O)N(CO)C=C1
178 196.1080531081 CN1C=CC([NH+]=CCCCO)=NC1=O
179 123.0189037561 O=C1N=CC=CN1C#[O+]
180 125.0345538201 O=C1N=CC=CN1C=[OH+]
181 140.0454528521 [NH3+]C1=NC(=O)N(C=O)C=C1
182 152.0454528521 C=[NH+]C1=NC(=O)N(C=O)C=C1
183 154.0611029161 C=[NH+]C1=NC(=O)N(CO)C=C1
184 166.0611029161 C=C=[NH+]C1=NC(=O)N(CO)C=C1
185 168.0767529801 CC=[NH+]C1=NC(=O)N(CO)C=C1
186 194.0924030441 CCC=C=[NH+]C1=NC(=O)N(CO)C=C1
187 194.0924030441 CN1C=CC([NH+]=C=CCCO)=NC1=O
188 212.1029677281 O=C=NC(=C=CN=CO)[NH2+]CCCCO Intermediate Fragment 
189 169.0971540761 OC=[NH+]C#CC=NCCCCO
190 212.1029677281 N=C(O)N(C=C=C=[NH+]C=CCCO)CO Intermediate Fragment 
191 126.0913404241 C#CC=[NH+]CCCCO
192 212.1029677281 C=CN(CO)C(=O)N=C=[NH+]C=CCCO Intermediate Fragment 
193 212.1029677281 C=C(N=C(O)N(C)CO)[NH+]=C=C=CCO Intermediate Fragment 
194 210.0873176641 O=C1N=C([NH+]=C=CCCO)C=CN1CO
195 192.0767529801 CN1C=CC([NH+]=C=C=CCO)=NC1=O
196 87.0440558841 CC(O)C#C[OH2+]
197 69.0334912001 C#CC(=C)[OH2+]
198 69.0334912001 C=CC#C[OH2+]
199 71.0491412641 C#CC(C)[OH2+]
200 91.0753560121 CC(O)CC[OH2+]
201 73.0647913281 C=CC(C)[OH2+]
202 282.1448325401 OC#CC(O)=C=CN1C=CC([NH2+]CCCCO)NC1O
203 264.1342678561 C#CC(O)=C=CN1C=CC([NH2+]CCCCO)=NC1O
204 240.1342678561 OC#CCN1C=CC([NH2+]CCCCO)=NC1O
205 195.0764186321 OC(=C=CN1C=CCNC1O)C#C[OH2+]
206 264.1342678561 CCCC[NH2+]C1=NC(O)N(C=C=C(O)C#CO)C=C1
207 264.1342678561 OC#CC#CCN1C=CC([NH2+]CCCCO)=NC1O
208 282.1448325401 OC#CC(O)=C=C=NC=CC(NCO)[NH2+]CCCCO Intermediate Fragment 
209 298.1397471601 OC#CC(O)=C=C(O)N1C=CC([NH2+]CCCCO)NC1O
210 300.1553972241 OC#COC(=C=CO)N1CCC([NH2+]CCCCO)NC1O Intermediate Fragment 
211 270.1448325401 C=C(OC#CO)N1C=CC([NH2+]CCCCO)NC1O
212 300.1553972241 C=C(OC(=C=O)CO)N1C=CC([NH2+]CCCCO)NC1O Intermediate Fragment 
213 212.1393532361 C#CN1C=CC([NH2+]CCCCO)NC1O
214 214.1550033001 C#CN1CCC([NH2+]CCCCO)NC1O
215 216.1706533641 C=CN1CCC([NH2+]CCCCO)NC1O
216 300.1553972241 C=C(O)C(=C=O)OCN1C=CC([NH2+]CCCCO)NC1O Intermediate Fragment 
217 300.1553972241 O=CC(=O)C(O)=C=CN1CCC([NH2+]CCCCO)NC1O Intermediate Fragment 
218 244.1655679841 OC#CCN1CCC([NH2+]CCCCO)NC1O
219 242.1499179201 OC#CCN1C=CC([NH2+]CCCCO)NC1O
220 224.1393532361 C#CCN1C=CC([NH2+]CCCCO)=NC1O
221 59.0127557561 O=C=C[OH2+]
222 41.0021910721 [CH+]=C=O
223 63.0440558841 OCC[OH2+]
224 89.0233204401 O=CC(=[OH+])CO
225 91.0389705041 OCC(=[OH+])CO
226 93.0546205681 OCC([OH2+])CO
227 200.1393532361 CN1C=CC([NH2+]CCCCO)=NC1O
228 198.1237031721 CN1C=CC([NH2+]CCCCO)=NC1=O
229 298.1397471601 O=CC(=O)C(O)=C=CN1C=CC([NH2+]CCCCO)NC1O
230 300.1553972241 C=C(NC(O)N(C)C1C=C(O)C(=C=O)O1)[NH2+]CCCCO Intermediate Fragment 
231 172.0604342201 C[NH+](CO)C1C=C(O)C(=C=O)O1
232 146.0811696641 C[NH2+]C1CC(O)C(=CO)O1
233 300.1553972241 NC(O)N(C=CC[NH2+]CCCCO)C1C=C(O)C(=C=O)O1 Intermediate Fragment 
234 300.1553972241 NC(C=CN(CO)C1C=C(O)C(=C=O)O1)[NH2+]CCCCO Intermediate Fragment 
235 300.1553972241 O=C=C1OC(=NCCC(NCO)[NH2+]CCCCO)C=C1O Intermediate Fragment 
236 175.1441042681 C=CC(NCCCCO)[NH2+]CO
237 173.1284542041 C#CC(NCCCCO)[NH2+]CO
238 255.1339335081 O=C=C1OC(=[NH+]CCCNCCCCO)C=C1O
239 257.1495835721 O=C=C1OC([NH2+]CCCNCCCCO)C=C1O
240 270.1448325401 NC(CC[NH+]=C1C=C(O)C(=C=O)O1)NCCCCO
241 272.1604826041 NC(CC[NH2+]C1C=C(O)C(=C=O)O1)NCCCCO
