#In-silico ESI-MS/MS [M+H]+ Spectra
#PREDICTED BY CFM-ID 4.0.8
#SMILES=n1cnc2c(c1N)[n+](cn2[C@H]1C[C@H]([C@H](O1)CO)O)C(=O)O
#InChiKey=IZVKYTNEXXXYDS-FSDSQADBSA-O
energy0
162.04104 36.54 11 (10.644)
164.05669 48.70 23 (14.186)
180.05160 86.35 8 18 12 19 38 17 31 (25.123 0.013264 0.0089851 0.0040683 0.0023241 0.00069736 5.6696e-05)
182.06725 100.00 21 32 28 39 24 47 27 46 (28.05 0.87191 0.089136 0.050059 0.036144 0.022087 0.0070341 0.0027013)
296.09894 34.29 0 100 114 90 84 120 86 89 82 83 94 88 (8.8091 0.68658 0.18388 0.17724 0.075318 0.02111 0.011898 0.011698 0.01 0.0015825 0.00074176 0.00015297)
energy1
136.06177 23.98 10 (6.7806)
164.05669 100.00 23 (28.273)
180.05160 91.98 8 18 12 19 17 31 38 (22.446 3.2332 0.1627 0.083403 0.075169 0.0044714 0.0022685)
182.06725 76.79 21 39 28 47 32 27 24 46 (15.126 5.688 0.37917 0.22682 0.1045 0.094916 0.086928 0.0043803)
energy2
96.05562 8.33 44 (3.5619)
121.05087 10.67 40 (4.563)
136.06177 100.00 10 (42.767)
164.05669 15.94 23 (6.8152)
180.05160 18.40 8 18 19 31 12 38 17 (6.3592 0.96225 0.21764 0.14502 0.10026 0.060555 0.022166)
182.06725 31.43 21 39 28 47 24 32 46 27 (11.861 1.0789 0.19788 0.13322 0.09667 0.038896 0.019101 0.015323)
210.06217 4.49 92 (1.9222)

0 296.0989449681 NC1=C2C(=NC=N1)N(C1CC(O)C(CO)O1)C=[N+]2C(=O)O
1 279.0723958721 OC1=C(C=[OH+])OC(N2CN(C(O)O)C3=CN=CN=C32)=C1
2 165.0407018201 OC(=[OH+])N1C=NC2=NC=NC=C21
3 117.0546205681 OC1C=COC1C[OH2+]
4 99.0440558841 CC1=C([OH2+])C=CO1
5 117.0546205681 C=COC(=CO)C[OH2+] Intermediate Fragment 
6 117.0546205681 OC=C=C(O)CC[OH2+] Intermediate Fragment 
7 115.0389705041 OC1=C(C[OH2+])OC=C1
8 180.0516008521 [NH3+]C1=C2C(=NC=N1)N=CN2C(=O)O
9 134.0461215481 [NH2+]=C1N=CN=C2N=CN=C12
10 136.0617716121 [NH2+]=C1N=CN=C2NCN=C12
11 162.0410361681 NC1=C2C(=NC=N1)N=CN2C#[O+]
12 180.0516008521 N=C=NC1=C(C#[NH+])N(C(O)O)C=N1 Intermediate Fragment 
13 163.0250517561 C#[N+]C1=C(C#N)N(C(=O)O)C=N1
14 153.0407018201 N=C=C1C(=[NH2+])N=CN1C(=O)O
15 138.0298027881 [NH+]#CC1=CN=CN1C(=O)O
16 153.0407018201 [NH+]#CN=C1CN(C(=O)O)C=N1
17 180.0516008521 [NH+]#CN=C=NC1=CN(C(O)O)C=N1 Intermediate Fragment 
18 180.0516008521 [NH3+]C1=CC(N=C=NC(=O)O)=NC=N1 Intermediate Fragment 
19 180.0516008521 C=NC1=NC=NC(=[NH2+])C1=NC(=O)O Intermediate Fragment 
20 153.0407018201 [NH2+]=C1N=CN=CC1=NC(=O)O
21 182.0672509161 [NH3+]C1=C2C(=NC=N1)N=CN2C(O)O
22 138.0774216761 [NH2+]=C1N=CN=C2NCNC12
23 164.0566862321 [NH3+]C1=C2C(=NC=N1)N=CN2C=O
24 182.0672509161 N=C=NC1=C(C#[NH+])N(C(O)O)CN1 Intermediate Fragment 
25 165.0407018201 C=[NH+]C1=C(C#N)N(C(=O)O)C=N1
26 155.0563518841 N=C=C1C(=[NH2+])N=CN1C(O)O
27 182.0672509161 [NH+]#CN=C=NC1=CN(C(O)O)CN1 Intermediate Fragment 
28 182.0672509161 C=NC([NH3+])=C1C(=N)N=CN1C(=O)O Intermediate Fragment 
29 165.0407018201 C#[N+]C(=N)C1=CN=CN1C(=O)O
30 55.0290745161 C=[NH+]C#N
31 180.0516008521 C#[N+]C(N)=C1C(=N)N=CN1C(=O)O
32 182.0672509161 C=NC1=C(C(N)=[NH2+])N(C(=O)O)C=N1 Intermediate Fragment 
33 155.0563518841 N=C([NH3+])C1=CN=CN1C(=O)O
34 45.0447245801 N=C[NH3+]
35 43.0290745161 N#C[NH3+]
36 138.0298027881 C#[N+]C1=CN(C(=O)O)C=N1
37 140.0454528521 C=[NH+]C1=CN(C(=O)O)C=N1
38 180.0516008521 C#[N+]C1=C(C(=N)N)N(C(=O)O)C=N1
39 182.0672509161 [NH3+]C1=CC(N=C=NC(O)O)=NC=N1 Intermediate Fragment 
40 121.0508725801 C#[N+]C1=NC=NC(N)=C1
41 62.0236547881 [NH2+]=C(O)O
42 111.0665226441 NC1=NC=NC([NH3+])=C1
43 72.0080047241 C#[N+]C(=O)O
44 96.0556236121 [NH3+]C1=CC=NC=N1
45 87.0189037561 N=C=[NH+]C(=O)O
46 182.0672509161 N=CN(C(=O)O)C1=C([NH3+])N=CN=C1 Intermediate Fragment 
47 182.0672509161 C=NC1=NC=NC([NH3+])=C1N=C(O)O Intermediate Fragment 
48 155.0563518841 [NH2+]=C1N=CN=CC1=NC(O)O
49 184.0829009801 [NH3+]C1=C2C(=NC=N1)NCN2C(O)O
50 140.0930717401 [NH3+]C1N=CN=C2NCNC21
51 166.0723362961 [NH3+]C1=C2C(=NC=N1)N=CN2CO
52 184.0829009801 [NH3+]C1=CC(NC=NC(O)O)=NC=N1 Intermediate Fragment 
53 184.0829009801 CN(C(=O)O)C1=C([NH3+])N=CN=C1N Intermediate Fragment 
54 184.0829009801 C=NC1=NC=NC([NH3+])=C1NC(O)O Intermediate Fragment 
55 123.0665226441 C=NC1=NC=NC([NH3+])=C1
56 186.0985510441 [NH3+]C1N=CN=C2NCN(C(O)O)C21
57 264.0727302201 [NH3+]C1=C2C(=NC=N1)N(C1=CC(O)=CO1)CN2C(=O)O
58 266.0883802841 [NH3+]C1=C2C(=NC=N1)N(C1=CC(O)=CO1)CN2C(O)O
59 222.0985510441 [NH3+]C1=C2N=CN(C3CC(O)CO3)C2=NC=N1
60 266.0883802841 COC(=C=C=O)N1CN(C(O)O)C2=C([NH3+])N=CN=C21 Intermediate Fragment 
61 268.1040303481 [NH3+]C1=C2C(=NC=N1)N(C1=CC(O)CO1)CN2C(O)O
62 250.0934656641 [NH3+]C1=C2C(=NC=N1)N(C1=CC=CO1)CN2C(O)O
63 278.0883802841 CC1=C(O)C=C(N2CN(C(=O)O)C3=C([NH3+])N=CN=C32)O1
64 278.0883802841 CC(=O)C(O)=C=CN1CN(C(=O)O)C2=C([NH3+])N=CN=C21 Intermediate Fragment 
65 278.0883802841 [NH3+]C1=C2C(=NC=N1)N(C1=CC=C(C=O)O1)CN2C(O)O
66 278.0883802841 [NH3+]C1=C2C(=NC=N1)N(C(O)=C=C=C=CO)CN2C(O)O Intermediate Fragment 
67 248.0778156001 [NH3+]C1=C2N=CN(C3=CC(O)=C(CO)O3)C2=NC=N1
68 250.0934656641 [NH3+]C1=C2N=CN(C3=CC(O)C(CO)O3)C2=NC=N1
69 252.1091157281 [NH3+]C1=C2N=CN(C3CC(O)C(CO)O3)C2=NC=N1
70 252.1091157281 [NH3+]C1=C2N=CN(C=CC(O)C(O)CO)C2=NC=N1 Intermediate Fragment 
71 91.0389705041 OC=C([OH2+])CO
72 162.0774216761 C=CN1C=NC2=C([NH3+])N=CN=C21
73 192.0879863601 [NH3+]C1=C2N=CN(C=CCO)C2=NC=N1
74 234.0985510441 [NH3+]C1=C2N=CN(C#CC(O)CCO)C2=NC=N1
75 252.1091157281 [NH3+]C1=C2N=CN(C(O)=CC(O)CCO)C2=NC=N1 Intermediate Fragment 
76 75.0440558841 OC=CC[OH2+]
77 206.0672509161 [NH3+]C1=C2N=CN(C(O)=C=CO)C2=NC=N1
78 208.0829009801 [NH3+]C1=C2N=CN(C(O)=CCO)C2=NC=N1
79 252.1091157281 [NH3+]C1=C2N=CN(C(=CCO)OCCO)C2=NC=N1 Intermediate Fragment 
80 210.0985510441 [NH3+]C1=C2N=CN(C(O)CCO)C2=NC=N1
81 278.0883802841 [NH3+]C1=C2C(=NC=N1)N(C1=CC(O)=C(C=O)O1)CN2CO
82 296.0989449681 N=C=NC1=C(C#[NH+])N(C(O)O)CN1C1=CC(O)C(CO)O1 Intermediate Fragment 
83 296.0989449681 [NH+]#CN=C=NC1=CN(C(O)O)CN1C1=CC(O)C(CO)O1 Intermediate Fragment 
84 296.0989449681 C=NC([NH3+])=C1C(=N)N(C2=CC(O)=C(C=O)O2)CN1C(O)O Intermediate Fragment 
85 269.0880459361 N=C=C1C(=[NH2+])N(C2=CC(O)=C(CO)O2)CN1C(O)O
86 296.0989449681 [NH3+]C1=CC(N(C=NC(O)O)C2=CC(O)=C(CO)O2)=NC=N1 Intermediate Fragment 
87 225.0982166961 [NH3+]C1=CC(N=C2CC(O)C(CO)O2)=NC=N1
88 296.0989449681 [NH3+]C1=C(N(C=NC2=CC(O)=C(CO)O2)C(O)O)C=NC=N1 Intermediate Fragment 
89 296.0989449681 CN(C1=C([NH3+])N=CN=C1N=C1C=C(O)C(=CO)O1)C(O)O Intermediate Fragment 
90 296.0989449681 C=C(O)C(=C=O)OCN1CN(C(O)O)C2=C([NH3+])N=CN=C21 Intermediate Fragment 
91 252.0727302201 [NH3+]C1=C2C(=NC=N1)N(COC#CO)CN2C(=O)O
92 210.0621655361 [NH3+]C1=C2C(=NC=N1)N(C=O)CN2C(=O)O
93 208.0465154721 NC1=C2C(=NC=N1)N(C#[O+])CN2C(=O)O
94 296.0989449681 [NH3+]C1=C2C(=NC=N1)N(C=C=C(O)C(=O)CO)CN2C(O)O Intermediate Fragment 
95 206.0672509161 C#CN1CN(C(=O)O)C2=C([NH3+])N=CN=C21
96 208.0829009801 C#CN1CN(C(O)O)C2=C([NH3+])N=CN=C21
97 210.0985510441 C=CN1CN(C(O)O)C2=C([NH3+])N=CN=C21
98 236.0778156001 [NH3+]C1=C2C(=NC=N1)N(C#CC=O)CN2C(O)O
99 278.0883802841 [NH3+]C1=C2C(=NC=N1)N(C#CC(O)=C=CO)CN2C(O)O
100 296.0989449681 [NH3+]C1=C2C(=NC=N1)N(C(O)=C=C(O)C=CO)CN2C(O)O Intermediate Fragment 
101 89.0597059481 C=C(O)CC[OH2+]
102 212.0778156001 [NH3+]C1=C2C(=NC=N1)N(CO)CN2C(=O)O
103 73.0284058201 OC#CC[OH2+]
104 45.0334912001 C=C[OH2+]
105 222.0621655361 [CH+]=C(O)N1CN(C(=O)O)C2=C(N)N=CN=C21
106 224.0778156001 C=C(O)N1CN(C(=O)O)C2=C([NH3+])N=CN=C21
107 206.0672509161 C=C(O)N1CN(C#[O+])C2=C(N)N=CN=C21
108 226.0934656641 C=C(O)N1CN(C(O)O)C2=C([NH3+])N=CN=C21
109 228.1091157281 CC(O)N1CN(C(O)O)C2=C([NH3+])N=CN=C21
110 47.0491412641 CC[OH2+]
111 250.0570801561 [NH3+]C1=C2C(=NC=N1)N(C(O)=C=C=O)CN2C(=O)O
112 252.0727302201 [NH3+]C1=C2C(=NC=N1)N(C(O)=C=C=O)CN2C(O)O
113 254.0883802841 [NH3+]C1=C2C(=NC=N1)N(C(O)=C=CO)CN2C(O)O
114 296.0989449681 [NH3+]C1=C2C(=NC=N1)N(C(=C=CO)OC=CO)CN2C(O)O Intermediate Fragment 
115 268.1040303481 C=C(OC=CO)N1CN(C(O)O)C2=C([NH3+])N=CN=C21
116 43.0178411361 C#C[OH2+]
117 240.1091157281 [NH3+]C1=C2C(=NC=N1)N(C=CCO)CN2C(O)O
118 238.0934656641 [NH3+]C1=C2C(=NC=N1)N(C#CCO)CN2C(O)O
119 234.0621655361 [NH3+]C1=C2C(=NC=N1)N(C#CC=O)CN2C(=O)O
120 296.0989449681 C=C(OC(C=O)=CO)N1CN(C(O)O)C2=C([NH3+])N=CN=C21 Intermediate Fragment 
