#In-silico ESI-MS/MS [M+H]+ Spectra
#PREDICTED BY CFM-ID 4.0.8
#SMILES=[C@H]1(C[C@@H](O[C@@H]1CO)n1cc(c(=O)n(c1=O)C1C(C(C(c2c1c1c3c(c2)ccc2c3c(cc1)ccc2)O)O)O)C)O
#InChiKey=QOWLWWKSZQYJJS-YNJVORPKSA-N
energy0
411.13393 100.00 26 27 28 22 21 (48.108 4.8087 1.2068 0.024475 0.017686)
429.14450 39.86 5 35 30 61 82 76 44 60 67 79 57 96 94 91 87 93 90 92 95 89 88 (19.266 1.4738 0.55739 0.12551 0.04441 0.03404 0.024735 0.016371 0.013206 0.0090065 0.0065089 0.0047159 0.0025666 0.0025157 0.0024646 0.0016936 0.00081417 0.0007614 0.00052078 0.00025616 0.00015077)
545.19184 8.65 0 280 250 273 203 301 322 299 319 278 310 189 201 320 300 335 275 337 334 277 333 336 (4.4878 0.047529 0.046356 0.032285 0.022546 0.014092 0.011515 0.0062917 0.0043538 0.0036004 0.002532 0.0017046 0.001485 0.00060715 0.00033612 0.00029602 0.00019521 0.00017509 0.00011873 3.9796e-05 2.7566e-05 1.1109e-05)
energy1
99.04406 1.88 7 111 107 (0.58072 0.53322 0.21327)
285.09101 2.10 154 156 155 (1.0715 0.22966 0.17979)
287.10666 2.56 128 130 129 (1.0477 0.60226 0.15514)
411.13393 100.00 26 28 27 21 22 (65.359 2.7832 2.3365 0.012097 0.0057082)
429.14450 7.54 5 82 35 30 61 57 79 76 67 44 96 94 95 91 60 87 92 93 90 89 88 (4.8454 0.15237 0.10294 0.046116 0.034351 0.030375 0.027551 0.02559 0.019189 0.016359 0.0054076 0.0033986 0.0020923 0.0018651 0.0012086 0.0011304 0.0010529 0.00070121 0.00049892 0.00023735 0.00018452)
energy2
45.03349 15.52 109 (1.406)
59.04914 9.77 112 (0.88512)
61.02841 8.60 114 (0.7794)
75.04406 22.23 196 212 (1.7783 0.23636)
125.03455 100.00 16 (9.061)
199.07133 9.19 71 (0.83266)
203.08553 8.27 158 (0.74928)
215.08553 26.40 133 (2.3926)
229.06479 10.80 73 (0.97888)
231.08044 13.66 74 (1.2378)
241.06479 11.91 162 (1.0796)
243.08044 18.49 135 142 (1.2533 0.42178)
273.09101 27.74 137 169 (1.6502 0.86371)
275.10666 16.18 138 161 (0.84078 0.62566)
283.07536 45.67 165 164 (2.261 1.8768)
285.09101 19.81 154 156 155 (0.93907 0.63137 0.22442)
287.10666 62.96 130 128 129 (2.9754 2.1813 0.54841)
299.07027 10.61 23 (0.96132)
301.08592 64.89 10 170 171 168 166 167 (3.8509 0.56053 0.51719 0.38457 0.30505 0.26153)
303.10157 28.10 9 145 143 160 157 159 (1.1266 0.54154 0.4501 0.16315 0.15444 0.11072)
305.11722 63.59 8 136 134 144 132 131 147 146 152 148 150 151 153 149 (3.4439 0.837 0.46119 0.27467 0.24051 0.10172 0.068183 0.064797 0.051758 0.046454 0.04568 0.043126 0.043116 0.039812)
339.11280 12.52 78 (1.1347)
369.12337 21.10 307 69 (1.0716 0.84031)
399.13393 9.40 315 324 70 49 (0.30068 0.26698 0.26451 0.019633)
411.13393 16.21 26 27 28 21 22 (0.75386 0.45628 0.11192 0.1087 0.038091)
429.14450 58.37 5 44 35 82 61 67 57 76 79 30 94 93 95 88 91 90 92 96 89 87 60 (1.7518 0.80049 0.52726 0.47259 0.45098 0.43885 0.18138 0.13253 0.12307 0.12134 0.038327 0.031935 0.031928 0.030197 0.029481 0.025438 0.0252 0.021404 0.019989 0.017808 0.017308)
443.16015 12.53 199 215 (1.0633 0.072046)
455.16015 30.08 309 191 (1.9549 0.77062)
459.15506 63.29 202 (5.7349)
461.20710 22.60 195 327 (1.8323 0.21555)

0 545.1918423081 Cc1cn(C2CC(O)C(C[OH2+])O2)c(=O)n(C2c3c(cc4ccc5cccc6ccc3c4c56)C(O)C(O)C2O)c1=O
1 513.1656275601 CC1=CN(C2C=C(O)CO2)C(=O)N(C2=C(O)C(O)=C(O)C3=C2C2=C4C(=C3)C=CC3=C4C(=CC2)CCC3)C1=[OH+]
2 515.1812776241 CC1=CN(C2C=C(O)CO2)C(=O)N(C2=C(O)C(O)=C(O)C3=C2C2=C4C(=C3)C=CC3=C4C(CCC3)CC2)C1=[OH+]
3 527.1812776241 C=C1OC(N2C=C(C)C(=[OH+])N(C3=C(O)C(O)=C(O)C4=C3C3=C5C(=C4)C=CC4=C5C(CCC4)CC3)C2=O)C=C1O
4 431.1601482561 CC1=C([OH2+])N(C2=C(O)C(O)=C(O)C3=C2C2=C4C(=C3)C=CC3=C4C(CCC3)CC2)C(=O)N=C1
5 429.1444981921 CC1=C([OH2+])N(C2=C(O)C(O)=C(O)C3=C2C2=C4C(=C3)C=CC3=C4C(=CC2)CCC3)C(=O)N=C1
6 427.1288481281 CC1=C([OH2+])N(C2=C(O)C(O)=C(O)C3=C2C2=C4C(=C3)C=CC3=C4C(=CC2)C=CC3)C(=O)N=C1
7 99.0440558841 C=C1OC=CC1[OH2+]
8 305.1172208241 OC1=CC2=C(C=C3C=CC4=C5C(=CCC4)C=CC2=C35)C([OH2+])C1O
9 303.1015707601 OC1=CC2=C(C=C3C=CC4=C5C(=CC=C4)C=CC2=C35)C([OH2+])C1O
10 301.0859206961 OC1=CC2=C(C=C3C=CC4=C5C(=CC=C4)C=CC2=C35)C(=[OH+])C1O
11 509.1707129401 C=C1OC(N2C=C(C)C(=[OH+])N(C3=C(O)C(O)=CC4=C3C3=C5C(=C4)C=CC4=C5C(=CC3)CCC4)C2=O)C=C1O
12 509.1707129401 C=C1C=CC(N2C=C(C)C(=[OH+])N(C3=C(O)C(O)=C(O)C4=C3C3=C5C(=C4)C=CC4=C5C(=CC3)CCC4)C2=O)O1
13 527.1812776241 C#COC(=C=CO)N1C=C(C)C(=[OH+])N(C2=C(O)C(O)=C(O)C3=C2C2=C4C(=C3)C=CC3CCCC(CC2)C43)C1=O Intermediate Fragment 
14 527.1812776241 C=C1OC(N2C=C(C)C(=[OH+])N(CC3=C4CC=C5C=CCC6=C5C4=C(C=C6)CC3=C(O)C(O)=CO)C2=O)C=C1O Intermediate Fragment 
15 435.1914483841 CC1=C([OH2+])N(C2=C(O)C(O)=C(O)C3=C2C2=C4C(=C3)CCC3CCCC(CC2)C43)C(=O)N=C1
16 125.0345538201 C=C1C=NC(O)=NC1=[OH+]
17 127.0502038841 CC1C=NC(O)=NC1=[OH+]
18 417.1808837001 CC1=C([OH2+])N(C2=C(O)C(O)=CC3=C2C2=C4C(=C3)C=CC3CCCC(CC2)C43)C(=O)N=C1
19 433.1757983201 CC1=C([OH2+])N(C2=C(O)C(O)=C(O)C3=C2C2=C4C(=C3)C=CC3CCCC(CC2)C43)C(=O)N=C1
20 413.1495835721 CC1=C([OH2+])N(C2=C(O)C(O)=CC3=C2C2=C4C(=C3)C=CC3=C4C(=CC2)CCC3)C(=O)N=C1
21 411.1339335081 CC1=CN(C2=C(O)C(O)=C(O)C3=C2C2=C4C(=C3)C=CC3=C4C(=CC2)C=CC3)C(=[OH+])N=C1
22 411.1339335081 [CH2+]C1=C(O)N(C2=C(O)C(O)=C(O)C3=C2C2=C4C(=C3)C=CC3=C4C(=CC2)C=CC3)CN=C1
23 299.0702706321 O=C1C(=[OH+])C2=C(C=C1O)C1=C3C(=C2)C=CC2=C3C(=CC=C2)C=C1
24 123.0189037561 [CH+]=C1C=NC(O)=NC1=O
25 131.0815040121 CC1C=NC(O)NC1[OH2+]
26 411.1339335081 CC1=C([OH2+])N(C2=C(O)C(O)=CC3=C2C2=C4C(=C3)C=CC3=C4C(=CC2)C=CC3)C(=O)N=C1
27 411.1339335081 CC1=C([OH2+])N(C2=C(O)C=C(O)C3=C2C2=C4C(=C3)C=CC3=C4C(=CC2)C=CC3)C(=O)N=C1
28 411.1339335081 CC1=C([OH2+])N(C2=CC(O)=C(O)C3=C2C2=C4C(=C3)C=CC3=C4C(=CC2)C=CC3)C(=O)N=C1
29 413.1131980641 O=C1N=CC=C([OH2+])N1C1=C(O)C(O)=C(O)C2=C1C1=C3C(=C2)C=CC2=C3C(=CC1)C=CC2
30 429.1444981921 CC(=C=N)C(=[OH+])N(C=O)C1=C(O)C(O)=C(O)C2=C1C1=C3C(=C2)C=CC2=C3C(=CC1)CCC2 Intermediate Fragment 
31 412.1179490961 C=C(C)C(=O)[N+](=C=O)C1=C(O)C(O)=C(O)C2=C1C1=C3C(=C2)C=CC2=C3C(=CC1)C=CC2
32 402.1335991601 CC=C(O)[NH+](C=O)C1=C(O)C(O)=C(O)C2=C1C1=C3C(=C2)C=CC2=C3C(=CC1)C=CC2
33 348.1230344761 O=C=[NH+]C1=C(O)C(O)C(O)C2=C1C1=C3C(=C2)C=CC2=C3C(C=C1)CCC2
34 346.1073844121 O=C=[NH+]C1=C(O)C(O)C(O)C2=C1C1=C3C(=C2)C=CC2=C3C(=CCC2)C=C1
35 429.1444981921 CC(=C=NC=O)C(=[OH+])N=C1C(O)=C(O)C(O)=C2CC3=C4C(=C12)CC=C1CCCC(=C14)C=C3 Intermediate Fragment 
36 386.1386845401 C=C(C)C(=O)[NH+]=C1C(O)=C(O)C(=O)C2CC3=C4C(=C12)CC=C1C=CCC(=C14)C=C3
37 384.1230344761 C=C(C)C(=O)[NH+]=C1C(O)=C(O)C(=O)C2=C1C1=C3C(=C2)C=CC2=C3C(=CC1)C=CC2
38 382.1073844121 [CH+]=C(C)C(=O)N=C1C(O)=C(O)C(=O)C2=C1C1=C3C(=C2)C=CC2=C3C(=CC1)C=CC2
39 374.1386845401 CCC(=O)[NH+]=C1C(O)=C(O)C(O)=C2CC3=C4C(=C12)CC=C1C=CCC(=C14)C=C3
40 372.1230344761 C=CC(=O)[NH+]=C1C(O)=C(O)C(O)=C2CC3=C4C(=C12)CC=C1C=CCC(=C14)C=C3
41 368.0917343481 [C+]#CC(=O)N=C1C(O)=C(O)C(O)=C2CC3=C4C(=C12)CC=C1C=CCC(=C14)C=C3
42 401.1495835721 CC(C#[NH+])=C(O)N=C1C(O)=C(O)C(O)=C2CC3=C4C(=C12)CC=C1CCCC(=C14)C=C3
43 427.1288481281 CC(=C=[NH+]C=O)C(=O)N=C1C(O)=C(O)C(O)=C2CC3=C4C(=C12)CC=C1C=CCC(=C14)C=C3
44 429.1444981921 CC(=C=NC(O)=NC1=C(O)C(O)=C(O)C2=C1C1=C3C(=C2)C=CC2=C3C(=CC1)CCC2)C=[OH+] Intermediate Fragment 
45 371.1026333801 C=[NH+]C(O)=NC1=C(O)C(O)=C(O)C2=C1C1=C3C(=C2)C=CC2=C3C(=CC=C2)C=C1
46 373.1182834441 C=[NH+]C(O)=NC1=C(O)C(O)=C(O)C2=C1C1=C3C(=C2)C=CC2=C3C(=CCC2)C=C1
47 375.1339335081 C=[NH+]C(O)=NC1=C(O)C(O)=C(O)C2=C1C1=C3C(=C2)C=CC2=C3C(C=C1)CCC2
48 397.1182834441 C=C=C=[NH+]C(O)=NC1=C(O)C(O)=C(O)C2=C1C1=C3C(=C2)C=CC2=C3C(=CC1)C=CC2
49 399.1339335081 CC=C=[NH+]C(O)=NC1=C(O)C(O)=C(O)C2=C1C1=C3C(=C2)C=CC2=C3C(=CC1)C=CC2
50 401.1495835721 CC=C=[NH+]C(O)=NC1=C(O)C(O)=C(O)C2=C1C1=C3C(=C2)C=CC2=C3C(=CC1)CCC2
51 110.0236547881 CC(=C=NC=O)C#[O+]
52 318.1124697921 [NH2+]=C1C2=C3C=CC4=CC=CC5=C4C3=C(C=C5)CC2C(=O)C(O)C1O
53 320.1281198561 [NH2+]=C1C2=C3C=CC4=CC=CC5=C4C3=C(C=C5)CC2C(O)C(O)C1O
54 340.0604342201 O=C=[NH+]C1=C(O)C(=O)C(=O)C2=C1C1=C3C(=C2)C=CC2=C3C(=CC=C2)C=C1
55 344.0917343481 O=C=[NH+]C1=C(O)C(O)C(O)C2=C1C1=C3C(=C2)C=CC2=C3C(=CC=C2)C=C1
56 427.1288481281 CC(=C=[NH+]C(O)=NC1=C(O)C(O)=C(O)C2=C1C1=C3C(=C2)C=CC2=C3C(=CC1)C=CC2)C=O
57 429.1444981921 CC=C=NC(=O)N(C=[OH+])C1=C(O)C(O)=C(O)C2=C1C1=C3C(=C2)C=CC2=C3C(=CC1)CCC2 Intermediate Fragment 
58 374.1022990321 O=C[NH+](C=O)C1=C(O)C(O)=C(O)C2=C1C1=C3C(=C2)C=CC2=C3C(=CCC2)C=C1
59 376.1179490961 O=C[NH+](C=O)C1=C(O)C(O)=C(O)C2=C1C1=C3C(=C2)C=CC2=C3C(C=C1)CCC2
60 429.1444981921 C=C(C)C(=[OH+])N(C(N)=O)C1=C(O)C(O)=C(O)C2=C1C1=C3C(=C2)C=CC2=C3C(=CC1)C=CC2 Intermediate Fragment 
61 429.1444981921 CC1=C([OH2+])N(C(=CO)C2=C(C(O)=CO)C=C3C=CC4=C5C(=CCC2=C35)C=CC4)C(=O)N=C1 Intermediate Fragment 
62 373.1546689521 CC1=C([OH2+])N(C(=CO)C2=CC=C3C=CC4=C5C(=CCC2=C35)CCC4)C(=O)N=C1
63 367.1077187601 [CH2+]C1=C(O)N(C(=C=O)C2=CC=C3C=CC4=C5C(=CCC2=C35)C=CC4)C(=O)N=C1
64 259.0753560121 O=CC(=[OH+])C1=CC2=C3C(=C1)C=CC1=C3C(=CC=C1)C=C2
65 261.0910060761 OCC(=[OH+])C1=CC2=C3C(=C1)C=CC1=C3C(=CC=C1)C=C2
66 263.1066561401 OCC([OH2+])C1=CC2=C3C(=C1)C=CC1=C3C(=CC=C1)C=C2
67 429.1444981921 CC1=C([OH2+])N(C(=C(O)CO)C2=C3CC=C4C=CCC5=C4C3=C(C=C5)CC2=C=O)C(=O)N=C1 Intermediate Fragment 
68 367.1077187601 C=C1C=NC(=O)N([CH+]C2=C3CC=C4C=CCC5=C4C3=C(C=C5)CC2=C=O)C1=O
69 369.1233688241 C=C1C=NC(=O)N(CC2=C3CC=C4C=CCC5=C4C3=C(C=C5)CC2=C=O)C1=[OH+]
70 399.1339335081 CC1=C([OH2+])N(C(=CO)C2=C3CC=C4C=CCC5=C4C3=C(C=C5)CC2=C=O)C(=O)N=C1
71 199.0713332521 CC1C=NC(=O)N(C=C(O)CO)C1=[OH+]
72 197.0556831881 CC1C=NC(=O)N(C=C(O)C=O)C1=[OH+]
73 229.0647913281 [O+]#CC1=CC2=C3C(=C1)C=CC1=C3C(=CC=C1)C=C2
74 231.0804413921 [OH+]=CC1=CC2=C3C(=C1)C=CC1=C3C(=CC=C1)C=C2
75 233.0960914561 [OH+]=CC1C=C2C=CC3=CC=CC4=C3C2=C(C=C4)C1
76 429.1444981921 CC1=C([OH2+])N(C(C2=CC=C3C=CC4=C5C(=CCC2=C35)C=CC4)=C(O)C(O)=CO)C(=O)N=C1 Intermediate Fragment 
77 337.0971540761 C=C1C=NC(=O)N([CH+]C2=CC=C3C=CC4=C5C(=CC=C4)C=CC2=C35)C1=O
78 339.1128041401 C=C1C=NC(=O)N(CC2=CC=C3C=CC4=C5C(=CC=C4)C=CC2=C35)C1=[OH+]
79 429.1444981921 CC1=C([OH2+])N(C=C(O)C(O)=C(O)C2=CC3=C4C(=C2)C=CC2=C4C(=CC3)C=CC2)C(=O)N=C1 Intermediate Fragment 
80 137.0345538201 C=C1C=NC(=O)N([CH2+])C1=O
81 139.0502038841 C=C1C=NC(=O)N(C)C1=[OH+]
82 429.1444981921 CC1=C([OH2+])N(CC2=C3CC=C4C=CCC5=C4C3=C(C=C5)CC2=C(O)C(O)=C=O)C(=O)N=C1 Intermediate Fragment 
83 345.1597543321 CC1C=NC(=O)N(CC2=CC=C3C=CC4=C5C3=C2C=CC5CCC4)C1=[OH+]
84 343.1441042681 CC1C=NC(=O)N(CC2=CC=C3C=CC4=C5C(=CCC4)C=CC2=C35)C1=[OH+]
85 341.1284542041 CC1C=NC(=O)N(CC2=CC=C3C=CC4=C5C(=CC=C4)C=CC2=C35)C1=[OH+]
86 91.0389705041 OC=C(O)C[OH2+]
87 429.1444981921 C=C1C=CC2=C3C(=CCC(C4=CC(O)=C(O)C(O)=C4N4C(=O)N=CC(C)=C4[OH2+])=C13)C=CC2 Intermediate Fragment 
88 429.1444981921 CC1=C([OH2+])N(C2=C(O)C(O)=C(O)C(C=C3C=CC4=C5C(=CCC=C35)C=CC4)=C2)C(=O)N=C1 Intermediate Fragment 
89 429.1444981921 CC1=C([OH2+])N(C2=C(O)C(O)=C(O)C(C)=C2C2=CC=C3C=CCC4=C3C2=CC=C4)C(=O)N=C1 Intermediate Fragment 
90 429.1444981921 C=C1CC=CC2=C1C1=C(C=C2)C2=C(C=C1C)C(O)=C(O)C(O)=C2N1C(=O)N=CC(C)=C1[OH2+] Intermediate Fragment 
91 429.1444981921 C=C=C1CCCC2=C1C1=C(C=C2)C2=C(C=C1)C(O)=C(O)C(O)=C2N1C(=O)N=CC(C)=C1[OH2+] Intermediate Fragment 
92 429.1444981921 C=C=C1CCCC2=C1C1=CC3=C(C=C1C=C2)C(O)=C(O)C(O)=C3N1C(=O)N=CC(C)=C1[OH2+] Intermediate Fragment 
93 429.1444981921 C=CC1=C2C(C)=CCC3=C2C(=CC2=C3C(N3C(=O)N=CC(C)=C3[OH2+])=C(O)C(O)=C2O)C=C1 Intermediate Fragment 
94 429.1444981921 C=CC1=CCC2=C3C(=CC4=C2C(N2C(=O)N=CC(C)=C2[OH2+])=C(O)C(O)=C4O)C=CC(C)=C13 Intermediate Fragment 
95 429.1444981921 CC=CC1=CCC2=C3C(=CC4=C2C(N2C(=O)N=CC(C)=C2[OH2+])=C(O)C(O)=C4O)C=CC=C13 Intermediate Fragment 
96 429.1444981921 C=CCC1=C2C=CCC3=C2C(=CC2=C3C(N3C(=O)N=CC(C)=C3[OH2+])=C(O)C(O)=C2O)C=C1 Intermediate Fragment 
97 409.1182834441 [CH2+]C1=C(O)N(C2=C(O)C(O)=CC3=C2C2=C4C(=C3)C=CC3=C4C(=CC2)C=CC3)C(=O)N=C1
98 427.1288481281 CC(=C=N)C(=[OH+])N(C=O)C1=C(O)C(O)=C(O)C2=C1C1=C3C(=C2)C=CC2=C3C(=CC1)C=CC2 Intermediate Fragment 
99 111.0076703761 O=C1C=COC1=C=[OH+]
100 113.0233204401 OC1C=COC1=C=[OH+]
101 115.0389705041 OC1C=COC1=C[OH2+]
102 87.0440558841 [OH2+]C1C=COC1
103 115.0389705041 C=C=C(O)C(=O)C[OH2+] Intermediate Fragment 
104 115.0389705041 O=C=C=C(O)CC[OH2+] Intermediate Fragment 
105 117.0546205681 OC1C=COC1C[OH2+]
106 89.0597059481 [OH2+]C1CCOC1
107 99.0440558841 [OH2+]C=C1C=CCO1
108 117.0546205681 C=COC(=C[OH2+])CO Intermediate Fragment 
109 45.0334912001 C=C[OH2+]
110 117.0546205681 C=C=C(O)C(O)C[OH2+] Intermediate Fragment 
111 99.0440558841 C=C=C(O)C=C[OH2+]
112 59.0491412641 CC=C[OH2+]
113 57.0334912001 CC#C[OH2+]
114 61.0284058201 OCC=[OH+]
115 117.0546205681 OC=C=C(O)CC[OH2+] Intermediate Fragment 
116 43.0178411361 C#C[OH2+]
117 89.0597059481 C=C(O)CC[OH2+]
118 117.0546205681 OC=C=COCC[OH2+] Intermediate Fragment 
119 119.0702706321 OC1CCOC1C[OH2+]
120 101.0597059481 CC1OCC=C1[OH2+]
121 101.0597059481 [OH2+]CC1C=CCO1
122 119.0702706321 OCC=C(O)CC[OH2+] Intermediate Fragment 
123 101.0597059481 C=C=C(O)CC[OH2+]
124 311.1641710161 OC1=CC2=C(C=C3C=CC4CCCC5CCC2=C3C45)C([OH2+])C1O
125 309.1485209521 OC1=CC2=C(C=C3C=CC4=C5C3=C2CCC5CCC4)C([OH2+])C1O
126 307.1328708881 OC1=CC2=C(C=C3C=CC4=C5C3=C2C=CC5CCC4)C([OH2+])C1O
127 289.1223062041 OC1=CC2=C(C=C1[OH2+])C=C1C=CC3=C4C(=CCC2=C14)CCC3
128 287.1066561401 OC1=CC2=C(C=C1[OH2+])C=C1C=CC3=C4C(=CCC2=C14)C=CC3
129 287.1066561401 OC1=CC2=C(C=C3C=CC4=C5C(=CCC2=C35)C=CC4)C([OH2+])=C1
130 287.1066561401 OC1=C([OH2+])C2=C(C=C1)C1=C3C(=C2)C=CC2=C3C(=CC1)C=CC2
131 305.1172208241 C=C(O)C(O)=C([OH2+])C1=CC2=C3C(=C1)C=CC1=C3C(=CC2)C=CC1 Intermediate Fragment 
132 305.1172208241 OC(=C[OH2+])C(O)=CC1=CC=C2C=CC3=C4C(=CCC1=C24)C=CC3 Intermediate Fragment 
133 215.0855267721 [CH2+]C1=CC=C2C=CC3=C4C(=CC=C3)C=CC1=C24
134 305.1172208241 OCC(O)=CC1=C2CC=C3C=CCC4=C3C2=C(C=C4)CC1=C=[OH+] Intermediate Fragment 
135 243.0804413921 [CH2+]C1=C2C=CC3=CC=CC4=C3C2=C(C=C4)CC1=C=O
136 305.1172208241 OC=CC1=C(C([OH2+])=CO)C=C2C=CC3=C4C(=CCC1=C24)C=CC3 Intermediate Fragment 
137 273.0910060761 [CH2+]C1=C(C(O)=C=O)C=C2C=CC3=C4C(=CCC1=C24)C=CC3
138 275.1066561401 CC1=C(C([OH2+])=C=O)C=C2C=CC3=C4C(=CCC1=C24)C=CC3
139 249.1273915841 [OH2+]C#CC1=CC=C2C=CC3=C4C2=C1CCC4CCC3
140 247.1117415201 [OH2+]C#CC1=CC=C2C=CC3=C4C2=C1C=CC4CCC3
141 245.0960914561 [OH2+]C#CC1=CC=C2C=CC3=C4C(=CCC3)C=CC1=C24
142 243.0804413921 [OH2+]C#CC1=CC=C2C=CC3=C4C(=CC=C3)C=CC1=C24
143 303.1015707601 OC#CC1=C(C([OH2+])=CO)C=C2C=CC3=C4C(=CCC1=C24)C=CC3
144 305.1172208241 CC1=C2CC=C3C=CCC4=C3C2=C(C=C4)CC1=C([OH2+])C(O)=C=O Intermediate Fragment 
145 303.1015707601 [CH2+]C1=C2CC=C3C=CCC4=C3C2=C(C=C4)CC1=C(O)C(O)=C=O
146 305.1172208241 C=C1C=CC2=C3C(=CCC(C4=CC([OH2+])=C(O)C(O)=C4)=C13)C=CC2 Intermediate Fragment 
147 305.1172208241 OC1=CC=C(C=C2C=CC3=C4C(=CCC=C24)C=CC3)C([OH2+])=C1O Intermediate Fragment 
148 305.1172208241 CC1=C(C2=CC=C3C=CCC4=C3C2=CC=C4)C=C(O)C(O)=C1[OH2+] Intermediate Fragment 
149 305.1172208241 C=C=C1CCCC2=C1C1=C(C=C2)C2=C(C=C1)C([OH2+])=C(O)C(O)=C2 Intermediate Fragment 
150 305.1172208241 C=C=C1CCCC2=C1C1=CC3=C(C=C1C=C2)C([OH2+])=C(O)C(O)=C3 Intermediate Fragment 
151 305.1172208241 C=CC1=C2C(C)=CCC3=C2C(=CC2=C3C=C(O)C(O)=C2[OH2+])C=C1 Intermediate Fragment 
152 305.1172208241 C=CC1=CCC2=C3C(=CC4=C2C=C(O)C(O)=C4[OH2+])C=CC(C)=C13 Intermediate Fragment 
153 305.1172208241 CC=CC1=CCC2=C3C(=CC4=C2C=C(O)C(O)=C4[OH2+])C=CC=C13 Intermediate Fragment 
154 285.0910060761 OC1=CC2=C(C=C1[OH2+])C=C1C=CC3=C4C(=CC=C3)C=CC2=C14
155 285.0910060761 OC1=CC2=C(C=C3C=CC4=C5C(=CC=C4)C=CC2=C35)C([OH2+])=C1
156 285.0910060761 OC1=C([OH2+])C2=C(C=C1)C1=C3C(=C2)C=CC2=C3C(=CC=C2)C=C1
157 303.1015707601 C=C(O)C(O)=C([OH2+])C1=CC2=C3C(=C1)C=CC1=C3C(=CC=C1)C=C2 Intermediate Fragment 
158 203.0855267721 C1=CC2=C3C(=C1)C=CC1=C3C(=C[CH2+]=C1)C=C2
159 303.1015707601 OC(=C=[OH+])C(O)=CC1=CC=C2C=CC3=C4C(=CCC1=C24)C=CC3 Intermediate Fragment 
160 303.1015707601 O=CC(O)=CC1=C2CC=C3C=CCC4=C3C2=C(C=C4)CC1=C=[OH+] Intermediate Fragment 
161 275.1066561401 OC#CC1=C2C=CC3=CCCC4=C3C2=C(C=C4)CC1=C[OH2+]
162 241.0647913281 O=C=[C+]C1=CC=C2C=CC3=C4C(=CC=C3)C=CC1=C24
163 257.0597059481 O=C(C#[O+])C1=CC2=C3C(=C1)C=CC1=C3C(=CC=C1)C=C2
164 283.0753560121 O=C1C=C2C(=CC1=[OH+])C=C1C=CC3=C4C(=CC=C3)C=CC2=C14
165 283.0753560121 O=C1C=CC2=C(C=C3C=CC4=C5C(=CC=C4)C=CC2=C35)C1=[OH+]
166 301.0859206961 C=C(O)C(=O)C(=[OH+])C1=CC2=C3C(=C1)C=CC1=C3C(=CC=C1)C=C2 Intermediate Fragment 
167 301.0859206961 OC(=C=[OH+])C(O)=CC1=CC=C2C=CC3=C4C(=CC=C3)C=CC1=C24 Intermediate Fragment 
168 301.0859206961 O=C=C1CC2=C3C(=C1C=C(O)C#[O+])CC=C1C=CCC(=C13)C=C2 Intermediate Fragment 
169 273.0910060761 OC#CC1=C2C=CC3=CC=CC4=C3C2=C(C=C4)CC1C=[OH+]
170 301.0859206961 O=C=CC1=C(C([OH2+])=C=O)C=C2C=CC3=C4C(=CCC1=C24)C=CC3 Intermediate Fragment 
171 301.0859206961 CC1=C(C(=[OH+])C(O)=C=O)C=C2C=CC3=C4C(=CC=C3)C=CC1=C24 Intermediate Fragment 
172 241.0818979361 CC1=CN(C2=CC(O)C(=C=[OH+])O2)C(O)NC1O
173 243.0975480001 CC1CN(C2=CC(O)C(=C=[OH+])O2)C(O)NC1O
174 243.0975480001 CC1CN(C(O)=C=C(O)C#C[OH2+])C(O)NC1O Intermediate Fragment 
175 169.0607685681 C=C([OH2+])N1C=C(C)C(=O)N=C1O
176 245.1131980641 CC1CN(C2=CC(O)C(=C[OH2+])O2)C(O)NC1O
177 247.1288481281 CC1CN(C2=CC(O)C(C[OH2+])O2)C(O)NC1O
178 527.1812776241 CC1=CN(C2C=C(O)C(=C=[OH+])O2)C(=O)N(C2=C(O)C(O)=CC3=C2C2=C4C(=C3)C=CC3CCCC(CC2)C43)C1=O
179 293.1536063321 OC1CC2C(=CC1[OH2+])C=C1C=CC3=C4C1=C2C=CC4CCC3
180 291.1379562681 OC1CC2C(=CC1[OH2+])C=C1C=CC3=C4C(=CCC3)C=CC2=C14
181 527.1812776241 CC1=CN(C=C=C(O)C(=O)C=[OH+])C(=O)N(C2=C(O)C(O)=CC3=C2C2=C4C(=C3)C=CC3CCCC(CC2)C43)C1=O Intermediate Fragment 
182 439.1652336361 C#CN1C=C(C)C(=[OH+])N(C2=C(O)C(O)=CC3=C2C2=C4C(=C3)C=CC3=C4C(CCC3)CC2)C1=O
183 527.1812776241 CC1=CN(C(O)=C=C(O)C#C[OH2+])C(=O)N(C2=C(O)C(O)=CC3=C2C2=C4C(=C3)C=CC3CCCC(CC2)C43)C1=O Intermediate Fragment 
184 527.1812776241 CC1=CN(C2C=C(O)C(=C=[OH+])O2)C(=O)N(C2=C(O)C=C(O)C3=C2C2=C4C(=C3)C=CC3CCCC(CC2)C43)C1=O
185 527.1812776241 CC1=CN(C2C=C(O)C(=C=[OH+])O2)C(=O)N(C2=CC(O)=C(O)C3=C2C2=C4C(=C3)C=CC3CCCC(CC2)C43)C1=O
186 529.1605421801 O=C1C=CN(C2C=C(O)C(=C=[OH+])O2)C(=O)N1C1=C(O)C(O)=C(O)C2=C1C1=C3C(=C2)C=CC2CCCC(CC1)C32
187 527.1812776241 CC1=CN(C2C=CC(=C=[OH+])O2)C(=O)N(C2=C(O)C(O)=C(O)C3=C2C2=C4C(=C3)C=CC3CCCC(CC2)C43)C1=O
188 509.1707129401 CC1=CN(C2C=CC(=C=[OH+])O2)C(=O)N(C2=C(O)C(O)=CC3=C2C2=C4C(=C3)C=CC3=C4C(CCC3)CC2)C1=O
189 545.1918423081 C=C(OC(=C=[OH+])CO)N1C=C(C)C(=O)N(C2=C(O)C(O)=C(O)C3=C2C2=C4C(=C3)C=CC3CCCC(CC2)C43)C1=O Intermediate Fragment 
190 453.1444981921 C#CN1C=C(C)C(=[OH+])N(C2=C(O)C(O)=C(O)C3=C2C2=C4C(=C3)C=CC3=C4C(=CC2)CCC3)C1=O
191 455.1601482561 C#CN1C=C(C)C(=[OH+])N(C2=C(O)C(O)=C(O)C3=C2C2=C4C(=C3)C=CC3=C4C(CCC3)CC2)C1=O
192 437.1495835721 C#CN1C=C(C)C(=[OH+])N(C2=C(O)C(O)=CC3=C2C2=C4C(=C3)C=CC3=C4C(=CC2)CCC3)C1=O
193 457.1757983201 C#CN1C=C(C)C(=[OH+])N(C2=C(O)C(O)=C(O)C3=C2C2=C4C(=C3)C=CC3CCCC(CC2)C43)C1=O
194 459.1914483841 C#CN1C=C(C)C(=[OH+])N(C2=C(O)C(O)=C(O)C3=C2C2=C4C(=C3)CCC3CCCC(CC2)C43)C1=O
195 461.2070984481 C#CN1C=C(C)C(=[OH+])N(C2=C(O)C(O)=C(O)C3=C2C2=C4C(CCC5CCCC(CC2)C45)C3)C1=O
196 75.0440558841 OCC=C[OH2+]
197 471.1550628761 C=C([OH2+])N1C=C(C)C(=O)N(C2=C(O)C(O)=C(O)C3=C2C2=C4C(=C3)C=CC3=C4C(=CC2)CCC3)C1=O
198 471.1550628761 C=C([OH2+])N(C=O)C=C(C)C(=O)N=C1C(O)=C(O)C(O)=C2CC3=C4C(=C12)CC=C1C=CCC(=C14)C=C3 Intermediate Fragment 
199 443.1601482561 C=C(O)[NH+]=C=C(C)C(=O)N=C1C(O)=C(O)C(O)=C2CC3=C4C(=C12)CC=C1CCCC(=C14)C=C3
200 473.1707129401 C=C([OH2+])N1C=C(C)C(=O)N(C2=C(O)C(O)=C(O)C3=C2C2=C4C(=C3)C=CC3=C4C(CCC3)CC2)C1=O
201 545.1918423081 C=C(O)C(=C=[OH+])OCN1C=C(C)C(=O)N(C2=C(O)C(O)=C(O)C3=C2C2=C4C(=C3)C=CC3CCCC(CC2)C43)C1=O Intermediate Fragment 
202 459.1550628761 CC1=CN(C=[OH+])C(=O)N(C2=C(O)C(O)=C(O)C3=C2C2=C4C(=C3)C=CC3=C4C(CCC3)CC2)C1=O
203 545.1918423081 CC1=CN(C=C=C(O)C(=O)C=[OH+])C(=O)N(C2=C(O)C(O)=C(O)C3=C2C2=C4C(=C3)CCC3CCCC(CC2)C43)C1=O Intermediate Fragment 
204 84.9920203121 O=CC(=O)C#[O+]
205 87.0076703761 O=CC(=[OH+])C=O
206 89.0233204401 O=CC(=[OH+])CO
207 71.0127557561 O=CC#C[OH2+]
208 71.0127557561 CC(=O)C#[O+]
209 73.0284058201 OCC#C[OH2+]
210 73.0284058201 CC(=[OH+])C=O
211 93.0546205681 OCC([OH2+])CO
212 75.0440558841 CC(=[OH+])CO
213 447.1914483841 CC1=CN(C)C(=O)N(C2=C(O)C(O)=C(O)C3=C2C2=C4C(=C3)C=CC3CCCC(CC2)C43)C1=[OH+]
214 445.1757983201 CC1=CN(C)C(=O)N(C2=C(O)C(O)=C(O)C3=C2C2=C4C(=C3)C=CC3=C4C(CCC3)CC2)C1=[OH+]
215 443.1601482561 CC1=CN(C)C(=O)N(C2=C(O)C(O)=C(O)C3=C2C2=C4C(=C3)C=CC3=C4C(=CC2)CCC3)C1=[OH+]
216 425.1495835721 CC1=CN(C)C(=O)N(C2=C(O)C(O)=CC3=C2C2=C4C(=C3)C=CC3=C4C(=CC2)C=CC3)C1=[OH+]
217 441.1444981921 CC1=CN(C)C(=O)N(C2=C(O)C(O)=C(O)C3=C2C2=C4C(=C3)C=CC3=C4C(=CC2)C=CC3)C1=[OH+]
218 139.0502038841 [CH2+]N1C=C(C)C(=O)N=C1O
219 423.1339335081 [CH2+]N1C=C(C)C(=O)N(C2=C(O)C(O)=CC3=C2C2=C4C(=C3)C=CC3=C4C(=CC2)C=CC3)C1=O
220 441.1444981921 CC(=CN(C)C#[O+])C(=O)N=C1C(O)=C(O)C(O)=C2CC3=C4C(=C12)CC=C1C=CCC(=C14)C=C3 Intermediate Fragment 
221 413.1495835721 C=[NH+]C=C(C)C(=O)N=C1C(O)=C(O)C(=O)C2CC3=C4C(=C12)CC=C1C=CCC(=C14)C=C3
222 441.1444981921 CC1=CN(C)C(=O)N(C(=CO)C2=C(C(O)=C=O)C=C3C=CC4=C5C(=CCC2=C35)C=CC4)C1=[OH+] Intermediate Fragment 
223 441.1444981921 CC1=CN(C)C(=O)N(C(=C(O)C=O)C2=C3CC=C4C=CCC5=C4C3=C(C=C5)CC2=C=O)C1=[OH+] Intermediate Fragment 
224 441.1444981921 [CH2+]N1C=C(C)C(=O)N(CC2=C3CC=C4C=CCC5=C4C3=C(C=C5)CC2=C(O)C(O)=C=O)C1=O Intermediate Fragment 
225 381.1233688241 CC1=CN(C)C(=O)N(C=C2C(=C=O)C=C3C=CC4=C5C(=CC=C4)C=CC2=C35)C1=[OH+]
226 439.1288481281 [CH2+]N1C=C(C)C(=O)N(C2=C(O)C(O)=C(O)C3=C2C2=C4C(=C3)C=CC3=C4C(=CC2)C=CC3)C1=O
227 527.1812776241 CC1=CN(C=C=C(O)C#C[OH2+])C(=O)N(C2=C(O)C(O)=C(O)C3=C2C2=C4C(=C3)C=CC3CCCC(CC2)C43)C1=O
228 77.0597059481 OCCC[OH2+]
229 509.1707129401 C#CC(O)=C=CN1C=C(C)C(=[OH+])N(C2=C(O)C(O)=C(O)C3=C2C2=C4C(=C3)C=CC3=C4C(CCC3)CC2)C1=O
230 509.1707129401 CC1=CN(C=C=C(O)C#C[OH2+])C(=O)N(C2=C(O)C(O)=CC3=C2C2=C4C(=C3)C=CC3=C4C(CCC3)CC2)C1=O
231 509.1707129401 CC1=CN(CC#CC#C[OH2+])C(=O)N(C2=C(O)C(O)=C(O)C3=C2C2=C4C(=C3)C=CC3=C4C(CCC3)CC2)C1=O
232 485.1707129401 CC1=CN(CC#CO)C(=O)N(C2=C(O)C(O)=C(O)C3=C2C2=C4C(=C3)C=CC3=C4C(CCC3)CC2)C1=[OH+]
233 483.1550628761 CC1=CN(CC#CO)C(=O)N(C2=C(O)C(O)=C(O)C3=C2C2=C4C(=C3)C=CC3=C4C(=CC2)CCC3)C1=[OH+]
234 481.1394128121 CC1=CN(CC#CO)C(=O)N(C2=C(O)C(O)=C(O)C3=C2C2=C4C(=C3)C=CC3=C4C(=CC2)C=CC3)C1=[OH+]
235 527.1812776241 CC(=CN=C=C=C(O)C#C[OH2+])C(=O)N(C=O)C1=C(O)C(O)=C(O)C2=C1C1=C3C(=C2)C=CC2CCCC(CC1)C32 Intermediate Fragment 
236 489.2020130681 CC1=CN(CC#CO)C(=O)N(C2=C(O)C(O)=C(O)C3=C2C2=C4C(=C3)CCC3CCCC(CC2)C43)C1=[OH+]
237 487.1863630041 CC1=CN(CC#CO)C(=O)N(C2=C(O)C(O)=C(O)C3=C2C2=C4C(=C3)C=CC3CCCC(CC2)C43)C1=[OH+]
238 469.1757983201 C#CCN1C=C(C)C(=[OH+])N(C2=C(O)C(O)=C(O)C3=C2C2=C4C(=C3)C=CC3=C4C(CCC3)CC2)C1=O
239 183.0764186321 CC1=CN(C=C=CO)C(O)NC1=[OH+]
240 467.1601482561 CC1=CN(CC#CO)C(=O)N(C2=C(O)C(O)=CC3=C2C2=C4C(=C3)C=CC3=C4C(=CC2)CCC3)C1=[OH+]
241 467.1601482561 C#CCN1C=C(C)C(=[OH+])N(C2=C(O)C(O)=C(O)C3=C2C2=C4C(=C3)C=CC3=C4C(=CC2)CCC3)C1=O
242 485.1707129401 CC(=CN(C=O)CC#CO)C(=[OH+])N=C1C(O)=C(O)C(O)=C2CC3=C4C(=C12)CC=C1CCCC(=C14)C=C3 Intermediate Fragment 
243 457.1757983201 CC(=C[NH+]=CC#CO)C(=O)N=C1C(O)=C(O)C(O)=C2CC3=C4C(=C12)CCC1CCCC(=C41)C=C3
244 485.1707129401 CC1=CN(CC#CO)C(=O)N(C(=C(O)CO)C2=C3CC=C4C=CCC5=C4C3=C(C=C5)CC2=CO)C1=[OH+] Intermediate Fragment 
245 485.1707129401 CC1=CN(CC#CO)C(=O)N(CC2=C3CC=C4C=CCC5=C4C3=C(C=C5)CC2=C(O)C(O)=CO)C1=[OH+] Intermediate Fragment 
246 465.1444981921 CC1=CN(CC#CO)C(=O)N(C2=C(O)C(O)=CC3=C2C2=C4C(=C3)C=CC3=C4C(=CC2)C=CC3)C1=[OH+]
247 59.0127557561 O=C=C[OH2+]
248 41.0021910721 [CH+]=C=O
249 63.0440558841 OCC[OH2+]
250 545.1918423081 CC1=CN(C(O)=C=C(O)C#C[OH2+])C(=O)N(C2=C(O)C(O)=C(O)C3=C2C2=C4C(=C3)CCC3CCCC(CC2)C43)C1=O Intermediate Fragment 
251 477.2020130681 C=C([OH2+])N1C=C(C)C(=O)N(C2=C(O)C(O)=C(O)C3=C2C2=C4C(=C3)CCC3CCCC(CC2)C43)C1=O
252 475.1863630041 C=C([OH2+])N1C=C(C)C(=O)N(C2=C(O)C(O)=C(O)C3=C2C2=C4C(=C3)C=CC3CCCC(CC2)C43)C1=O
253 469.1394128121 C=C([OH2+])N1C=C(C)C(=O)N(C2=C(O)C(O)=C(O)C3=C2C2=C4C(=C3)C=CC3=C4C(=CC2)C=CC3)C1=O
254 68.9971056921 [O+]#CC#CO
255 461.1707129401 CC1=CN(C=[OH+])C(=O)N(C2=C(O)C(O)=C(O)C3=C2C2=C4C(=C3)C=CC3CCCC(CC2)C43)C1=O
256 457.1394128121 CC1=CN(C=[OH+])C(=O)N(C2=C(O)C(O)=C(O)C3=C2C2=C4C(=C3)C=CC3=C4C(=CC2)CCC3)C1=O
257 439.1288481281 CC1=CN(C=[OH+])C(=O)N(C2=C(O)C(O)=CC3=C2C2=C4C(=C3)C=CC3=C4C(=CC2)C=CC3)C1=O
258 457.1394128121 CC(=CN(C=O)C=[OH+])C(=O)N=C1C(O)=C(O)C(O)=C2CC3=C4C(=C12)CC=C1C=CCC(=C14)C=C3 Intermediate Fragment 
259 457.1394128121 CC1=CN(C=[OH+])C(=O)N(CC2=C3CC=C4C=CCC5=C4C3=C(C=C5)CC2=C(O)C(O)=C=O)C1=O Intermediate Fragment 
260 455.1237627481 CC1=CN(C=[OH+])C(=O)N(C2=C(O)C(O)=C(O)C3=C2C2=C4C(=C3)C=CC3=C4C(=CC2)C=CC3)C1=O
261 87.0440558841 C=C(O)C=C[OH2+]
262 71.0491412641 C=CC(=C)[OH2+]
263 71.0491412641 C#CCC[OH2+]
264 91.0753560121 CC(O)CC[OH2+]
265 73.0647913281 C=C([OH2+])CC
266 503.1812776241 CC1=CN(C(=[OH+])C#CO)C(=O)N(C2=C(O)C(O)=C(O)C3=C2C2=C4C(=C3)CCC3CCCC(CC2)C43)C1=O
267 485.1707129401 C#CC(=[OH+])N1C=C(C)C(=O)N(C2=C(O)C(O)=C(O)C3=C2C2=C4C(=C3)C=CC3CCCC(CC2)C43)C1=O
268 501.1656275601 CC1=CN(C(=[OH+])C#CO)C(=O)N(C2=C(O)C(O)=C(O)C3=C2C2=C4C(=C3)C=CC3CCCC(CC2)C43)C1=O
269 483.1550628761 CC1=CN(C(=[OH+])C#CO)C(=O)N(C2=C(O)C(O)=CC3=C2C2=C4C(=C3)C=CC3=C4C(CCC3)CC2)C1=O
270 483.1550628761 C#CC(=[OH+])N1C=C(C)C(=O)N(C2=C(O)C(O)=C(O)C3=C2C2=C4C(=C3)C=CC3=C4C(CCC3)CC2)C1=O
271 501.1656275601 CC(=CN(C=O)C(=[OH+])C#CO)C(=O)N=C1C(O)=C(O)C(O)=C2CC3=C4C(=C12)CCC1CCCC(=C41)C=C3 Intermediate Fragment 
272 499.1499774961 CC1=CN(C(=[OH+])C#CO)C(=O)N(C2=C(O)C(O)=C(O)C3=C2C2=C4C(=C3)C=CC3=C4C(CCC3)CC2)C1=O
273 545.1918423081 CC1=CN(C(=C=CO)OC#C[OH2+])C(=O)N(C2=C(O)C(O)=C(O)C3=C2C2=C4C(=C3)CCC3CCCC(CC2)C43)C1=O Intermediate Fragment 
274 515.1812776241 C=C([OH+]C#CO)N1C=C(C)C(=O)N(C2=C(O)C(O)=C(O)C3=C2C2=C4C(=C3)C=CC3CCCC(CC2)C43)C1=O
275 545.1918423081 CC=C(O)N(C(=O)N(C)C1C=C(O)C(=C=[OH+])O1)C1=C(O)C(O)=C(O)C2=C1C1=C3C(=C2)C=CC2=C3C(CCC2)CC1 Intermediate Fragment 
276 491.1812776241 C[NH+](C(O)=NC1=C(O)C(O)=C(O)C2=C1C1=C3C(=C2)C=CC2CCCC(CC1)C32)C1C=C(O)C(=C=O)O1
277 545.1918423081 CC=CN(C(=O)N(C=O)C1=C(O)C(O)=C(O)C2=C1C1=C3C(=C2)C=CC2CCCC(CC1)C32)C1C=C(O)C(=C=[OH+])O1 Intermediate Fragment 
278 545.1918423081 CC(C=O)=CN(C(O)=NC1=C(O)C(O)=C(O)C2=C1C1=C3C(=C2)C=CC2CCCC(CC1)C32)C1C=C(O)C(=C=[OH+])O1 Intermediate Fragment 
279 517.1969276881 CC#C[NH+](C(O)=NC1=C(O)C(O)=C(O)C2=C1C1=C3C(=C2)CCC2CCCC(CC1)C32)C1C=C(O)C(=C=O)O1
280 545.1918423081 CC(=CN(C=O)C1C=C(O)C(=C=[OH+])O1)C(=O)N=C1C(O)=C(O)C(O)=C2CC3=C4C(=C12)CCC1CCCC(C=C3)C41 Intermediate Fragment 
281 392.1856347321 C=C(C)C(=O)[NH+]=C1C(O)=C(O)C(O)C2CC3=C4C(=C12)CCC1CCCC(=C41)C=C3
282 390.1699846681 C=C(C)C(=O)[NH+]=C1C(O)=C(O)C(O)C2CC3=C4C(=C12)CC=C1CCCC(=C14)C=C3
283 388.1543346041 C=C(C)C(=O)[NH+]=C1C(O)=C(O)C(O)C2CC3=C4C(=C12)CC=C1C=CCC(=C14)C=C3
284 386.1386845401 C=C(C)C(=O)[NH+]=CC1=C2CC=C3C=CCC4=C3C2=C(C=C4)CC1=C(O)C(O)=C=O Intermediate Fragment 
285 366.1124697921 [CH+]=C(C)C(=O)N=C1C(=O)C(=O)C=C2CC3=C4C(=C21)CC=C1C=CCC(=C14)C=C3
286 384.1230344761 C=C(C)C(=O)[N+]#CC1=C2CC=C3C=CCC4=C3C2=C(C=C4)CC1=C(O)C(O)=C=O Intermediate Fragment 
287 200.0917343481 CCC[NH+](CO)C1C=C(O)C(=C=O)O1
288 517.1969276881 CC(=C[NH+]=C1C=C(O)C(=C=O)O1)C(=O)N=C1C(O)=C(O)C(O)=C2CC3=C4C(=C12)CCC1CCCC(CC3)C41
289 499.1863630041 C=C1OC(=[NH+]C=C(C)C(=O)N=C2C(O)=C(O)C(O)=C3CC4=C5C(=C23)CCC2CCCC(=C52)C=C4)C=C1O
290 499.1863630041 CC(=C[NH+]=C1C=C(O)C(=C=O)O1)C(=O)N=C1C(O)=C(O)C=C2CC3=C4C(=C21)CCC1CCCC(C=C3)C41
291 517.1969276881 C=C([NH+]=C=C(C)C(=O)N=C1C(O)=C(O)C(O)=C2CC3=C4C(=C12)CCC1CCCC(C=C3)C41)OC(=C=O)CO Intermediate Fragment 
292 517.1969276881 C=C(O)C(=C=O)OC=[NH+]C=C(C)C(=O)N=C1C(O)=C(O)C(O)=C2CC3=C4C(=C12)CCC1CCCC(C=C3)C41 Intermediate Fragment 
293 517.1969276881 CC(=C[NH+]=C=C=C(O)C(=O)C=O)C(=O)N=C1C(O)=C(O)C(O)=C2CC3=C4C(=C12)CCC1CCCC(CC3)C41 Intermediate Fragment 
294 517.1969276881 CC(=C=[NH+]C(O)=C=C(O)C#CO)C(=O)N=C1C(O)=C(O)C(O)=C2CC3=C4C(=C12)CCC1CCCC(CC3)C41 Intermediate Fragment 
295 431.1601482561 CC(=C[NH+]=C=O)C(=O)N=C1C(O)=C(O)C(O)=C2CC3=C4C(=C12)CCC1CCCC(=C41)C=C3
296 473.1707129401 CC(=C=[NH+]C(=O)C#CO)C(=O)N=C1C(O)=C(O)C(O)=C2CC3=C4C(=C12)CCC1CCCC(C=C3)C41
297 517.1969276881 CC(=C=[NH+]C(=C=CO)OC#CO)C(=O)N=C1C(O)=C(O)C(O)=C2CC3=C4C(=C12)CCC1CCCC(CC3)C41 Intermediate Fragment 
298 515.1812776241 CC(=C[NH+]=C1C=C(O)C(=C=O)O1)C(=O)N=C1C(O)=C(O)C(O)=C2CC3=C4C(=C12)CCC1CCCC(C=C3)C41
299 545.1918423081 CC(=CN=C1C=C(O)C(=C=[OH+])O1)C(=O)N(C=O)C1=C(O)C(O)=C(O)C2=C1C1=C3C(=C2)CCC2CCCC(CC1)C32 Intermediate Fragment 
300 545.1918423081 C=C(C)C(=O)N(C(=O)N=C1C=C(O)C(=C=[OH+])O1)C1=C(O)C(O)=C(O)C2=C1C1=C3C(=C2)CCC2CCCC(CC1)C32 Intermediate Fragment 
301 545.1918423081 CC1=CN(C2C=C(O)C(=C=[OH+])O2)C(=O)N(C(=CO)C2=C(C(O)=CO)C=C3C=CC4CCCC5CCC2=C3C45)C1=O Intermediate Fragment 
302 517.1969276881 CC1=CN(C2C=C(O)C(=C=[OH+])O2)C(=O)N(C(=CO)C2=C3CCC4CCCC5C=CC(=C3C54)CC2=CO)C1=O
303 515.1812776241 CC1=CN(C2C=C(O)C(=C=[OH+])O2)C(=O)N(C(=CO)C2=C3CCC4CCCC5=C4C3=C(C=C5)CC2=CO)C1=O
304 489.2020130681 CC1=CN(C2C=C(O)C(=C=[OH+])O2)C(=O)N(C(=CO)C2=CC=C3CCC4CCCC5CCC2=C3C45)C1=O
305 487.1863630041 CC1=CN(C2C=C(O)C(=C=[OH+])O2)C(=O)N(C(=CO)C2=CC=C3C=CC4CCCC5CCC2=C3C45)C1=O
306 485.1707129401 CC1=CN(C2C=C(O)C(=C=[OH+])O2)C(=O)N(C(=CO)C2=CC=C3C=CC4=C5C3=C2CCC5CCC4)C1=O
307 369.1233688241 CC1=C([OH2+])N(C(=C=O)C2=CC=C3C=CC4=C5C(=CCC2=C35)C=CC4)C(=O)N=C1
308 483.1550628761 CC1=CN(C2C=C(O)C(=C=[OH+])O2)C(=O)N(C(=CO)C2=CC=C3C=CC4=C5C(=CCC2=C35)CCC4)C1=O
309 455.1601482561 CC1=CN(C2C=C(O)C(=C=[OH+])O2)C(=O)N(CC2=CC=C3C=CC4=C5C(=CCC2=C35)CCC4)C1=O
310 545.1918423081 CC1=CN(C2C=C(O)C(=C=[OH+])O2)C(=O)N(C(=C(O)CO)C2=C3CCC4CCCC5=C4C3=C(C=C5)CC2=CO)C1=O Intermediate Fragment 
311 483.1550628761 CC1=CN(C2C=C(O)C(=C=[OH+])O2)C(=O)N(CC2=C3CC=C4C=CCC5=C4C3=C(C=C5)CC2=CO)C1=O
312 485.1707129401 CC1=CN(C2C=C(O)C(=C=[OH+])O2)C(=O)N(CC2=C3CC=C4CCCC5=C4C3=C(C=C5)CC2=CO)C1=O
313 487.1863630041 CC1=CN(C2C=C(O)C(=C=[OH+])O2)C(=O)N(CC2=C3CCC4CCCC5=C4C3=C(C=C5)CC2=CO)C1=O
314 515.1812776241 CC1=CN(C2C=C(O)C(=C=[OH+])O2)C(=O)N(C(C2=CC=C3C=CC4=C5C3=C2CCC5CCC4)=C(O)CO)C1=O
315 399.1339335081 CC1=C([OH2+])N(C(C2=CC=C3C=CC4=C5C(=CCC2=C35)C=CC4)=C(O)C=O)C(=O)N=C1
316 317.1343274321 CC1CN(C2C=C(O)C(=C=[OH+])O2)C(O)N(CC(O)CO)C1O
317 317.1343274321 CC1CN(C(O)=C=C(O)C#C[OH2+])C(O)N(CC(O)CO)C1O Intermediate Fragment 
318 315.1186773681 CC1=CN(C2C=C(O)C(=C=[OH+])O2)C(O)N(CC(O)CO)C1O
319 545.1918423081 CC1=CN(C2C=C(O)C(=C=[OH+])O2)C(=O)N(C(C2=CC=C3C=CC4CCCC5CCC2=C3C45)=C(O)C(O)=CO)C1=O Intermediate Fragment 
320 545.1918423081 CC1=CN(C2C=C(O)C(=C=[OH+])O2)C(=O)N(C=C(O)C(O)=C(O)C2=CC3=C4C(=C2)C=CC2CCCC(CC3)C42)C1=O Intermediate Fragment 
321 255.0975480001 CC1=CN(C2C=C(O)C(=C=[OH+])O2)C(O)N(C)C1O
322 545.1918423081 CC1=CN(C2C=C(O)C(=C=[OH+])O2)C(=O)N(CC2=C3CCC4CCCC5=C4C3=C(C=C5)CC2=C(O)C(O)=CO)C1=O Intermediate Fragment 
323 517.1969276881 CC1=CN(C2C=C(O)C(=C=[OH+])O2)C(=O)N(CC2=C(C(O)=CO)C=C3C=CC4CCCC5CCC2=C3C45)C1=O
324 399.1339335081 CC1=C([OH2+])N(CC2=C(C(O)=C=O)C=C3C=CC4=C5C(=CCC2=C35)C=CC4)C(=O)N=C1
325 515.1812776241 CC1=CN(C2C=C(O)C(=C=[OH+])O2)C(=O)N(CC2=C(C(O)=CO)C=C3C=CC4=C5C3=C2CCC5CCC4)C1=O
326 513.1656275601 CC1=CN(C2C=C(O)C(=C=[OH+])O2)C(=O)N(CC2=C(C(O)=CO)C=C3C=CC4=C5C(=CCC2=C35)CCC4)C1=O
327 461.2070984481 CC1=CN(C2C=C(O)C(=C=[OH+])O2)C(=O)N(CC2=CC=C3CCC4CCCC5CCC2=C3C45)C1=O
328 459.1914483841 CC1=CN(C2C=C(O)C(=C=[OH+])O2)C(=O)N(CC2=CC=C3C=CC4CCCC5CCC2=C3C45)C1=O
329 457.1757983201 CC1=CN(C2C=C(O)C(=C=[OH+])O2)C(=O)N(CC2=CC=C3C=CC4=C5C3=C2CCC5CCC4)C1=O
330 453.1444981921 CC1=CN(C2C=C(O)C(=C=[OH+])O2)C(=O)N(CC2=CC=C3C=CC4=C5C(=CCC2=C35)C=CC4)C1=O
331 453.1444981921 CC1=CN(C=C=C(O)C(=O)C=[OH+])C(=O)N(CC2=CC=C3C=CC4=C5C(=CCC2=C35)C=CC4)C1=O Intermediate Fragment 
332 291.1015707601 O=C(CO)C(=[OH+])C1C=C2C=CC3=CC=CC4=C3C2=C(C=C4)C1
333 545.1918423081 CC1=CN(C2C=C(O)C(=C=[OH+])O2)C(=O)N(C2=C(O)C(O)=C(O)C(C=C3C=CC4CCCC5CCC=C3C45)=C2)C1=O Intermediate Fragment 
334 545.1918423081 C=CC1=CC2=C(C3=C1C1CCCCC1CC3)C(N1C(=O)C(C)=CN(C3C=C(O)C(=C=[OH+])O3)C1=O)=C(O)C(O)=C2O Intermediate Fragment 
335 545.1918423081 C=CC1CCCC2CCC3=C(C=CC4=C3C(N3C(=O)C(C)=CN(C5C=C(O)C(=C=[OH+])O5)C3=O)=C(O)C(O)=C4O)C12 Intermediate Fragment 
336 545.1918423081 CCC1CCCC2C=CC3=CC4=C(C=C3C21)C(N1C(=O)C(C)=CN(C2C=C(O)C(=C=[OH+])O2)C1=O)=C(O)C(O)=C4O Intermediate Fragment 
337 545.1918423081 CCCC1C=CC2=CC3=C(C4=C2C1CCC4)C(N1C(=O)C(C)=CN(C2C=C(O)C(=C=[OH+])O2)C1=O)=C(O)C(O)=C3O Intermediate Fragment 
338 543.1761922441 CC1=CN(C2C=C(O)C(=C=[OH+])O2)C(=O)N(C2=C(O)C(O)=C(O)C3=C2C2=C4C(=C3)C=CC3CCCC(CC2)C43)C1=O
