#In-silico ESI-MS/MS [M+H]+ Spectra
#PREDICTED BY CFM-ID 4.0.8
#SMILES=[C@H]1(C[C@@H](O[C@@H]1CO)n1c(cc(nc1=O)N)Nc1ccc(cc1)n1c2c(c3c1cncc3)cccc2)O
#InChiKey=OJODKVSPTVNLKX-TZBSWOFLSA-N
energy0
369.14584 100.00 6 33 40 62 56 46 24 63 52 60 53 55 50 58 (57.408 2.0557 1.701 0.20031 0.070053 0.066226 0.034386 0.031551 0.018475 0.0065101 0.005966 0.0023157 0.0013575 0.0005313)
485.19318 48.19 0 183 226 106 102 232 268 276 247 93 257 227 250 260 253 254 275 255 265 251 267 256 266 (28.887 0.50597 0.080965 0.059497 0.031578 0.028328 0.028106 0.022461 0.010933 0.0076466 0.0061551 0.0050487 0.0039572 0.0036678 0.0021588 0.0017601 0.00091397 0.00064058 0.00061873 0.00054536 0.0005261 0.00011691 7.0318e-05)
energy1
324.12437 3.56 29 35 (1.7176 0.736)
326.14002 11.72 30 34 (4.4956 3.5871)
369.14584 100.00 6 33 24 40 52 56 62 46 60 50 53 58 63 55 (59.477 3.9024 3.4494 1.0764 0.25179 0.23784 0.20096 0.12499 0.11249 0.046168 0.032168 0.025111 0.019493 0.0058929)
397.14075 3.56 105 197 191 195 201 205 203 207 209 212 206 (2.1655 0.17172 0.060251 0.016435 0.015542 0.011133 0.0091392 0.0039878 0.002537 0.001156 9.642e-05)
energy2
45.03349 7.76 74 (1.6939)
55.01784 4.58 187 (1.001)
57.03349 22.46 72 (4.9047)
61.02841 4.32 121 (0.94417)
71.04914 4.98 216 217 (0.69574 0.39166)
73.02841 3.01 124 123 (0.60351 0.053668)
169.07602 18.23 9 (3.9813)
260.11822 6.15 21 (1.3436)
309.11347 3.02 41 (0.65906)
311.12912 4.82 139 133 (0.91866 0.13438)
324.12437 2.89 29 35 (0.44837 0.183)
326.14002 3.30 30 34 (0.39231 0.32775)
354.13494 2.84 193 132 78 (0.34969 0.22903 0.041601)
356.15059 5.07 252 244 (0.61278 0.49398)
369.14584 28.91 6 24 40 33 52 50 46 53 62 63 55 60 56 58 (2.3433 2.026 0.39392 0.37839 0.32862 0.25465 0.17303 0.12045 0.094047 0.07988 0.055399 0.027308 0.025375 0.012534)
371.16149 4.45 5 (0.97168)
380.11420 3.18 189 196 (0.59578 0.09832)
381.14584 12.81 131 104 138 141 140 142 143 (1.0831 0.68134 0.38717 0.3492 0.1306 0.097777 0.06841)
383.19787 3.58 108 (0.78123)
393.14584 14.63 94 (3.1954)
395.12510 6.16 211 213 (1.0084 0.33766)
395.16149 100.00 96 95 (12.493 9.3441)
397.14075 51.86 197 105 191 205 195 201 209 203 212 207 206 (2.9255 2.8389 2.1632 1.2176 0.55075 0.45956 0.38704 0.27515 0.20795 0.19486 0.10418)
397.17714 7.21 12 164 (1.4005 0.17411)
405.14584 4.13 175 173 (0.70081 0.20055)
407.16149 9.35 161 158 (1.9438 0.097135)
409.17714 10.05 156 (2.1941)
411.19279 3.89 154 (0.84973)
425.17205 4.38 221 15 170 168 162 166 165 167 172 (0.45239 0.12479 0.079684 0.06615 0.065919 0.056178 0.042588 0.03761 0.031174)
442.18737 4.41 245 (0.96344)

0 485.1931797001 [NH3+]c1cc(Nc2ccc(-n3c4ccccc4c4ccncc43)cc2)n(C2CC(O)C(CO)O2)c(=O)n1
1 453.1669649521 [NH3+]C1=NC(=O)N(C2C=C(O)CO2)C(N=C2C=CC(N3C4=CN=CC=C4C4=C3C=CC=C4)=CC2)=C1
2 455.1826150161 [NH3+]C1=NC(=O)N(C2C=C(O)CO2)C(N=C2C=CC(N3C4=CN=CC=C4C4=C3CCC=C4)=CC2)=C1
3 457.1982650801 [NH3+]C1=NC(=O)N(C2C=C(O)CO2)C(N=C2C=CC(N3C4=CN=CC=C4C4=C3CCCC4)=CC2)=C1
4 467.1826150161 C=C1OC(N2C(=O)N=C([NH3+])C=C2N=C2C=CC(N3C4=CN=CC=C4C4=C3CCC=C4)=CC2)C=C1O
5 371.1614856481 [NH3+]C1=CC(N=C2C=CC(N3C4=CN=CC=C4C4=C3CCC=C4)=CC2)=NC(O)=N1
6 369.1458355841 [NH3+]C1=CC(N=C2C=CC(N3C4=CN=CC=C4C4=C3C=CC=C4)=CC2)=NC(O)=N1
7 99.0440558841 C=C1OC=CC1[OH2+]
8 450.1560659201 C=C1OC(N2C(=O)N=CC=C2[NH+]=C2C=CC(N3C4=CN=CC=C4C4=C3C=CC=C4)=CC2)C=C1O
9 169.0760247081 C1=CC2=[NH+]C3=CN=CCC3=C2C=C1
10 449.1720503321 C=C1C=CC(N2C(=O)N=C([NH3+])C=C2N=C2C=CC(N3C4=CN=CC=C4C4=C3C=CC=C4)=CC2)O1
11 467.1826150161 CC(=O)C(O)=C=CN1C(=O)N=C([NH3+])C=C1N=C1C=CC(N2C3=CN=CC=C3C3=C2CCC=C3)=CC1 Intermediate Fragment 
12 397.1771357121 C#CN1C(=O)N=C([NH3+])C=C1N=C1C=CC(N2C3=CN=CC=C3C3=C2CCCC3)=CC1
13 467.1826150161 C#CC(O)=C=C(O)N1C(=O)N=C([NH3+])C=C1N=C1C=CC(N2C3=CN=CC=C3C3=C2CCCC3)=CC1 Intermediate Fragment 
14 467.1826150161 C#COC(=C=CO)N1C(=O)N=C([NH3+])C=C1N=C1C=CC(N2C3=CN=CC=C3C3=C2CCCC3)=CC1 Intermediate Fragment 
15 425.1720503321 [NH3+]C1=NC(=O)N(CC#CO)C(N=C2C=CC(N3C4=CN=CC=C4C4=C3CCC=C4)=CC2)=C1
16 441.1669649521 [NH3+]C1=NC(=O)N(C(=O)C#CO)C(N=C2C=CC(N3C4=CN=CC=C4C4=C3CCCC4)=CC2)=C1
17 467.1826150161 C=C1OC(N(C(=C)N=C2C=CC(N3C4=CN=CC=C4C4=C3CCC=C4)=CC2)C(=O)N=C=[NH2+])C=C1O Intermediate Fragment 
18 467.1826150161 C=C1OC(N(C(=N)O)C(=C=C=[NH2+])N=C2C=CC(N3C4=CN=CC=C4C4=C3CCC=C4)=CC2)C=C1O Intermediate Fragment 
19 440.1717159841 C=C1OC([NH+](C(=C)N=C2C=CC(N3C4=CN=CC=C4C4=C3C=CC=C4)=CC2)C(=N)O)=CC1O
20 375.1927857761 [NH3+]C1=CC(N=C2C=CC(N3C4=C(CCN=C4)C4=C3CCCC4)=CC2)=NC(O)=N1
21 260.1182238681 [NH2+]=C1C=CC(N2C3=CN=CC=C3C3=C2C=CC=C3)=CC1
22 375.1927857761 N=C(O)N=C(C=C=[NH2+])N=C1C=CC(N2C3=C(CCN=C3)C3=C2CCCC3)=CC1 Intermediate Fragment 
23 373.1771357121 [NH3+]C1=CC(N=C2C=CC(N3C4=CN=CC=C4C4=C3CCCC4)=CC2)=NC(O)=N1
24 369.1458355841 N=C(C=C([NH3+])N=C=O)N=C1C=CC(N2C3=CN=CC=C3C3=C2C=CC=C3)=CC1 Intermediate Fragment 
25 352.1192864881 NC(C#CN=C1C=CC(N2C3=CN=CC=C3C3=C2C=CC=C3)=CC1)=[N+]=C=O
26 285.1134728361 [NH+]#CN=C1C=CC(N2C3=CN=CC=C3C3=C2C=CC=C3)=CC1
27 299.1291229001 [CH2+]C(=N)N=C1C=CC(N2C3=CN=CC=C3C3=C2C=CC=C3)=CC1
28 301.1447729641 CC(=[NH2+])N=C1C=CC(N2C3=CN=CC=C3C3=C2C=CC=C3)=CC1
29 324.1243718681 N=C=[C+]C(=N)N=C1C=CC(N2C3=CN=CC=C3C3=C2C=CC=C3)=CC1
30 326.1400219321 N=C=CC(=[NH2+])N=C1C=CC(N2C3=CN=CC=C3C3=C2C=CC=C3)=CC1
31 341.1509209641 N=C([C+]=C(N)N)N=C1C=CC(N2C3=CN=CC=C3C3=C2C=CC=C3)=CC1
32 367.1301855201 N=C([C+]=C(N)N=C=O)N=C1C=CC(N2C3=CN=CC=C3C3=C2C=CC=C3)=CC1
33 369.1458355841 NC(N)=CC(N=C1C=CC(N2C3=CN=CC=C3C3=C2C=CC=C3)=CC1)=NC#[O+] Intermediate Fragment 
34 326.1400219321 NC(=[NH2+])C=C=NC1=CC=C(N2C3=CN=CC=C3C3=C2C=CC=C3)C=C1
35 324.1243718681 N=C(N)[C+]=C=NC1=CC=C(N2C3=CN=CC=C3C3=C2C=CC=C3)C=C1
36 311.0927373921 [O+]#CN=C=NC1=CC=C(N2C3=CN=CC=C3C3=C2C=CC=C3)C=C1
37 325.1083874561 [CH+]=C(N=C=O)N=C1C=CC(N2C3=CN=CC=C3C3=C2C=CC=C3)=CC1
38 327.1240375201 C=C(N=C1C=CC(N2C3=CN=CC=C3C3=C2C=CC=C3)=CC1)[NH+]=C=O
39 352.1192864881 NC#CC(N=C1C=CC(N2C3=CN=CC=C3C3=C2C=CC=C3)=CC1)=NC#[O+]
40 369.1458355841 N=C(O)N=C(C=C=[NH2+])N=C1C=CC(N2C3=CN=CC=C3C3=C2C=CC=C3)=CC1 Intermediate Fragment 
41 309.1134728361 [NH+]#CC=C=NC1=CC=C(N2C3=CN=CC=C3C3=C2C=CC=C3)C=C1
42 307.0978227721 N#C[C+]=C=NC1=CC=C(N2C3=CN=CC=C3C3=C2C=CC=C3)C=C1
43 328.1192864881 N=C(O)[NH+]=C=NC1=CC=C(N2C3=CN=CC=C3C3=C2C=CC=C3)C=C1
44 342.1349365521 [CH2+]C(N=C1C=CC(N2C3=CN=CC=C3C3=C2C=CC=C3)=CC1)=NC(=N)O
45 367.1301855201 N=C=[C+]C(N=C1C=CC(N2C3=CN=CC=C3C3=C2C=CC=C3)=CC1)=NC(=N)O
46 369.1458355841 CC(N=C1C=CC(N2C3=CN=CC=C3C3=C2C=CC=C3)=CC1)=NC(=O)N=C=[NH2+] Intermediate Fragment 
47 284.1182238681 C#C[NH+]=C1C=CC(N2C3=CN=CC=C3C3=C2C=CC=C3)=CC1
48 282.1025738041 [C+]#CN=C1C=CC(N2C3=CN=CC=C3C3=C2C=CC=C3)=CC1
49 367.1301855201 [CH2+]C(N=C1C=CC(N2C3=CN=CC=C3C3=C2C=CC=C3)=CC1)=NC(=O)N=C=N
50 369.1458355841 C=C([NH3+])N=C(O)N=C=NC1=CC=C(N2C3=CN=CC=C3C3=C2C=CC=C3)C=C1 Intermediate Fragment 
51 57.0447245801 [CH+]=C(N)N
52 369.1458355841 NC(O)=NC([NH3+])=C=C=NC1=CC=C(N2C3=CN=CC=C3C3=C2C=CC=C3)C=C1 Intermediate Fragment 
53 369.1458355841 C=CC(C=C=CN1C2=CN=CC=C2C2=C1C=CC=C2)=NC1=NC(O)=NC([NH3+])=C1 Intermediate Fragment 
54 343.1301855201 [NH3+]C1=CC(N=CCC#CN2C3=CN=CC=C3C3=C2C=CC=C3)=NC(O)=N1
55 369.1458355841 C=CC(=C=C=C=NC1=NC(O)=NC([NH3+])=C1)N1C2=CN=CC=C2C2=C1CCC=C2 Intermediate Fragment 
56 369.1458355841 C=C1C(=C=C=N)C2=C(C=CC=C2)N1C1=CCC(=NC2=NC(O)=NC([NH3+])=C2)C=C1 Intermediate Fragment 
57 342.1349365521 [CH+]=C1C(=C)C2=C(C=CC=C2)N1C1=CCC(=NC2=NC(O)=NC(N)=C2)C=C1
58 369.1458355841 C=C=C1C(=C=N)N(C2=CCC(=NC3=NC(O)=NC([NH3+])=C3)C=C2)C2=C1C=CC=C2 Intermediate Fragment 
59 342.1349365521 C#CC1=CN(C2=CCC(=NC3=NC(O)=NC([NH3+])=C3)C=C2)C2=C1C=CC=C2
60 369.1458355841 C=C=C=CC1=CN(C2=CCC(=NC3=NC(O)=NC([NH3+])=C3)C=C2)C2=C1C=CN=C2 Intermediate Fragment 
61 343.1301855201 C#CC1=CN(C2=CCC(=NC3=NC(O)=NC([NH3+])=C3)C=C2)C2=C1C=CN=C2
62 369.1458355841 [NH3+]C1=CC(N=C2C=CC(=NC3=CN=CC=C3C3=CC=CC=C3)C=C2)=NC(O)=N1 Intermediate Fragment 
63 369.1458355841 [NH3+]C1=CC(N=C2C=CC(=NC3=CC=CC=C3C3=CC=NC=C3)C=C2)=NC(O)=N1 Intermediate Fragment 
64 115.0389705041 OC1C=COC1=C[OH2+]
65 87.0440558841 [OH2+]C1C=COC1
66 115.0389705041 O=C=C=C(O)CC[OH2+] Intermediate Fragment 
67 117.0546205681 OC1C=COC1C[OH2+]
68 99.0440558841 [OH2+]C=C1C=CCO1
69 117.0546205681 C=COC(=C[OH2+])CO Intermediate Fragment 
70 117.0546205681 C=C=C(O)C(O)C[OH2+] Intermediate Fragment 
71 99.0440558841 C=C=C(O)C=C[OH2+]
72 57.0334912001 CC#C[OH2+]
73 117.0546205681 OC=C=C(O)CC[OH2+] Intermediate Fragment 
74 45.0334912001 C=C[OH2+]
75 117.0546205681 OC=C=COCC[OH2+] Intermediate Fragment 
76 467.1826150161 [NH3+]C1=NCN(C2C=C(O)C(=C=O)O2)C(N=C2C=CC(N3C4=CN=CC=C4C4=C3CCC=C4)=CC2)=C1
77 468.1666306041 O=C=C1OC(N2C(=O)N=CC=C2[NH+]=C2C=CC(N3C4=CN=CC=C4C4=C3CCCC4)=CC2)C=C1O
78 354.1349365521 OC1=NC=CC([NH+]=C2C=CC(N3C4=CN=CC=C4C4=C3C=CC=C4)=CC2)=N1
79 468.1666306041 O=CC(=O)C(O)=C=CN1C(=O)N=CC=C1[NH+]=C1C=CC(N2C3=CN=CC=C3C3=C2CCCC3)=CC1 Intermediate Fragment 
80 224.0665822201 [NH3+]C1=NC(O)N(C2=CC(O)C(=C=O)O2)C=C1
81 226.0822322841 [NH3+]C1C=CN(C2=CC(O)C(=C=O)O2)C(O)N1
82 112.0505382321 [NH3+]C1=CC=NC(O)=N1
83 226.0822322841 [NH3+]C1C=CN(C=C=C(O)C(=O)C=O)C(O)N1 Intermediate Fragment 
84 245.1073248361 C1=CC=C([NH+]2C3=CN=CC=C3C3=C2C=CC=C3)C=C1
85 175.1229749001 C1=C2[NH+]=C3CCCCC3=C2CCN1
86 173.1073248361 C1=NC=C2[NH+]=C3CCCCC3=C2C1
87 171.0916747721 C1=CC2=C3CC=NC=C3[NH+]=C2CC1
88 317.1244314441 [NH3+]C1=NC(=O)N(C2=CC(O)C(=C=O)O2)C(N=C2CCCCC2)=C1
89 467.1826150161 [NH3+]C1=NC(=O)N(C2C=CC(=C=O)O2)C(N=C2C=CC(N3C4=CN=CC=C4C4=C3CCCC4)=CC2)=C1
90 435.1564002681 [NH3+]C1=NC(=O)N(C2=CC=CO2)C(N=C2C=CC(N3C4=CN=CC=C4C4=C3C=CC=C4)=CC2)=C1
91 437.1720503321 [NH3+]C1=NC(=O)N(C2=CCCO2)C(N=C2C=CC(N3C4=CN=CC=C4C4=C3C=CC=C4)=CC2)=C1
92 439.1877003961 [NH3+]C1=NC(=O)N(C2=CCCO2)C(N=C2C=CC(N3C4=CN=CC=C4C4=C3CCC=C4)=CC2)=C1
93 485.1931797001 C=C(OC(=C=O)CO)N1C(=O)N=C([NH3+])C=C1N=C1C=CC(N2C3=CN=CC=C3C3=C2CCCC3)=CC1 Intermediate Fragment 
94 393.1458355841 C#CN1C(=O)N=C([NH3+])C=C1N=C1C=CC(N2C3=CN=CC=C3C3=C2C=CC=C3)=CC1
95 395.1614856481 C#CN1C(=O)N=C([NH3+])C=C1N=C1C=CC(N2C3=CN=CC=C3C3=C2CCC=C3)=CC1
96 395.1614856481 C#CNC(O)=NC([NH3+])=C=C=NC1=CC=C(N2C3=CN=CC=C3C3=C2CCC=C3)C=C1 Intermediate Fragment 
97 75.0440558841 OCC=C[OH2+]
98 409.1407502041 [CH+]=C(O)N1C(=O)N=C(N)C=C1N=C1C=CC(N2C3=CN=CC=C3C3=C2C=CC=C3)=CC1
99 411.1564002681 C=C(O)N1C(=O)N=C([NH3+])C=C1N=C1C=CC(N2C3=CN=CC=C3C3=C2C=CC=C3)=CC1
100 413.1720503321 C=C(O)N1C(=O)N=C([NH3+])C=C1N=C1C=CC(N2C3=CN=CC=C3C3=C2CCC=C3)=CC1
101 455.1826150161 C=C(OC#CO)N1C(=O)N=C([NH3+])C=C1N=C1C=CC(N2C3=CN=CC=C3C3=C2CCCC3)=CC1
102 485.1931797001 C=C(O)C(=C=O)OCN1C(=O)N=C([NH3+])C=C1N=C1C=CC(N2C3=CN=CC=C3C3=C2CCCC3)=CC1 Intermediate Fragment 
103 399.1564002681 [NH3+]C1=NC(=O)N(C=O)C(N=C2C=CC(N3C4=CN=CC=C4C4=C3CCC=C4)=CC2)=C1
104 381.1458355841 [CH2+]N1C(=O)N=C(N)C=C1N=C1C=CC(N2C3=CN=CC=C3C3=C2C=CC=C3)=CC1
105 397.1407502041 [NH3+]C1=NC(=O)N(C=O)C(N=C2C=CC(N3C4=CN=CC=C4C4=C3C=CC=C4)=CC2)=C1
106 485.1931797001 [NH3+]C1=NC(=O)N(C=C=C(O)C(=O)C=O)C(N=C2C=CC(N3C4=C(CCN=C4)C4=C3CCCC4)=CC2)=C1 Intermediate Fragment 
107 401.2084358401 C#CN1C(=O)N=C([NH3+])C=C1N=C1C=CC(N2C3=C(CCCC3)C3=C2CNCC3)=CC1
108 383.1978711561 C#CN1CN=C([NH3+])C=C1N=C1C=CC(N2C3=CN=CC=C3C3=C2CCCC3)=CC1
109 136.0505382321 C#CN1C=CC([NH3+])=NC1=O
110 401.2084358401 C#CN(C(=N)O)C(=C=C=[NH2+])N=C1C=CC(N2C3=C(CCCC3)C3=C2CNCC3)=CC1 Intermediate Fragment 
111 399.1927857761 C#CN1C(=O)N=C([NH3+])C=C1N=C1C=CC(N2C3=C(CCN=C3)C3=C2CCCC3)=CC1
112 381.1822210921 C#CN1CN=C([NH3+])C=C1N=C1C=CC(N2C3=CN=CC=C3C3=C2CCC=C3)=CC1
113 84.9920203121 O=CC(=O)C#[O+]
114 56.9971056921 O=C=C=[OH+]
115 87.0076703761 O=CC(=[OH+])C=O
116 68.9971056921 [O+]#CC#CO
117 59.0127557561 O=C=C[OH2+]
118 89.0233204401 O=CC(=[OH+])CO
119 71.0127557561 O=CC#C[OH2+]
120 71.0127557561 CC(=O)C#[O+]
121 61.0284058201 OCC=[OH+]
122 91.0389705041 OCC(=[OH+])CO
123 73.0284058201 OCC#C[OH2+]
124 73.0284058201 CC(=[OH+])C=O
125 93.0546205681 OCC([OH2+])CO
126 75.0440558841 CC(=[OH+])CO
127 387.1927857761 CN1C(=O)N=C([NH3+])C=C1N=C1C=CC(N2C3=CN=CC=C3C3=C2CCCC3)=CC1
128 385.1771357121 CN1C(=O)N=C([NH3+])C=C1N=C1C=CC(N2C3=CN=CC=C3C3=C2CCC=C3)=CC1
129 383.1614856481 CN1C(=O)N=C([NH3+])C=C1N=C1C=CC(N2C3=CN=CC=C3C3=C2C=CC=C3)=CC1
130 383.1614856481 C=NC(=C=C([NH3+])N=C=O)N=C1C=CC(N2C3=CN=CC=C3C3=C2CCC=C3)=CC1 Intermediate Fragment 
131 381.1458355841 C=NC(=C=C([NH3+])N=C=O)N=C1C=CC(N2C3=CN=CC=C3C3=C2C=CC=C3)=CC1 Intermediate Fragment 
132 354.1349365521 N=C(C=C=NC1=CC=C(N2C3=CN=CC=C3C3=C2CCC=C3)C=C1)[NH+]=C=O
133 311.1291229001 C#[N+]C(=C)N=C1C=CC(N2C3=CN=CC=C3C3=C2C=CC=C3)=CC1
134 313.1447729641 C=[NH+]C(=C)N=C1C=CC(N2C3=CN=CC=C3C3=C2C=CC=C3)=CC1
135 336.1243718681 C#[N+]C(=C=C=N)N=C1C=CC(N2C3=CN=CC=C3C3=C2C=CC=C3)=CC1
136 338.1400219321 C=[NH+]C(=C=C=N)N=C1C=CC(N2C3=CN=CC=C3C3=C2C=CC=C3)=CC1
137 353.1509209641 C#[N+]C(=C=C(N)N)N=C1C=CC(N2C3=CN=CC=C3C3=C2C=CC=C3)=CC1
138 381.1458355841 [CH2+]N(C(=N)O)C(=C=C=N)N=C1C=CC(N2C3=CN=CC=C3C3=C2C=CC=C3)=CC1 Intermediate Fragment 
139 311.1291229001 [NH+]#CC=C=NC1=CC=C(N2C3=CN=CC=C3C3=C2CCC=C3)C=C1
140 381.1458355841 C=C(N=C1C=CC(N2C3=CN=CC=C3C3=C2C=CC=C3)=CC1)N([CH2+])C(=O)N=C=N Intermediate Fragment 
141 381.1458355841 C=NC(O)=NC([NH3+])=C=C=NC1=CC=C(N2C3=CN=CC=C3C3=C2C=CC=C3)C=C1 Intermediate Fragment 
142 381.1458355841 [CH2+]N1C(=O)N=C(N)C=C1N=C1C=CC(=NC2=CN=CC=C2C2=CC=CC=C2)C=C1 Intermediate Fragment 
143 381.1458355841 [CH2+]N1C(=O)N=C(N)C=C1N=C1C=CC(=NC2=CC=CC=C2C2=CC=NC=C2)C=C1 Intermediate Fragment 
144 103.0389705041 C=C(O)C(=[OH+])CO
145 467.1826150161 [NH3+]C1=NC(=O)N(C=C=C(O)C#CO)C(N=C2C=CC(N3C4=CN=CC=C4C4=C3CCCC4)=CC2)=C1
146 439.1877003961 CC(O)=C=CN1C(=O)N=C([NH3+])C=C1N=C1C=CC(N2C3=CN=CC=C3C3=C2CCC=C3)=CC1
147 449.1720503321 C#CC(O)=C=CN1C(=O)N=C([NH3+])C=C1N=C1C=CC(N2C3=CN=CC=C3C3=C2CCC=C3)=CC1
148 450.1560659201 O=C1N=CC=C([NH+]=C2C=CC(N3C4=CN=CC=C4C4=C3CCC=C4)=CC2)N1C=C=C(O)C#CO
149 449.1720503321 [NH3+]C1=NC(=O)N(CC#CC#CO)C(N=C2C=CC(N3C4=CN=CC=C4C4=C3CCC=C4)=CC2)=C1
150 423.1564002681 [NH3+]C1=NC(=O)N(CC#CO)C(N=C2C=CC(N3C4=CN=CC=C4C4=C3C=CC=C4)=CC2)=C1
151 421.1407502041 NC1=NC(=O)N([CH+]C#CO)C(N=C2C=CC(N3C4=CN=CC=C4C4=C3C=CC=C4)=CC2)=C1
152 467.1826150161 N=C(O)N(C=C=C(O)C#CO)C(=C=C=[NH2+])N=C1C=CC(N2C3=CN=CC=C3C3=C2CCCC3)=CC1 Intermediate Fragment 
153 429.2033504601 [NH3+]C1=NC(=O)N(CC#CO)C(N=C2C=CC(N3C4=C(CCN=C4)C4=C3CCCC4)=CC2)=C1
154 411.1927857761 C#CCN1C(=O)N=C([NH3+])C=C1N=C1C=CC(N2C3=CN=CC=C3C3=C2CCCC3)=CC1
155 427.1877003961 [NH3+]C1=NC(=O)N(CC#CO)C(N=C2C=CC(N3C4=CN=CC=C4C4=C3CCCC4)=CC2)=C1
156 409.1771357121 C#CCN1C(=O)N=C([NH3+])C=C1N=C1C=CC(N2C3=CN=CC=C3C3=C2CCC=C3)=CC1
157 427.1877003961 [NH3+]C(=C=C(N=CC#CO)N=C1C=CC(N2C3=C(CCN=C3)C3=C2CCCC3)=CC1)N=C=O Intermediate Fragment 
158 407.1614856481 NC1=NCN([CH+]C#CO)C(N=C2C=CC(N3C4=CN=CC=C4C4=C3C=CC=C4)=CC2)=C1
159 408.1455012361 O=C1N=CC=C([NH+]=C2C=CC(N3C4=CN=CC=C4C4=C3C=CC=C4)=CC2)N1CC#CO
160 166.0611029161 [NH3+]C1=NC(=O)N(C=C=CO)C=C1
161 407.1614856481 C#CCN1C(=O)N=C([NH3+])C=C1N=C1C=CC(N2C3=CN=CC=C3C3=C2C=CC=C3)=CC1
162 425.1720503321 [NH3+]C(=C=C(N=CC#CO)N=C1C=CC(N2C3=CN=CC=C3C3=C2CCCC3)=CC1)N=C=O Intermediate Fragment 
163 382.1662366801 N=C=C=C(N=C1C=CC(N2C3=CN=CC=C3C3=C2CCCC3)=CC1)[NH+]=CC#CO
164 397.1771357121 NC(N)=C=C(N=C1C=CC(N2C3=CN=CC=C3C3=C2CCC=C3)=CC1)[NH+]=CC#CO
165 425.1720503321 NC([NH3+])=C=C(N=C1C=CC(N2C3=CN=CC=C3C3=C2C=CC=C3)=CC1)N(C=O)CC#CO Intermediate Fragment 
166 425.1720503321 N=C(O)N(CC#CO)C(=C=C=[NH2+])N=C1C=CC(N2C3=CN=CC=C3C3=C2CCC=C3)=CC1 Intermediate Fragment 
167 425.1720503321 C=C(N=C1C=CC(N2C3=CN=CC=C3C3=C2CCC=C3)=CC1)N(CC#CO)C(=O)N=C=[NH2+] Intermediate Fragment 
168 425.1720503321 C=C([NH3+])N=C(O)N(C=NC1=CC=C(N2C3=CN=CC=C3C3=C2C=CC=C3)C=C1)CC#CO Intermediate Fragment 
169 341.1396875841 OC#CC=[NH+]C=NC1=CC=C(N2C3=CN=CC=C3C3=C2CCC=C3)C=C1
170 425.1720503321 [NH3+]C(=C=C=NC1=CC=C(N2C3=CN=CC=C3C3=C2CCCC3)C=C1)N=C(O)N=CC#CO Intermediate Fragment 
171 328.1556719961 NC(=[NH2+])C=C=NC1=CC=C(N2C3=CN=CC=C3C3=C2CCC=C3)C=C1
172 425.1720503321 [NH3+]C1=NC(=O)N(CC#CO)C(N=C2C=CC(NC3=CN=CC=C3C3=CC=CC=C3)=CC2)=C1 Intermediate Fragment 
173 405.1458355841 NC1=NCN([C+]=C=C=O)C(N=C2C=CC(N3C4=CN=CC=C4C4=C3C=CC=C4)=CC2)=C1
174 406.1298511721 O=C1N=CC=C(N=C2C=CC(N3C4=CN=CC=C4C4=C3C=CC=C4)=CC2)N1[CH+]C#CO
175 405.1458355841 [C+]#CCN1C(=O)N=C(N)C=C1N=C1C=CC(N2C3=CN=CC=C3C3=C2C=CC=C3)=CC1
176 423.1564002681 [NH3+]C(=C=C(N=CC#CO)N=C1C=CC(N2C3=CN=CC=C3C3=C2CCC=C3)=CC1)N=C=O Intermediate Fragment 
177 423.1564002681 N=C(O)N(CC#CO)C(=C=C=[NH2+])N=C1C=CC(N2C3=CN=CC=C3C3=C2C=CC=C3)=CC1 Intermediate Fragment 
178 423.1564002681 C=C(N=C1C=CC(N2C3=CN=CC=C3C3=C2C=CC=C3)=CC1)N(CC#CO)C(=O)N=C=[NH2+] Intermediate Fragment 
179 423.1564002681 C=C(N)N=C(O)N(C#[N+]C1=CC=C(N2C3=CN=CC=C3C3=C2C=CC=C3)C=C1)CC#CO Intermediate Fragment 
180 41.0021910721 [CH+]=C=O
181 63.0440558841 OCC[OH2+]
182 483.1775296361 [NH3+]C1=NC(=O)N(C=C=C(O)C(=O)C=O)C(N=C2C=CC(N3C4=CN=CC=C4C4=C3CCCC4)=CC2)=C1
183 485.1931797001 [NH3+]C1=NC(=O)N(C(O)=C=C(O)C#CO)C(N=C2C=CC(N3C4=C(CCN=C4)C4=C3CCCC4)=CC2)=C1 Intermediate Fragment 
184 417.2033504601 C=C(O)N1C(=O)N=C([NH3+])C=C1N=C1C=CC(N2C3=C(CCN=C3)C3=C2CCCC3)=CC1
185 415.1877003961 C=C(O)N1C(=O)N=C([NH3+])C=C1N=C1C=CC(N2C3=CN=CC=C3C3=C2CCCC3)=CC1
186 43.0178411361 C=C=[OH+]
187 55.0178411361 C#CC=[OH+]
188 401.1720503321 [NH3+]C1=NC(=O)N(C=O)C(N=C2C=CC(N3C4=CN=CC=C4C4=C3CCCC4)=CC2)=C1
189 380.1142011081 O=C1N=CC=C(N=C2C=CC(N3C4=CN=CC=C4C4=C3C=CC=C4)=CC2)N1C#[O+]
190 153.0407018201 NC1=CC(N)=NC(=O)N1C#[O+]
191 397.1407502041 [NH3+]C(=C=C(N=C=O)N=C1C=CC(N2C3=CN=CC=C3C3=C2CCC=C3)=CC1)N=C=O Intermediate Fragment 
192 329.1396875841 C=C(N=C1C=CC(N2C3=CN=CC=C3C3=C2CCC=C3)=CC1)[NH+]=C=O
193 354.1349365521 N=C=C=C(N=C1C=CC(N2C3=CN=CC=C3C3=C2CCC=C3)=CC1)[NH+]=C=O
194 367.1301855201 N=C(N)[C+]=C(N=C=O)N=C1C=CC(N2C3=CN=CC=C3C3=C2C=CC=C3)=CC1
195 397.1407502041 NC(N)=C=C(N=C1C=CC(N2C3=CN=CC=C3C3=C2C=CC=C3)=CC1)N(C#[O+])C=O Intermediate Fragment 
196 380.1142011081 N=C=C=C(N=C1C=CC(N2C3=CN=CC=C3C3=C2C=CC=C3)=CC1)N(C#[O+])C=O
197 397.1407502041 N=C(O)N(C=O)C(=C=C=[NH2+])N=C1C=CC(N2C3=CN=CC=C3C3=C2C=CC=C3)=CC1 Intermediate Fragment 
198 87.0189037561 N=C(O)[NH+]=C=O
199 356.1142011081 N=C(O)[N+](=C=NC1=CC=C(N2C3=CN=CC=C3C3=C2C=CC=C3)C=C1)C=O
200 370.1298511721 C=C(N=C1C=CC(N2C3=CN=CC=C3C3=C2C=CC=C3)=CC1)N(C#[O+])C(=N)O
201 397.1407502041 C=C(N=C1C=CC(N2C3=CN=CC=C3C3=C2C=CC=C3)=CC1)N(C=O)C(=O)N=C=[NH2+] Intermediate Fragment 
202 355.1189521401 C=C(N=C1C=CC(N2C3=CN=CC=C3C3=C2C=CC=C3)=CC1)N(C#[O+])C=O
203 397.1407502041 C=C(N)N=C(O)N(C#[O+])C=NC1=CC=C(N2C3=CN=CC=C3C3=C2C=CC=C3)C=C1 Intermediate Fragment 
204 270.1025738041 C#[N+]C1=CC=C(N2C3=CN=CC=C3C3=C2C=CC=C3)C=C1
205 397.1407502041 [NH3+]C(=C=C=NC1=CC=C(N2C3=CN=CC=C3C3=C2CCC=C3)C=C1)N=C(O)N=C=O Intermediate Fragment 
206 397.1407502041 C=CC(C=C=CN1C2=CN=CC=C2C2=C1C=CC=C2)=NC1=CC([NH3+])=NC(=O)N1C=O Intermediate Fragment 
207 397.1407502041 C=NC=CC1=CN(C2=CCC(=NC3=CC(N)=NC(=O)N3C#[O+])C=C2)C2=C1C=CC=C2 Intermediate Fragment 
208 370.1298511721 C#CC1=CN(C2=CCC(=NC3=CC([NH3+])=NC(=O)N3C=O)C=C2)C2=C1C=CC=C2
209 397.1407502041 NC1=NC(=O)N(C#[O+])C(N=C2C=CC(NC3=CN=CC=C3C3=CC=CC=C3)=CC2)=C1 Intermediate Fragment 
210 156.0807757401 C1=CC=C(C2=CC=[NH+]C=C2)C=C1
211 395.1251001401 NC1=NC(=O)N(C#[O+])C(N=C2C=CC(=NC3=CN=CC=C3C3=CC=CC=C3)C=C2)=C1
212 397.1407502041 NC1=NC(=O)N(C#[O+])C(N=C2C=CC(N=C3C=CC=CC3=C3C=CN=CC3)=CC2)=C1 Intermediate Fragment 
213 395.1251001401 N=C=C=C(N=C1C=CC(N2C3=CN=CC=C3C3=C2C=CC=C3)=CC1)N(C#[O+])C(=N)O Intermediate Fragment 
214 87.0440558841 C=C(O)C=C[OH2+]
215 89.0597059481 C=C(O)CC[OH2+]
216 71.0491412641 C=CC(=C)[OH2+]
217 71.0491412641 C#CCC[OH2+]
218 91.0753560121 CC(O)CC[OH2+]
219 73.0647913281 C=C([OH2+])CC
220 443.1826150161 [NH3+]C1=NC(=O)N(C(=O)C#CO)C(N=C2C=CC(N3C4=C(CCN=C4)C4=C3CCCC4)=CC2)=C1
221 425.1720503321 C#CC(=O)N1C(=O)N=C([NH3+])C=C1N=C1C=CC(N2C3=CN=CC=C3C3=C2CCCC3)=CC1
222 441.1669649521 [NH3+]C1=NC(=O)N(C(=O)C#CO)C(N=C2C=CC(NC3=CN=CC=C3C3=CCCC=C3)=CC2)=C1 Intermediate Fragment 
223 439.1513148881 [NH3+]C1=NC(=O)N(C(=O)C#CO)C(N=C2C=CC(N3C4=CN=CC=C4C4=C3CCC=C4)=CC2)=C1
224 47.0491412641 CC[OH2+]
225 29.0385765801 C=[CH3+]
226 485.1931797001 [NH3+]C1=NC(=O)N(C(=C=CO)OC#CO)C(N=C2C=CC(N3C4=C(CCN=C4)C4=C3CCCC4)=CC2)=C1 Intermediate Fragment 
227 485.1931797001 C=C(N=C1C=CC(N2C3=C(CCN=C3)C3=C2CCCC3)=CC1)N(C(=O)N=C=[NH2+])C1C=C(O)C(=C=O)O1 Intermediate Fragment 
228 417.1921170801 C=C(N=C1C=CC(N2C3=C(CCCC3)C3=C2CNCC3)=CC1)[NH+]=C1C=C(O)C(=C=O)O1
229 417.1921170801 CC(N=C1C=CC(N2C3=C(CCN=C3)C3=C2CCCC3)=CC1)=[NH+]C(O)=C=C(O)C#CO Intermediate Fragment 
230 415.1764670161 C=C(N=C1C=CC(N2C3=C(CCN=C3)C3=C2CCCC3)=CC1)[NH+]=C1C=C(O)C(=C=O)O1
231 415.1764670161 CC(N=C1C=CC(N2C3=CN=CC=C3C3=C2CCCC3)=CC1)=[NH+]C(O)=C=C(O)C#CO Intermediate Fragment 
232 485.1931797001 N=C(O)N(C(=C=C=[NH2+])N=C1C=CC(N2C3=C(CCN=C3)C3=C2CCCC3)=CC1)C1C=C(O)C(=C=O)O1 Intermediate Fragment 
233 315.1604230281 [NH+]#CC=C=NC1C=CC(N2C3=CN=CC=C3C3=C2CCCC3)=CC1
234 313.1447729641 [NH+]#CC=C=NC1C=CC(N2C3=CN=CC=C3C3=C2CCC=C3)=CC1
235 171.0400331241 NC(O)[NH+]=C1C=C(O)C(=C=O)O1
236 175.0713332521 NC(O)[NH2+]C1C=C(O)C(=CO)O1
237 175.0713332521 NC(O)[NH2+]C(O)=C=C(O)C=CO Intermediate Fragment 
238 442.1509805401 N=C(O)[NH+](C=NC1=CC=C(N2C3=CN=CC=C3C3=C2CCC=C3)C=C1)C1C=C(O)C(=C=O)O1
239 444.1666306041 N=C(O)[NH+](C=NC1=CC=C(N2C3=CN=CC=C3C3=C2CCCC3)C=C1)C1C=C(O)C(=C=O)O1
240 458.1822806681 C=C(N=C1C=CC(N2C3=CN=CC=C3C3=C2CCCC3)=CC1)[NH+](C(=N)O)C1C=C(O)C(=C=O)O1
241 441.1557315721 C=C(N=C1C=CC(N2C3=CN=CC=C3C3=C2CCC=C3)=CC1)[NH+](C=O)C1C=C(O)C(=C=O)O1
242 458.1822806681 C=C(N=C1C=CC(N2C3=CN=CC=C3C3=C2CCCC3)=CC1)[NH+](C(=N)O)C(O)=C=C(O)C#CO Intermediate Fragment 
243 468.1666306041 N=C=C=C(N=C1C=CC(N2C3=CN=CC=C3C3=C2CCCC3)=CC1)[NH+](C=O)C1C=C(O)C(=C=O)O1
244 356.1505866161 N#CC=C(N=C1C=CC(N2C3=CN=CC=C3C3=C2CCC=C3)=CC1)[NH2+]C=O
245 442.1873660481 N=C=C=C(N=C1C=CC(N2C3=C(CCCC3)C3=C2CNCC3)=CC1)[NH+]=C1C=C(O)C(=C=O)O1
246 440.1717159841 N=C=C=C(N=C1C=CC(N2C3=C(CCN=C3)C3=C2CCCC3)=CC1)[NH+]=C1C=C(O)C(=C=O)O1
247 485.1931797001 NC([NH3+])=C=C(N=C1C=CC(N2C3=CN=CC=C3C3=C2CCCC3)=CC1)N(C=O)C1C=C(O)C(=C=O)O1 Intermediate Fragment 
248 160.0604342201 OC=C1OC([NH2+]CO)C=C1O
249 457.1982650801 NC(N)=C=C(N=C1C=CC(N2C3=C(CCN=C3)C3=C2CCCC3)=CC1)[NH+]=C1C=C(O)C(=C=O)O1
250 485.1931797001 [NH3+]C(=C=C(N=C1C=CC(N2C3=C(CCCC3)C3=C2CNCC3)=CC1)N=C1C=C(O)C(=C=O)O1)N=C=O Intermediate Fragment 
251 485.1931797001 [NH3+]C(=C=C=NC1=CC=C(N2C3=C(CCCC3)C3=C2CNCC3)C=C1)N=C(O)N=C1C=C(O)C(=C=O)O1 Intermediate Fragment 
252 356.1505866161 NC(C#CN=C1C=CC(N2C3=CN=CC=C3C3=C2CCC=C3)=CC1)=[NH+]C=O
253 485.1931797001 C=C([NH3+])N=C(O)N(C=NC1=CC=C(N2C3=CN=CC=C3C3=C2CCCC3)C=C1)C1C=C(O)C(=C=O)O1 Intermediate Fragment 
254 485.1931797001 C=C(C=CC(C)=NC1=CC([NH3+])=NC(=O)N1C1C=C(O)C(=C=O)O1)N1C2=CN=CC=C2C2=C1CCCC2 Intermediate Fragment 
255 485.1931797001 C=CC(C=C=CN1C2=C(CCN=C2)C2=C1CCCC2)=NC1=CC([NH3+])=NC(=O)N1C1C=C(O)C(=C=O)O1 Intermediate Fragment 
256 485.1931797001 C=CC(=C=C=C=NC1=CC([NH3+])=NC(=O)N1C1C=C(O)C(=C=O)O1)N1C2=C(CCCC2)C2=C1CNCC2 Intermediate Fragment 
257 485.1931797001 CC1=C(C=C=N)C2=C(CCCC2)N1C1=CCC(=NC2=CC([NH3+])=NC(=O)N2C2C=C(O)C(=C=O)O2)C=C1 Intermediate Fragment 
258 458.1822806681 CC1=C(C)N(C2=CCC(=NC3=CC([NH3+])=NC(=O)N3C3C=C(O)C(=C=O)O3)C=C2)C2=C1C=CCC2
259 458.1822806681 CC1=C(C)N(C2=CCC(=NC3=CC([NH3+])=NC(=O)N3C=C=C(O)C(=O)C=O)C=C2)C2=C1C=CCC2 Intermediate Fragment 
260 485.1931797001 C=NC=CC1=CN(C2=CCC(=NC3=CC([NH3+])=NC(=O)N3C3C=C(O)C(=C=O)O3)C=C2)C2=C1CCCC2 Intermediate Fragment 
261 458.1822806681 C=CC1=CN(C2=CCC(=NC3=CC([NH3+])=NC(=O)N3C3C=C(O)C(=C=O)O3)C=C2)C2=C1CCCC2
262 458.1822806681 C=CC1=CN(C2=CCC(=NC3=CC([NH3+])=NC(=O)N3C=C=C(O)C(=O)C=O)C=C2)C2=C1CCCC2 Intermediate Fragment 
263 458.1822806681 C=CC1=CN(C2=CCC(=NC3=CC([NH3+])=NC(=O)N3C(O)=C=C(O)C#CO)C=C2)C2=C1CCCC2 Intermediate Fragment 
264 456.1666306041 C#CC1=CN(C2=CCC(=NC3=CC([NH3+])=NC(=O)N3C3C=C(O)C(=C=O)O3)C=C2)C2=C1CCCC2
265 485.1931797001 CCCC1=C(C)C2=C(C=NC=C2)N1C1=CCC(=NC2=CC([NH3+])=NC(=O)N2C2C=C(O)C(=C=O)O2)C=C1 Intermediate Fragment 
266 485.1931797001 CCCC1=C(C)N(C2=CCC(=NC3=CC([NH3+])=NC(=O)N3C3C=C(O)C(=C=O)O3)C=C2)C2=C1C=CN=C2 Intermediate Fragment 
267 485.1931797001 CCCCC1=CN(C2=CCC(=NC3=CC([NH3+])=NC(=O)N3C3C=C(O)C(=C=O)O3)C=C2)C2=C1C=CN=C2 Intermediate Fragment 
268 485.1931797001 [NH3+]C1=NC(=O)N(C2C=C(O)C(=C=O)O2)C(N=C2C=CC(NC3=CN=CC=C3C3=CCCCC3)=CC2)=C1 Intermediate Fragment 
269 407.1462295081 [NH3+]C1=NC(=O)N(C2=CC(O)C(=C=O)O2)C(N=C2C=CC(NC3=CCCN=C3)=CC2)=C1
270 405.1305794441 [NH3+]C1=NC(=O)N(C2=CC(O)C(=C=O)O2)C(N=C2C=CC(NC3=CC=CN=C3)=CC2)=C1
271 79.0542266441 C1=CC=[CH2+]C=C1
272 79.0542266441 C=C=C=C=C[CH4+] Intermediate Fragment 
273 77.0385765801 C#CC#CC=[CH3+]
274 156.0807757401 CC=C=C=C=C=C1C=C[NH+]=CC1 Intermediate Fragment 
275 485.1931797001 [NH3+]C1=NC(=O)N(C2C=C(O)C(=C=O)O2)C(N=C2C=CC(N(C3=CC=CN=C3)C3=CCCCC3)=CC2)=C1 Intermediate Fragment 
276 485.1931797001 [NH3+]C1=NC(=O)N(C2C=C(O)C(=C=O)O2)C(N=C2C=CC(N=C3CCCCC3=C3C=CN=CC3)=CC2)=C1 Intermediate Fragment 
