#In-silico ESI-MS/MS [M+H]+ Spectra
#PREDICTED BY CFM-ID 4.0.8
#SMILES=[C@H]1(C[C@@H](O[C@@H]1CO)n1c(cc(nc1=O)N)Nc1ccc2c3c1ccc1c3c(cc2)ccc1)O
#InChiKey=VSGYDPYDQOGDAY-WOIUINJBSA-N
energy0
327.12404 100.00 6 35 42 25 48 55 53 58 59 52 (57.853 2.0761 1.7179 0.05182 0.027793 0.024585 0.010768 0.0047823 0.002488 0.00055248)
443.17138 47.86 0 178 213 105 101 217 233 86 241 236 214 251 246 242 239 245 250 237 240 248 243 (28.821 0.50482 0.080781 0.059362 0.031506 0.028263 0.010908 0.0076292 0.0056671 0.0039482 0.0026148 0.0016831 0.0014823 0.0014152 0.0012966 0.00084592 0.00054155 0.00035849 0.00030651 0.00026148 0.00015227)
energy1
284.11822 10.84 32 36 (4.1907 3.4582)
327.12404 100.00 6 35 25 42 55 53 48 59 58 52 (61.782 4.0674 3.0605 1.1217 0.21946 0.10798 0.080625 0.064107 0.037345 0.022919)
355.11895 3.47 104 191 185 189 195 197 198 199 (2.1746 0.17244 0.060504 0.016504 0.0092582 0.0077188 0.0056056 0.00090703)
energy2
43.01784 3.67 179 (0.7721)
45.03349 7.95 70 (1.6706)
55.01784 4.09 180 (0.85999)
57.03349 23.52 68 (4.9406)
61.02841 4.55 114 (0.95638)
71.04914 5.24 204 205 (0.70475 0.39673)
112.05054 3.77 78 (0.79189)
138.02980 3.26 183 (0.6839)
153.04070 6.46 184 (1.358)
218.09643 5.57 9 76 (0.87645 0.29382)
240.08078 3.82 50 (0.80329)
269.10732 4.76 134 128 (0.92978 0.07125)
312.11314 4.02 187 127 74 (0.58588 0.21601 0.042141)
314.12879 3.96 238 230 (0.54844 0.28354)
327.12404 28.55 25 6 42 35 53 52 48 55 59 58 (2.3462 2.2704 0.42211 0.41189 0.27975 0.095518 0.079833 0.06919 0.013915 0.0090185)
329.13969 4.81 5 (1.0105)
338.09240 3.59 182 190 (0.63618 0.11841)
339.12404 13.96 126 103 133 136 135 137 (1.2736 0.76727 0.45527 0.21483 0.12227 0.099815)
351.12404 13.57 87 (2.852)
353.10330 6.57 200 201 (1.0248 0.35547)
353.13969 100.00 88 89 90 (8.5345 6.6011 5.8744)
355.11895 49.18 191 104 185 189 198 195 197 199 (3.1275 2.982 2.3126 0.58877 0.49691 0.37349 0.23271 0.2185)
355.15534 4.99 13 160 (0.85565 0.19178)
357.17099 13.81 91 (2.9011)
359.18664 13.15 92 (2.7635)
363.12404 4.99 170 168 (0.81587 0.23347)
365.13969 10.69 157 154 (2.1397 0.10692)
367.15534 9.44 152 (1.9833)
383.15025 4.29 209 16 158 162 165 161 166 164 167 (0.45824 0.12869 0.072359 0.061666 0.051556 0.046749 0.038961 0.024579 0.01807)
400.16557 4.50 231 (0.94584)

0 443.1713816361 [NH3+]c1cc(Nc2ccc3ccc4cccc5ccc2c3c45)n(C2CC(O)C(CO)O2)c(=O)n1
1 411.1451668881 [NH3+]C1=NC(=O)N(C2C=C(O)CO2)C(N=C2C=CC3=C4C2=CC=C2CC=CC(=C24)C=C3)=C1
2 413.1608169521 [NH3+]C1=NC(=O)N(C2C=C(O)CO2)C(N=C2C=CC3=C4C2=CC=C2CCCC(=C24)C=C3)=C1
3 415.1764670161 [NH3+]C1=NC(=O)N(C2C=C(O)CO2)C(N=C2C=CC3=C4C2=CC=C2CCCC(=C24)CC3)=C1
4 425.1608169521 C=C1OC(N2C(=O)N=C([NH3+])C=C2N=C2C=CC3=C4C2=CC=C2CCCC(=C24)C=C3)C=C1O
5 329.1396875841 [NH3+]C1=CC(N=C2C=CC3=C4C2=CC=C2CCCC(=C24)C=C3)=NC(O)=N1
6 327.1240375201 [NH3+]C1=CC(N=C2C=CC3=C4C2=CC=C2CC=CC(=C24)C=C3)=NC(O)=N1
7 99.0440558841 C=C1OC=CC1[OH2+]
8 408.1342678561 C=C1OC(N2C(=O)N=CC=C2[NH+]=C2C=CC3=C4C2=CC=C2CC=CC(=C24)C=C3)C=C1O
9 218.0964258041 [NH2+]=C1C=CC2=CC=C3C=CCC4=C3C2=C1C=C4
10 208.0716676001 C=C1OC(N2C=CC([NH3+])=NC2=O)=CC1O
11 407.1502522681 C=C1C=CC(N2C(=O)N=C([NH3+])C=C2N=C2C=CC3=C4C2=CC=C2CC=CC(=C24)C=C3)O1
12 425.1608169521 CC(=O)C(O)=C=CN1C(=O)N=C([NH3+])C=C1N=C1C=CC2=C3C1=CC=C1CCCC(=C13)C=C2 Intermediate Fragment 
13 355.1553376481 C#CN1C(=O)N=C([NH3+])C=C1N=C1C=CC2=C3C1=CC=C1CCCC(=C13)CC2
14 425.1608169521 C#CC(O)=C=C(O)N1C(=O)N=C([NH3+])C=C1N=C1C=CC2=C3C1=CC=C1CCCC(=C13)CC2 Intermediate Fragment 
15 425.1608169521 C#COC(=C=CO)N1C(=O)N=C([NH3+])C=C1N=C1C=CC2=C3C1=CC=C1CCCC(=C13)CC2 Intermediate Fragment 
16 383.1502522681 [NH3+]C1=NC(=O)N(CC#CO)C(N=C2C=CC3=C4C2=CC=C2CCCC(=C24)C=C3)=C1
17 399.1451668881 [NH3+]C1=NC(=O)N(C(=O)C#CO)C(N=C2C=CC3=C4C2=CC=C2CCCC(=C24)CC3)=C1
18 425.1608169521 C=C1OC(N(C(=N)O)C(=C=C=[NH2+])N=C2C=CC3=C4C2=CC=C2CCCC(=C24)C=C3)C=C1O Intermediate Fragment 
19 398.1499179201 C=C1OC([NH+](C(=C)N=C2C=CC3=C4C2=CC=C2CC=CC(=C24)C=C3)C(=N)O)=CC1O
20 425.1608169521 C=C1OC(=NC(=C=C([NH3+])N=C=O)N=C2C=CC3=C4C2=CC=C2CCCC(=C24)CC3)C=C1O Intermediate Fragment 
21 333.1709877121 [NH3+]C1=CC(N=C2C=CC3=C4C2=CC=C2CCCC(CC3)C24)=NC(O)=N1
22 220.1120758681 [NH2+]=C1C=CC2=CC=C3CCCC4=C3C2=C1C=C4
23 333.1709877121 N=C(O)N=C(C=C=[NH2+])N=C1C=CC2=C3C1=CC=C1CCCC(CC2)C13 Intermediate Fragment 
24 331.1553376481 [NH3+]C1=CC(N=C2C=CC3=C4C2=CC=C2CCCC(=C24)CC3)=NC(O)=N1
25 327.1240375201 N=C(C=C([NH3+])N=C=O)N=C1C=CC2=CC=C3C=CCC4=C3C2=C1C=C4 Intermediate Fragment 
26 310.0974884241 NC(C#CN=C1C=CC2=CC=C3C=CCC4=C3C2=C1C=C4)=[N+]=C=O
27 85.0396392001 C=C(N)[NH+]=C=O
28 243.0916747721 [NH+]#CN=C1C=CC2=CC=C3C=CCC4=C3C2=C1C=C4
29 257.1073248361 [CH2+]C(=N)N=C1C=CC2=CC=C3C=CCC4=C3C2=C1C=C4
30 259.1229749001 CC(=[NH2+])N=C1C=CC2=CC=C3C=CCC4=C3C2=C1C=C4
31 282.1025738041 N=C=[C+]C(=N)N=C1C=CC2=CC=C3C=CCC4=C3C2=C1C=C4
32 284.1182238681 N=C=CC(=[NH2+])N=C1C=CC2=CC=C3C=CCC4=C3C2=C1C=C4
33 299.1291229001 N=C([C+]=C(N)N)N=C1C=CC2=CC=C3C=CCC4=C3C2=C1C=C4
34 325.1083874561 N=C([C+]=C(N)N=C=O)N=C1C=CC2=CC=C3C=CCC4=C3C2=C1C=C4
35 327.1240375201 NC(N)=CC(=NC#[O+])N=C1C=CC2=CC=C3C=CCC4=C3C2=C1C=C4 Intermediate Fragment 
36 284.1182238681 NC(=[NH2+])C=C=NC1=CC=C2C=CC3=CC=CC4=C3C2=C1C=C4
37 282.1025738041 N=C(N)[C+]=C=NC1=CC=C2C=CC3=CC=CC4=C3C2=C1C=C4
38 269.0709393281 [O+]#CN=C=NC1=CC=C2C=CC3=CC=CC4=C3C2=C1C=C4
39 283.0865893921 [CH+]=C(N=C=O)N=C1C=CC2=CC=C3C=CCC4=C3C2=C1C=C4
40 285.1022394561 C=C(N=C1C=CC2=CC=C3C=CCC4=C3C2=C1C=C4)[NH+]=C=O
41 310.0974884241 NC#CC(=NC#[O+])N=C1C=CC2=CC=C3C=CCC4=C3C2=C1C=C4
42 327.1240375201 N=C(O)N=C(C=C=[NH2+])N=C1C=CC2=CC=C3C=CCC4=C3C2=C1C=C4 Intermediate Fragment 
43 267.0916747721 [NH+]#CC=C=NC1=CC=C2C=CC3=CC=CC4=C3C2=C1C=C4
44 265.0760247081 N#C[C+]=C=NC1=CC=C2C=CC3=CC=CC4=C3C2=C1C=C4
45 286.0974884241 N=C(O)[NH+]=C=NC1=CC=C2C=CC3=CC=CC4=C3C2=C1C=C4
46 300.1131384881 [CH2+]C(=NC(=N)O)N=C1C=CC2=CC=C3C=CCC4=C3C2=C1C=C4
47 325.1083874561 N=C=[C+]C(=NC(=N)O)N=C1C=CC2=CC=C3C=CCC4=C3C2=C1C=C4
48 327.1240375201 CC(=NC(=O)N=C=[NH2+])N=C1C=CC2=CC=C3C=CCC4=C3C2=C1C=C4 Intermediate Fragment 
49 242.0964258041 C#C[NH+]=C1C=CC2=CC=C3C=CCC4=C3C2=C1C=C4
50 240.0807757401 [C+]#CN=C1C=CC2=CC=C3C=CCC4=C3C2=C1C=C4
51 325.1083874561 [CH2+]C(=NC(=O)N=C=N)N=C1C=CC2=CC=C3C=CCC4=C3C2=C1C=C4
52 327.1240375201 C=C([NH3+])N=C(O)N=C=NC1=CC=C2C=CC3=CC=CC4=C3C2=C1C=C4 Intermediate Fragment 
53 327.1240375201 NC(O)=NC([NH3+])=C=C=NC1=CC=C2C=CC3=CC=CC4=C3C2=C1C=C4 Intermediate Fragment 
54 325.1083874561 NC(=O)N=C(N)[C+]=C=NC1=CC=C2C=CC3=CC=CC4=C3C2=C1C=C4
55 327.1240375201 [NH3+]C1=CC(N=C=C=C=C2CC=C3C=CCC4=C3C2=CC=C4)=NC(O)=N1 Intermediate Fragment 
56 191.0855267721 [CH2+]#CC1=C2C=CC=C3CC=CC(=C32)C=C1
57 325.1083874561 [NH3+]C1=CC(N=C=C=C=C2C=CC3=CC=CC4=C3C2=CC=C4)=NC(O)=N1
58 327.1240375201 C=C=CC1=C2C=CC=C3C(=NC4=NC(O)=NC([NH3+])=C4)C=CC(=C32)C=C1 Intermediate Fragment 
59 327.1240375201 C=C=CC1=CC=C2C(=NC3=NC(O)=NC([NH3+])=C3)C=CC3=C2C1=CC=C3 Intermediate Fragment 
60 115.0389705041 OC1C=COC1=C[OH2+]
61 87.0440558841 [OH2+]C1C=COC1
62 115.0389705041 O=C=C=C(O)CC[OH2+] Intermediate Fragment 
63 117.0546205681 OC1C=COC1C[OH2+]
64 99.0440558841 [OH2+]C=C1C=CCO1
65 117.0546205681 C=COC(=C[OH2+])CO Intermediate Fragment 
66 117.0546205681 C=C=C(O)C(O)C[OH2+] Intermediate Fragment 
67 99.0440558841 C=C=C(O)C=C[OH2+]
68 57.0334912001 CC#C[OH2+]
69 117.0546205681 OC=C=C(O)CC[OH2+] Intermediate Fragment 
70 45.0334912001 C=C[OH2+]
71 117.0546205681 OC=C=COCC[OH2+] Intermediate Fragment 
72 425.1608169521 [NH3+]C1=NCN(C2C=C(O)C(=C=O)O2)C(N=C2C=CC3=C4C2=CC=C2CCCC(=C24)C=C3)=C1
73 426.1448325401 O=C=C1OC(N2C(=O)N=CC=C2[NH+]=C2C=CC3=C4C2=CC=C2CCCC(=C24)CC3)C=C1O
74 312.1131384881 OC1=NC=CC([NH+]=C2C=CC3=C4C2=CC=C2CC=CC(=C24)C=C3)=N1
75 426.1448325401 O=CC(=O)C(O)=C=CN1C(=O)N=CC=C1[NH+]=C1C=CC2=C3C1=CC=C1CCCC(=C13)CC2 Intermediate Fragment 
76 218.0964258041 [NH+]#CC=C=C1CC=C2C=CCC3=C2C1=CC=C3 Intermediate Fragment 
77 224.0665822201 [NH3+]C1=NC(O)N(C2=CC(O)C(=C=O)O2)C=C1
78 112.0505382321 [NH3+]C1=CC=NC(O)=N1
79 226.0822322841 [NH3+]C1C=CN(C2=CC(O)C(=C=O)O2)C(O)N1
80 226.0822322841 [NH3+]C1C=CN(C=C=C(O)C(=O)C=O)C(O)N1 Intermediate Fragment 
81 203.0855267721 C1=CC2=C3C(=C1)C=CC1=CC=[CH2+]C(=C13)C=C2
82 425.1608169521 [NH3+]C1=NC(=O)N(C2C=CC(=C=O)O2)C(N=C2C=CC3=C4C2=CC=C2CCCC(=C24)CC3)=C1
83 393.1346022041 [NH3+]C1=NC(=O)N(C2=CC=CO2)C(N=C2C=CC3=C4C2=CC=C2CC=CC(=C24)C=C3)=C1
84 395.1502522681 [NH3+]C1=NC(=O)N(C2=CCCO2)C(N=C2C=CC3=C4C2=CC=C2CC=CC(=C24)C=C3)=C1
85 397.1659023321 [NH3+]C1=NC(=O)N(C2=CCCO2)C(N=C2C=CC3=C4C2=CC=C2CCCC(=C24)C=C3)=C1
86 443.1713816361 C=C(OC(=C=O)CO)N1C(=O)N=C([NH3+])C=C1N=C1C=CC2=C3C1=CC=C1CCCC(=C13)CC2 Intermediate Fragment 
87 351.1240375201 C#CN1C(=O)N=C([NH3+])C=C1N=C1C=CC2=C3C1=CC=C1CC=CC(=C13)C=C2
88 353.1396875841 C#CN1C(=O)N=C([NH3+])C=C1N=C1C=CC2=C3C1=CC=C1CCCC(=C13)C=C2
89 353.1396875841 C#CN(C(=N)O)C(=C=C=[NH2+])N=C1C=CC2=CC=C3CCCC4=C3C2=C1C=C4 Intermediate Fragment 
90 353.1396875841 C#CNC(O)=NC([NH3+])=C=C=NC1=CC=C2CC=C3C=CCC4=C3C2=C1C=C4 Intermediate Fragment 
91 357.1709877121 C#CN1C(=O)N=C([NH3+])C=C1N=C1C=CC2=C3C1=CC=C1CCCC(CC2)C13
92 359.1866377761 C#CN1C(=O)N=C([NH3+])C=C1N=C1C=CC2=C3C1=CCC1CCCC(CC2)C31
93 75.0440558841 OCC=C[OH2+]
94 367.1189521401 [CH+]=C(O)N1C(=O)N=C(N)C=C1N=C1C=CC2=C3C1=CC=C1CC=CC(=C13)C=C2
95 369.1346022041 C=C(O)N1C(=O)N=C([NH3+])C=C1N=C1C=CC2=C3C1=CC=C1CC=CC(=C13)C=C2
96 369.1346022041 C=C(O)N(C(=N)O)C(=C=C=[NH2+])N=C1C=CC2=CC=C3C=CCC4=C3C2=C1C=C4 Intermediate Fragment 
97 371.1502522681 C=C(O)N1C(=O)N=C([NH3+])C=C1N=C1C=CC2=C3C1=CC=C1CCCC(=C13)C=C2
98 373.1659023321 C=C(O)N1C(=O)N=C([NH3+])C=C1N=C1C=CC2=C3C1=CC=C1CCCC(=C13)CC2
99 375.1815523961 C=C(O)N1C(=O)N=C([NH3+])C=C1N=C1C=CC2=C3C1=CC=C1CCCC(CC2)C13
100 413.1608169521 C=C(OC#CO)N1C(=O)N=C([NH3+])C=C1N=C1C=CC2=C3C1=CC=C1CCCC(=C13)CC2
101 443.1713816361 C=C(O)C(=C=O)OCN1C(=O)N=C([NH3+])C=C1N=C1C=CC2=C3C1=CC=C1CCCC(=C13)CC2 Intermediate Fragment 
102 357.1346022041 [NH3+]C1=NC(=O)N(C=O)C(N=C2C=CC3=C4C2=CC=C2CCCC(=C24)C=C3)=C1
103 339.1240375201 [CH2+]N1C(=O)N=C(N)C=C1N=C1C=CC2=C3C1=CC=C1CC=CC(=C13)C=C2
104 355.1189521401 [NH3+]C1=NC(=O)N(C=O)C(N=C2C=CC3=C4C2=CC=C2CC=CC(=C24)C=C3)=C1
105 443.1713816361 [NH3+]C1=NC(=O)N(C=C=C(O)C(=O)C=O)C(N=C2C=CC3=C4C2=CC=C2CCCC(CC3)C24)=C1 Intermediate Fragment 
106 84.9920203121 O=CC(=O)C#[O+]
107 56.9971056921 O=C=C=[OH+]
108 87.0076703761 O=CC(=[OH+])C=O
109 68.9971056921 [O+]#CC#CO
110 59.0127557561 O=C=C[OH2+]
111 89.0233204401 O=CC(=[OH+])CO
112 71.0127557561 O=CC#C[OH2+]
113 71.0127557561 CC(=O)C#[O+]
114 61.0284058201 OCC=[OH+]
115 91.0389705041 OCC(=[OH+])CO
116 73.0284058201 OCC#C[OH2+]
117 73.0284058201 CC(=[OH+])C=O
118 93.0546205681 OCC([OH2+])CO
119 75.0440558841 CC(=[OH+])CO
120 345.1709877121 CN1C(=O)N=C([NH3+])C=C1N=C1C=CC2=C3C1=CC=C1CCCC(=C13)CC2
121 343.1553376481 CN1C(=O)N=C([NH3+])C=C1N=C1C=CC2=C3C1=CC=C1CCCC(=C13)C=C2
122 341.1396875841 CN1C(=O)N=C([NH3+])C=C1N=C1C=CC2=C3C1=CC=C1CC=CC(=C13)C=C2
123 323.1291229001 [CH2+]N1C=NC(=N)C=C1N=C1C=CC2=C3C1=CC=C1CC=CC(=C13)C=C2
124 341.1396875841 C=NC(=C=C([NH3+])N=C=O)N=C1C=CC2=CC=C3CCCC4=C3C2=C1C=C4 Intermediate Fragment 
125 341.1396875841 CN(C#[O+])C(=C=C(N)N)N=C1C=CC2=CC=C3C=CCC4=C3C2=C1C=C4 Intermediate Fragment 
126 339.1240375201 C=NC(=C=C([NH3+])N=C=O)N=C1C=CC2=CC=C3C=CCC4=C3C2=C1C=C4 Intermediate Fragment 
127 312.1131384881 N=C(C=C=NC1=CC=C2C=CC3=C4C2=C1C=CC4CC=C3)[NH+]=C=O
128 269.1073248361 C#[N+]C(=C)N=C1C=CC2=CC=C3C=CCC4=C3C2=C1C=C4
129 271.1229749001 C=[NH+]C(=C)N=C1C=CC2=CC=C3C=CCC4=C3C2=C1C=C4
130 294.1025738041 C#[N+]C(=C=C=N)N=C1C=CC2=CC=C3C=CCC4=C3C2=C1C=C4
131 296.1182238681 C=[NH+]C(=C=C=N)N=C1C=CC2=CC=C3C=CCC4=C3C2=C1C=C4
132 311.1291229001 C#[N+]C(=C=C(N)N)N=C1C=CC2=CC=C3C=CCC4=C3C2=C1C=C4
133 339.1240375201 [CH2+]N(C(=N)O)C(=C=C=N)N=C1C=CC2=CC=C3C=CCC4=C3C2=C1C=C4 Intermediate Fragment 
134 269.1073248361 [NH+]#CC=C=NC1=CC=C2C=CC3=C4C2=C1C=CC4CC=C3
135 339.1240375201 C=C(N=C1C=CC2=CC=C3C=CCC4=C3C2=C1C=C4)N([CH2+])C(=O)N=C=N Intermediate Fragment 
136 339.1240375201 [CH+]=NC(O)=NC(N)=C=C=NC1=CC=C2CC=C3C=CCC4=C3C2=C1C=C4 Intermediate Fragment 
137 339.1240375201 [CH2+]N1C(=O)N=C(N)C=C1N=C=C=C=C1CC=C2C=CCC3=C2C1=CC=C3 Intermediate Fragment 
138 103.0389705041 C=C(O)C(=[OH+])CO
139 425.1608169521 [NH3+]C1=NC(=O)N(C=C=C(O)C#CO)C(N=C2C=CC3=C4C2=CC=C2CCCC(=C24)CC3)=C1
140 397.1659023321 CC(O)=C=CN1C(=O)N=C([NH3+])C=C1N=C1C=CC2=C3C1=CC=C1CCCC(=C13)C=C2
141 407.1502522681 C#CC(O)=C=CN1C(=O)N=C([NH3+])C=C1N=C1C=CC2=C3C1=CC=C1CCCC(=C13)C=C2
142 408.1342678561 O=C1N=CC=C([NH+]=C2C=CC3=C4C2=CC=C2CCCC(=C24)C=C3)N1C=C=C(O)C#CO
143 407.1502522681 [NH3+]C1=NC(=O)N(CC#CC#CO)C(N=C2C=CC3=C4C2=CC=C2CCCC(=C24)C=C3)=C1
144 381.1346022041 [NH3+]C1=NC(=O)N(CC#CO)C(N=C2C=CC3=C4C2=CC=C2CC=CC(=C24)C=C3)=C1
145 379.1189521401 NC1=NC(=O)N([CH+]C#CO)C(N=C2C=CC3=C4C2=CC=C2CC=CC(=C24)C=C3)=C1
146 425.1608169521 N=C(O)N(C=C=C(O)C#CO)C(=C=C=[NH2+])N=C1C=CC2=C3C1=CC=C1CCCC(=C13)CC2 Intermediate Fragment 
147 387.1815523961 [NH3+]C1=NC(=O)N(CC#CO)C(N=C2C=CC3=C4C2=CC=C2CCCC(CC3)C24)=C1
148 168.0767529801 [NH3+]C1=NC(O)N(C=C=CO)C=C1
149 369.1709877121 C#CCN1C(=O)N=C([NH3+])C=C1N=C1C=CC2=C3C1=CC=C1CCCC(=C13)CC2
150 385.1659023321 [NH3+]C1=NC(=O)N(CC#CO)C(N=C2C=CC3=C4C2=CC=C2CCCC(=C24)CC3)=C1
151 368.1393532361 O=C1N=CC=C([NH+]=C2C=CC3=C4C2=CC=C2CCCC(=C24)C=C3)N1CC#CO
152 367.1553376481 C#CCN1C(=O)N=C([NH3+])C=C1N=C1C=CC2=C3C1=CC=C1CCCC(=C13)C=C2
153 385.1659023321 [NH3+]C(=C=C(N=CC#CO)N=C1C=CC2=C3C1=CC=C1CCCC(CC2)C13)N=C=O Intermediate Fragment 
154 365.1396875841 NC1=NCN([CH+]C#CO)C(N=C2C=CC3=C4C2=CC=C2CC=CC(=C24)C=C3)=C1
155 366.1237031721 O=C1N=CC=C([NH+]=C2C=CC3=C4C2=CC=C2CC=CC(=C24)C=C3)N1CC#CO
156 166.0611029161 [NH3+]C1=NC(=O)N(C=C=CO)C=C1
157 365.1396875841 C#CCN1C(=O)N=C([NH3+])C=C1N=C1C=CC2=C3C1=CC=C1CC=CC(=C13)C=C2
158 383.1502522681 [NH3+]C(=C=C(N=CC#CO)N=C1C=CC2=C3C1=CC=C1CCCC(=C13)CC2)N=C=O Intermediate Fragment 
159 340.1444386161 N=C=C=C(N=C1C=CC2=C3C1=CC=C1CCCC(=C13)CC2)[NH+]=CC#CO
160 355.1553376481 NC(N)=C=C(N=C1C=CC2=CC=C3CCCC4=C3C2=C1C=C4)[NH+]=CC#CO
161 383.1502522681 NC([NH3+])=C=C(N=C1C=CC2=CC=C3C=CCC4=C3C2=C1C=C4)N(C=O)CC#CO Intermediate Fragment 
162 383.1502522681 N=C(O)N(CC#CO)C(=C=C=[NH2+])N=C1C=CC2=CC=C3CCCC4=C3C2=C1C=C4 Intermediate Fragment 
163 356.1393532361 C=C(N=C1C=CC2=CC=C3C=CCC4=C3C2=C1C=C4)[NH+](C=C=CO)C(=N)O
164 383.1502522681 C=C(N=C1C=CC2=CC=C3CCCC4=C3C2=C1C=C4)N(CC#CO)C(=O)N=C=[NH2+] Intermediate Fragment 
165 383.1502522681 C=C(N)N=C(O)N(C#[N+]C1=CC=C2CC=C3C=CCC4=C3C2=C1C=C4)CC#CO Intermediate Fragment 
166 383.1502522681 [NH3+]C(=C=C=NC1=CC=C2CC=C3CCCC4=C3C2=C1C=C4)N=C(O)N=CC#CO Intermediate Fragment 
167 383.1502522681 [NH3+]C1=NC(=O)N(CC#CO)C(N=C=C=C=C2CC=C3CCCC4=C3C2=CC=C4)=C1 Intermediate Fragment 
168 363.1240375201 NC1=NCN([C+]=C=C=O)C(N=C2C=CC3=C4C2=CC=C2CC=CC(=C24)C=C3)=C1
169 364.1080531081 O=C1N=CC=C(N=C2C=CC3=C4C2=CC=C2CC=CC(=C24)C=C3)N1[CH+]C#CO
170 363.1240375201 [C+]#CCN1C(=O)N=C(N)C=C1N=C1C=CC2=C3C1=CC=C1CC=CC(=C13)C=C2
171 381.1346022041 [NH3+]C(=C=C(N=CC#CO)N=C1C=CC2=CC=C3CCCC4=C3C2=C1C=C4)N=C=O Intermediate Fragment 
172 381.1346022041 N=C(O)N(CC#CO)C(=C=C=[NH2+])N=C1C=CC2=CC=C3C=CCC4=C3C2=C1C=C4 Intermediate Fragment 
173 381.1346022041 C=C(N=C1C=CC2=CC=C3C=CCC4=C3C2=C1C=C4)N(CC#CO)C(=O)N=C=[NH2+] Intermediate Fragment 
174 381.1346022041 C=C(N)N=C(O)N(C#[N+]C1=CC=C2CC=C3C=CCC4=C3C2=C1C=C4)C=C=C=O Intermediate Fragment 
175 41.0021910721 [CH+]=C=O
176 63.0440558841 OCC[OH2+]
177 441.1557315721 [NH3+]C1=NC(=O)N(C=C=C(O)C(=O)C=O)C(N=C2C=CC3=C4C2=CC=C2CCCC(=C24)CC3)=C1
178 443.1713816361 [NH3+]C1=NC(=O)N(C(O)=C=C(O)C#CO)C(N=C2C=CC3=C4C2=CC=C2CCCC(CC3)C24)=C1 Intermediate Fragment 
179 43.0178411361 C=C=[OH+]
180 55.0178411361 C#CC=[OH+]
181 359.1502522681 [NH3+]C1=NC(=O)N(C=O)C(N=C2C=CC3=C4C2=CC=C2CCCC(=C24)CC3)=C1
182 338.0924030441 O=C1N=CC=C(N=C2C=CC3=C4C2=CC=C2CC=CC(=C24)C=C3)N1C#[O+]
183 138.0298027881 NC1=NC(=O)N(C#[O+])C=C1
184 153.0407018201 NC1=CC(N)=NC(=O)N1C#[O+]
185 355.1189521401 [NH3+]C(=C=C(N=C=O)N=C1C=CC2=CC=C3CCCC4=C3C2=C1C=C4)N=C=O Intermediate Fragment 
186 287.1178895201 C=C(N=C1C=CC2=CC=C3CCCC4=C3C2=C1C=C4)[NH+]=C=O
187 312.1131384881 N=C=C=C(N=C1C=CC2=CC=C3CCCC4=C3C2=C1C=C4)[NH+]=C=O
188 325.1083874561 N=C(N)[C+]=C(N=C=O)N=C1C=CC2=CC=C3C=CCC4=C3C2=C1C=C4
189 355.1189521401 NC(N)=C=C(N=C1C=CC2=CC=C3C=CCC4=C3C2=C1C=C4)N(C#[O+])C=O Intermediate Fragment 
190 338.0924030441 N=C=C=C(N=C1C=CC2=CC=C3C=CCC4=C3C2=C1C=C4)N(C#[O+])C=O
191 355.1189521401 N=C(O)N(C=O)C(=C=C=[NH2+])N=C1C=CC2=CC=C3C=CCC4=C3C2=C1C=C4 Intermediate Fragment 
192 87.0189037561 N=C(O)[NH+]=C=O
193 314.0924030441 N=C(O)[N+](=C=NC1=CC=C2C=CC3=CC=CC4=C3C2=C1C=C4)C=O
194 328.1080531081 C=C(N=C1C=CC2=CC=C3C=CCC4=C3C2=C1C=C4)N(C#[O+])C(=N)O
195 355.1189521401 C=C(N=C1C=CC2=CC=C3C=CCC4=C3C2=C1C=C4)N(C=O)C(=O)N=C=[NH2+] Intermediate Fragment 
196 313.0971540761 C=C(N=C1C=CC2=CC=C3C=CCC4=C3C2=C1C=C4)N(C#[O+])C=O
197 355.1189521401 C=C(N)N=C(O)N(C#[O+])C=NC1=CC=C2C=CC3=CC=CC4=C3C2=C1C=C4 Intermediate Fragment 
198 355.1189521401 [NH3+]C(=C=C=NC1=CC=C2CC=C3C=CCC4=C3C2=C1C=C4)N=C(O)N=C=O Intermediate Fragment 
199 355.1189521401 [NH3+]C1=NC(=O)N(C=O)C(N=C=C=C=C2CC=C3C=CCC4=C3C2=CC=C4)=C1 Intermediate Fragment 
200 353.1033020761 NC1=NC(=O)N(C#[O+])C(N=C2C=CC3=C4C2=CC=C2CC=CC(=C24)C=C3)=C1
201 353.1033020761 N=C=C=C(N=C1C=CC2=CC=C3C=CCC4=C3C2=C1C=C4)N(C#[O+])C(=N)O Intermediate Fragment 
202 87.0440558841 C=C(O)C=C[OH2+]
203 89.0597059481 C=C(O)CC[OH2+]
204 71.0491412641 C=CC(=C)[OH2+]
205 71.0491412641 C#CCC[OH2+]
206 91.0753560121 CC(O)CC[OH2+]
207 73.0647913281 C=C([OH2+])CC
208 401.1608169521 [NH3+]C1=NC(=O)N(C(=O)C#CO)C(N=C2C=CC3=C4C2=CC=C2CCCC(CC3)C24)=C1
209 383.1502522681 C#CC(=O)N1C(=O)N=C([NH3+])C=C1N=C1C=CC2=C3C1=CC=C1CCCC(=C13)CC2
210 397.1295168241 [NH3+]C1=NC(=O)N(C(=O)C#CO)C(N=C2C=CC3=C4C2=CC=C2CCCC(=C24)C=C3)=C1
211 47.0491412641 CC[OH2+]
212 29.0385765801 C=[CH3+]
213 443.1713816361 [NH3+]C1=NC(=O)N(C(=C=CO)OC#CO)C(N=C2C=CC3=C4C2=CC=C2CCCC(CC3)C24)=C1 Intermediate Fragment 
214 443.1713816361 C=C(N=C1C=CC2=C3C1=CC=C1CCCC(CC2)C13)N(C(=O)N=C=[NH2+])C1C=C(O)C(=C=O)O1 Intermediate Fragment 
215 375.1703190161 C=C(N=C1C=CC2=C3C1=CCC1CCCC(CC2)C31)[NH+]=C1C=C(O)C(=C=O)O1
216 373.1546689521 C=C(N=C1C=CC2=C3C1=CC=C1CCCC(CC2)C13)[NH+]=C1C=C(O)C(=C=O)O1
217 443.1713816361 N=C(O)N(C(=C=C=[NH2+])N=C1C=CC2=C3C1=CC=C1CCCC(CC2)C13)C1C=C(O)C(=C=O)O1 Intermediate Fragment 
218 273.1386249641 [NH+]#CC=C=NC1C=CC2=C3C4=C(C=C2)CCCC4C=CC31
219 271.1229749001 [NH+]#CC=C=NC1C=CC2=C3C4=C(C=CCC4C=CC31)C=C2
220 171.0400331241 NC(O)[NH+]=C1C=C(O)C(=C=O)O1
221 175.0713332521 NC(O)[NH2+]C1C=C(O)C(=CO)O1
222 175.0713332521 NC(O)[NH2+]C(O)=C=C(O)C=CO Intermediate Fragment 
223 400.1291824761 N=C(O)[NH+](C=NC1=CC=C2CC=C3C=CCC4=C3C2=C1C=C4)C1C=C(O)C(=C=O)O1
224 402.1448325401 N=C(O)[NH+](C=NC1=CC=C2CC=C3CCCC4=C3C2=C1C=C4)C1C=C(O)C(=C=O)O1
225 414.1448325401 C=C(N=C1C=CC2=C3C1=CC=C1CCCC(=C13)C=C2)[NH+](C(=N)O)C1C=C(O)C(=C=O)O1
226 416.1604826041 C=C(N=C1C=CC2=C3C1=CC=C1CCCC(=C13)CC2)[NH+](C(=N)O)C1C=C(O)C(=C=O)O1
227 399.1339335081 C=C(N=C1C=CC2=C3C1=CC=C1CCCC(=C13)C=C2)[NH+](C=O)C1C=C(O)C(=C=O)O1
228 416.1604826041 C=C(N=C1C=CC2=C3C1=CC=C1CCCC(=C13)CC2)[NH+](C(=N)O)C(O)=C=C(O)C#CO Intermediate Fragment 
229 426.1448325401 N=C=C=C(N=C1C=CC2=C3C1=CC=C1CCCC(=C13)CC2)[NH+](C=O)C1C=C(O)C(=C=O)O1
230 314.1287885521 N#CC=C(N=C1C=CC2=CC=C3CCCC4=C3C2=C1C=C4)[NH2+]C=O
231 400.1655679841 N=C=C=C(N=C1C=CC2=C3C1=CCC1CCCC(CC2)C31)[NH+]=C1C=C(O)C(=C=O)O1
232 398.1499179201 N=C=C=C(N=C1C=CC2=C3C1=CC=C1CCCC(CC2)C13)[NH+]=C1C=C(O)C(=C=O)O1
233 443.1713816361 NC([NH3+])=C=C(N=C1C=CC2=C3C1=CC=C1CCCC(=C13)CC2)N(C=O)C1C=C(O)C(=C=O)O1 Intermediate Fragment 
234 286.1338739321 NC(=[NH2+])C=C=NC1=CC=C2C=CC3=C4C2=C1C=CC4CC=C3
235 415.1764670161 NC(N)=C=C(N=C1C=CC2=C3C1=CC=C1CCCC(CC2)C13)[NH+]=C1C=C(O)C(=C=O)O1
236 443.1713816361 [NH3+]C(=C=C(N=C1C=C(O)C(=C=O)O1)N=C1C=CC2=C3C1=CCC1CCCC(CC2)C31)N=C=O Intermediate Fragment 
237 443.1713816361 [NH3+]C(=C=C=NC1=CC=C2CCC3CCCC4C=CC1=C2C43)N=C(O)N=C1C=C(O)C(=C=O)O1 Intermediate Fragment 
238 314.1287885521 NC(C#CN=C1C=CC2=CC=C3CCCC4=C3C2=C1C=C4)=[NH+]C=O
239 443.1713816361 C=C([NH3+])N=C(O)N(C=NC1=CC=C2CC=C3CCCC4=C3C2=C1C=C4)C1C=C(O)C(=C=O)O1 Intermediate Fragment 
240 443.1713816361 C=C1CC=C2CCCC3=C2C1=C(C(C)=NC1=CC([NH3+])=NC(=O)N1C1C=C(O)C(=C=O)O1)C=C3 Intermediate Fragment 
241 443.1713816361 [NH3+]C1=NC(=O)N(C2C=C(O)C(=C=O)O2)C(N=C=C=C=C2CCC3CCCC4C=CC=C2C43)=C1 Intermediate Fragment 
242 443.1713816361 CC1=C2C(=CC=C3CCCC(C)=C32)C(=NC2=CC([NH3+])=NC(=O)N2C2C=C(O)C(=C=O)O2)C=C1 Intermediate Fragment 
243 443.1713816361 CCC1=C2C(=CC=C3C2=CC=CC3=NC2=CC([NH3+])=NC(=O)N2C2C=C(O)C(=C=O)O2)CCC1 Intermediate Fragment 
244 417.1557315721 [NH3+]C1=NC(=O)N(C2C=C(O)C(=C=O)O2)C(N=C2C=CC=C3C2=CC=C2CCCCC23)=C1
245 443.1713816361 CCC1=C2C3=CCCCC3=CC=C2C(=NC2=CC([NH3+])=NC(=O)N2C2C=C(O)C(=C=O)O2)C=C1 Intermediate Fragment 
246 443.1713816361 CCC1=CC=C2C(=NC3=CC([NH3+])=NC(=O)N3C3C=C(O)C(=C=O)O3)C=CC3=C2C1=C(C)CC3 Intermediate Fragment 
247 413.1244314441 CC1=C2C=CC=C3C(=NC4=CC([NH3+])=NC(=O)N4C4C=C(O)C(=C=O)O4)C=CC(=C32)C=C1
248 443.1713816361 CCC1=C2C(C)=CC=C3C(=NC4=CC([NH3+])=NC(=O)N4C4C=C(O)C(=C=O)O4)C=CC(=C32)CC1 Intermediate Fragment 
249 417.1557315721 CC1=CC=C2C(=NC3=CC([NH3+])=NC(=O)N3C3C=C(O)C(=C=O)O3)C=CC3=C2C1CCC3
250 443.1713816361 CCCC1=C2C=CC=C3C(=NC4=CC([NH3+])=NC(=O)N4C4C=C(O)C(=C=O)O4)C=CC(=C32)CC1 Intermediate Fragment 
251 443.1713816361 CCCC1=CC=C2C(=NC3=CC([NH3+])=NC(=O)N3C3C=C(O)C(=C=O)O3)C=CC3=C2C1=CCC3 Intermediate Fragment 
