#In-silico ESI-MS/MS [M+H]+ Spectra
#PREDICTED BY CFM-ID 4.0.8
#SMILES=[C@H]1(C[C@@H](O[C@@H]1CO)n1c(c(c(=O)[nH]c1=O)C)Nc1nc2c(n1C)c(cc1c2nc(cn1)C)C)O
#InChiKey=GUNWXYLEQNKHGW-RBSFLKMASA-N
energy0
352.15165 71.77 5 60 116 72 67 103 90 82 120 101 50 100 119 113 111 114 89 102 79 226 (33.225 1.0363 0.18309 0.14845 0.096727 0.067939 0.063536 0.04194 0.032273 0.028672 0.023681 0.014764 0.011542 0.0098109 0.0089254 0.0070896 0.0010313 0.00010797 3.9187e-05 2.9333e-06)
468.19899 100.00 0 203 260 246 177 283 254 174 259 270 314 247 312 278 163 321 320 281 263 310 309 267 269 282 (47.489 0.68547 0.19685 0.12645 0.073006 0.033153 0.030833 0.030822 0.022094 0.012891 0.0095742 0.0094024 0.0088847 0.0082534 0.0075848 0.0066591 0.0058946 0.0049743 0.0022874 0.0022758 0.0011661 0.0011524 0.0009087 5.9431e-05)
energy1
57.03349 2.49 132 (1.0537)
87.04406 3.60 127 237 (1.3879 0.13655)
99.04406 5.24 8 143 139 (1.3581 0.60504 0.2553)
111.00767 3.29 122 (1.3937)
142.06110 7.26 29 (3.0733)
281.15092 6.50 56 (2.7491)
307.13019 7.68 57 77 61 (1.6782 1.4863 0.082618)
324.15673 5.86 59 71 (2.1803 0.29921)
335.12510 4.49 65 121 118 87 228 (1.5639 0.14694 0.12231 0.064544 0.0012585)
336.12035 17.02 49 47 48 42 (3.2359 1.5669 1.3259 1.0707)
350.13600 4.68 6 66 99 110 88 (1.9117 0.046214 0.017869 0.0058892 0.00011206)
352.15165 100.00 5 72 50 60 67 114 90 103 116 82 101 120 100 113 119 79 89 111 102 226 (33.983 2.3468 2.1675 1.4289 0.55518 0.45099 0.31665 0.259 0.21145 0.13414 0.10681 0.098715 0.093905 0.047728 0.033316 0.027707 0.018122 0.014724 0.0095373 0.00041555)
362.13600 3.88 185 186 189 191 (1.4928 0.12838 0.010416 0.0084708)
364.15165 3.62 175 (1.5332)
380.14656 7.49 217 222 224 230 229 225 232 234 220 (2.9417 0.12738 0.040738 0.02085 0.01849 0.0087831 0.0080537 0.0012482 0.0002456)
397.19827 2.99 250 251 (1.1574 0.1066)
468.19899 3.68 0 203 177 260 163 174 321 246 259 270 312 278 283 247 267 254 314 310 269 281 309 320 263 282 (1.005 0.3701 0.042193 0.039353 0.017919 0.015768 0.011047 0.010108 0.0074902 0.007221 0.0061388 0.0052435 0.0048398 0.0041116 0.0035157 0.0031266 0.0013267 0.00073244 0.00072263 0.0003984 0.0003566 0.0001973 0.00015754 0.00012033)
energy2
45.03349 13.66 134 (1.5683)
55.01784 7.71 209 (0.88478)
57.03349 36.12 132 (4.1467)
71.04914 7.44 238 239 (0.54627 0.30751)
125.03455 9.70 25 (1.1134)
228.12437 7.80 43 (0.89501)
264.12437 9.10 74 (1.045)
266.14002 23.16 73 (2.6595)
291.13527 9.59 187 (1.1013)
292.11929 8.62 68 (0.98943)
296.15059 7.08 264 (0.8125)
307.16657 17.28 167 (1.9842)
309.14584 9.76 64 58 86 (0.95742 0.13499 0.028283)
335.12510 12.01 65 87 118 121 228 (0.98961 0.18332 0.10457 0.055266 0.045818)
336.12035 26.07 49 47 48 42 (1.5629 0.81369 0.53461 0.081924)
350.13600 19.03 6 110 99 88 66 (1.6048 0.28944 0.1981 0.066299 0.026176)
352.15165 63.05 5 82 72 103 90 50 67 79 116 111 60 100 119 114 113 120 89 101 102 226 (2.9395 1.2529 0.68701 0.46619 0.39801 0.37373 0.36274 0.2064 0.10832 0.077883 0.065027 0.060796 0.047897 0.038489 0.035936 0.034086 0.032694 0.025517 0.023383 0.0023233)
353.17205 10.65 252 (1.2227)
356.18295 12.96 39 (1.4885)
360.12035 8.59 235 (0.98653)
362.13600 24.62 185 186 189 191 (1.4776 0.62442 0.56267 0.16158)
364.15165 37.62 175 (4.3189)
366.16730 9.84 176 (1.1294)
376.15165 37.26 164 (4.278)
378.13091 16.05 233 236 (1.4012 0.4413)
378.16730 100.00 166 168 165 (4.7013 4.3124 2.4679)
380.14656 41.51 217 225 222 230 224 232 229 234 220 (2.198 0.79973 0.42782 0.39897 0.32182 0.30621 0.14353 0.13925 0.030397)
382.19860 11.90 170 (1.3657)
384.21425 11.90 171 (1.3657)
441.18809 10.56 277 313 (0.60668 0.60585)

0 468.1989933521 Cc1cnc2cc(C)c3c(nc([NH2+]c4c(C)c(=O)[nH]c(=O)n4C4CC(O)C(CO)O4)n3C)c2n1
1 436.1727786041 CC1=CNC2=CC(C)=C3C(=NC(=[NH+]C4=C(C)C(=O)N=C(O)N4C4C=C(O)CO4)N3C)C2=N1
2 438.1884286681 CC1=C2C(=NC(=[NH+]C3=C(C)C(=O)N=C(O)N3C3C=C(O)CO3)N2C)C2=NC(C)CNC2=C1
3 450.1884286681 C=C1OC(N2C(O)=NC(=O)C(C)=C2[NH+]=C2N=C3C4=NC(C)CNC4=CC(C)=C3N2C)C=C1O
4 354.1672993001 C=C1C(=O)N=C(O)N=C1[NH+]=C1N=C2C(=C(C)C=C3NCC(C)NC32)N1C
5 352.1516492361 C=C1C(=O)N=C(O)N=C1[NH+]=C1N=C2C3=NC(C)CNC3=CC(C)=C2N1C
6 350.1359991721 C=C1C(=O)N=C(O)N=C1[NH+]=C1N=C2C3=NC(C)=CNC3=CC(C)=C2N1C
7 348.1203491081 [CH+]=C1C(=O)N=C(O)N=C1N=C1N=C2C3=NC(C)=CNC3=CC(C)=C2N1C
8 99.0440558841 C=C1OC=CC1[OH2+]
9 101.0597059481 CC1OC=CC1[OH2+]
10 434.1571285401 C=C1OC(N2C(O)=NC(=O)C(C)=C2[NH+]=C2N=C3C(=CC=C4NC=C(C)N=C43)N2C)C=C1O
11 432.1778639841 C=C1C=CC(N2C(O)=NC(=O)C(C)=C2[NH+]=C2N=C3C4=NC(C)=CNC4=CC(C)=C3N2C)O1
12 450.1884286681 CC(=O)C(O)=C=CN1C(O)=NC(=O)C(C)=C1[NH+]=C1N=C2C3=NC(C)CNC3=CC(C)=C2N1C Intermediate Fragment 
13 450.1884286681 C#CC(O)=C=C(O)N1C(O)=NC(=O)C(C)=C1[NH+]=C1N=C2C(=C(C)C=C3NCC(C)NC32)N1C Intermediate Fragment 
14 450.1884286681 C#COC(=C=CO)N1C(O)=NC(=O)C(C)=C1[NH+]=C1N=C2C(=C(C)C=C3NCC(C)NC32)N1C Intermediate Fragment 
15 408.1778639841 CC1=C2C(=NC(=[NH+]C3=C(C)C(=O)N=C(O)N3CC#CO)N2C)C2=NC(C)CNC2=C1
16 424.1727786041 CC1=C2C(=NC(=[NH+]C3=C(C)C(=O)N=C(O)N3C(=O)C#CO)N2C)C2NC(C)CNC2=C1
17 450.1884286681 C=C1OC(=NC([NH+]=C2N=C3C(=C(C)C=C4NCC(C)NC43)N2C)=C(C)C(=O)N=C=O)C=C1O Intermediate Fragment 
18 407.1826150161 C=C1OC(=[NH+]C(N=C2N=C3C4=NC(C)CNC4=CC(C)=C3N2C)=C(C)C=O)C=C1O
19 450.1884286681 C=NC1=C(N=C=[NH+]C2=C(C)C(=O)N=C(O)N2C2C=C(O)C(=C)O2)C2=C(C=C1C)NCC(C)N2 Intermediate Fragment 
20 450.1884286681 C=C1OC(N2C(O)=NC(=O)C(C)=C2[NH+]=C2N=CC(=C(C)C=C3C=NC(C)=CN3)N2C)C=C1O Intermediate Fragment 
21 450.1884286681 C=C(C)N=C1C(N)=CC(C)=C2C1=NC(=[NH+]C1=C(C)C(=O)N=C(O)N1C1C=C(O)C(=C)O1)N2C Intermediate Fragment 
22 433.1618795721 [CH+]=C1OC(N2C(O)=NC(=O)C(C)=C2N=C2N=C3C(=NC(=C)C)C=CC(C)=C3N2C)C=C1O
23 358.1985994281 CC1=C2C(=NC(=[NH+]C3=NC(O)=NC(O)=C3C)N2C)C2NC(C)CNC2C1
24 340.1880347441 CC1=C2C(=NC(=[NH+]C3=NC=NC(O)=C3C)N2C)C2NC(C)CNC2=C1
25 125.0345538201 C=C1C=NC(O)=NC1=[OH+]
26 127.0502038841 CC1C=NC(O)=NC1=[OH+]
27 219.1604230281 CC1=CC2NCC(C)NC2C2=C1N([CH4+])C=N2
28 140.0454528521 C=C1C(=O)N=C(O)N=C1[NH3+]
29 142.0611029161 CC1C(=O)N=C(O)N=C1[NH3+]
30 358.1985994281 CC1=C2C(=NC(=[NH+]C(=N)C(C)=C(O)N=C=O)N2C)C2NC(C)CNC2C1 Intermediate Fragment 
31 358.1985994281 CC(=C=O)C(=NC(=N)O)[NH+]=C1N=C2C(=C(C)CC3NCC(C)NC23)N1C Intermediate Fragment 
32 341.1720503321 CC(=C=O)C(N=C1N=C2C(=C(C)C=C3NCC(C)NC32)N1C)=[NH+]C=O
33 358.1985994281 C#CC(=NC(=O)N=C=O)[NH+]=C1NC2C3NC(C)CNC3CC(C)C2N1C Intermediate Fragment 
34 358.1985994281 C=C=C(O)N=C(O)N=C=[NH+]C1=NC2=C(C(C)CC3NCC(C)NC23)N1C Intermediate Fragment 
35 358.1985994281 CC(=C=[NH+]C1=NC2=C(C(C)=CC3NCC(C)NC23)N1C)C(=O)N=C(N)O Intermediate Fragment 
36 358.1985994281 C=NC1=C(N=C=[NH+]C2=NC(O)=NC(O)=C2C)C2NC(C)CNC2CC1C Intermediate Fragment 
37 358.1985994281 CC(C=C1CNC(C)CN1)=C1C=NC(=[NH+]C2=NC(O)=NC(O)=C2C)N1C Intermediate Fragment 
38 358.1985994281 CC1=C2C(=NC(=[NH+]C3=NC(O)=NC(O)=C3C)N2C)C(NC(C)C)C(N)=C1 Intermediate Fragment 
39 356.1829493641 CC1=C2C(=NC(=[NH+]C3=NC(O)=NC(O)=C3C)N2C)C2NC(C)CNC2=C1
40 334.1410845521 [CH2+]C1=CN=C(O)N=C1N=C1N=C2C3=NC(C)=CNC3=CC(C)=C2N1C
41 334.1410845521 [CH2+]C1=C(O)N=CN=C1N=C1N=C2C3=NC(C)=CNC3=CC(C)=C2N1C
42 336.1203491081 [CH2+]N1C(=NC2=NC(O)=NC(O)=C2)N=C2C3=NC(C)=CNC3=CC(C)=C21
43 228.1243718681 CC1=C2C(=NC(=[NH2+])N2C)C2=NC(C)C=NC2=C1
44 123.0189037561 [CH+]=C1C=NC(O)=NC1=O
45 213.1134728361 C=C1C=NC2=CC(C)C3=C(N=CN3[CH4+])C2=N1
46 211.0978227721 C=C1C=NC2=CC(=C)C3=C(N=CN3[CH4+])C2=N1
47 336.1203491081 CC1=CC2=C(N=C(C)C=N2)C2=NC(=[NH+]C3=NC(O)=NC(O)=C3C)N=C12
48 336.1203491081 [CH2+]C1=C(O)N=C(O)N=C1N=C1N=C2C3=NC=CNC3=CC(C)=C2N1C
49 336.1203491081 [CH2+]C1=C(O)N=C(O)N=C1N=C1N=C2C(=CC=C3NC=C(C)N=C32)N1C
50 352.1516492361 CC1=CNC2=CC(C)=C3C(=NC(=[NH+]C(=N)C(C)=C(O)N=C=O)N3C)C2=N1 Intermediate Fragment 
51 251.1039707721 C=C1C=NC2=CC(C)=C3C(=NC(=NC#[NH+])N3C)C2=N1
52 253.1196208361 CC1=C2C(=NC(=NC#[NH+])N2C)C2=NC(C)C=NC2=C1
53 255.1352709001 CC1=C2C(=NC(=NC#[NH+])N2C)C2=NC(C)CNC2=C1
54 277.1196208361 C#CC(=[NH2+])N=C1N=C2C3=NC(=C)C=NC3=CC(C)=C2N1C
55 279.1352709001 C#CC(=[NH2+])N=C1N=C2C3=NC(C)C=NC3=CC(C)=C2N1C
56 281.1509209641 C#CC(=[NH2+])N=C1N=C2C3=NC(C)CNC3=CC(C)=C2N1C
57 307.1301855201 C=C1C=NC2=CC(C)=C3C(=NC(=NC(=[NH2+])C(C)=C=O)N3C)C2=N1
58 309.1458355841 CC(=C=O)C(=[NH2+])N=C1N=C2C3=NC(C)C=NC3=CC(C)=C2N1C
59 324.1567346161 C=C(C(=[NH2+])N=C1N=C2C3=NC(C)C=NC3=CC(C)=C2N1C)C(N)=O
60 352.1516492361 CC1=CNC2=CC(C)=C3C(=NC(=NC(=NC#[O+])C(C)=C(N)O)N3C)C2=N1 Intermediate Fragment 
61 307.1301855201 C=C1C=NC2=CC(=C)C3=C(N=C(N=C=C(C)C([NH3+])=O)N3C)C2=N1
62 74.0600402961 CCC([NH3+])=O
63 281.1145354561 C=C1C=NC2=CC(C)C3=C(N=C(N=C=[NH+]C=O)N3C)C2=N1
64 309.1458355841 C#CC(N=C1N=C2C3=NC(C)CNC3=CC(C)=C2N1C)=[NH+]C=O
65 335.1251001401 CC(=C=O)C(=NC#[O+])N=C1N=C2C3=NC(C)=CNC3=CC(C)=C2N1C
66 350.1359991721 C=C(C(N)=O)C(=NC#[O+])N=C1N=C2C3=NC(C)=CNC3=CC(C)=C2N1C
67 352.1516492361 CC(=C=O)C(=NC(=N)O)[NH+]=C1N=C2C3=NC(C)=CNC3=CC(C)=C2N1C Intermediate Fragment 
68 292.1192864881 C=C1C=NC2=CC(=C)C3=C(N=C([NH+]=C=C(C)C=O)N3C)C2=N1
69 296.1254344881 C=C1C=NC2=CC(C)C3=C(N=C(N=C=[NH+]C(=N)O)N3C)C2=N1
70 298.1410845521 CC1C=NC2=CC(C)C3=C(N=C(N=C=[NH+]C(=N)O)N3C)C2=N1
71 324.1567346161 C#CC(N=C1N=C2C3=NC(C)CNC3=CC(C)=C2N1C)=[NH+]C(=N)O
72 352.1516492361 C#CC(=NC(=O)N=C=O)[NH+]=C1N=C2C(=C(C)C=C3NCC(C)NC32)N1C Intermediate Fragment 
73 266.1400219321 C=C=C=[NH+]C1=NC2=C(C(C)C=C3N=CC(C)N=C32)N1C
74 264.1243718681 C=C=C=[NH+]C1=NC2=C(C(C)C=C3N=CC(=C)N=C32)N1C
75 262.1087218041 C=C=C=[NH+]C1=NC2=C(C(=C)C=C3N=CC(=C)N=C32)N1C
76 322.1410845521 C#CC(N=C1N=C2C3=NC(C)=CNC3=CC(C)=C2N1C)=[NH+]C(=N)O
77 307.1301855201 C#CC(N=C1N=C2C3=NC(C)=CNC3=CC(C)=C2N1C)=[NH+]C=O
78 305.1145354561 C#CC(=NC#[O+])N=C1N=C2C3=NC(C)=CNC3=CC(C)=C2N1C
79 352.1516492361 C=C=C(O)N=C(O)N=C=[NH+]C1=NC2=C(C(C)=CC3=C2N=C(C)CN3)N1C Intermediate Fragment 
80 238.1087218041 C=[NH+]C1=NC2=C(C(=C)C=C3N=CC(=C)N=C32)N1C
81 279.0988853921 C=C1C=NC2=CC(=C)C3=C(N=C(N=C=[NH+]C=O)N3C)C2=N1
82 352.1516492361 CC(=C=[NH+]C1=NC2=C(C(C)=CC3=C2N=C(C)C=N3)N1C)C(=O)N=C(N)O Intermediate Fragment 
83 240.1243718681 C=[NH+]C1=NC2=C(C(C)C=C3N=CC(=C)N=C32)N1C
84 260.0930717401 [CH+]=C=C=NC1=NC2=C(C(=C)C=C3N=CC(=C)N=C32)N1C
85 290.1036364241 C=C1C=NC2=CC(=C)C3=C(N=C(N=C=C(C)C#[O+])N3C)C2=N1
86 309.1458355841 C=C1C=NC2=CC(C)C3=C(N=C(N=C=C(C)C([NH3+])=O)N3C)C2=N1
87 335.1251001401 CC(=C=NC1=NC2=C(C(C)=CC3=C2N=C(C)C=N3)N1C)C(=O)[NH+]=C=O
88 350.1359991721 [CH2+]C(=C=NC1=NC2=C(C(C)=CC3=C2N=C(C)C=N3)N1C)C(=O)N=C(N)O
89 352.1516492361 CC1=CNC2=CC(C)=C(N(C)C#[N+]C3=NC(O)=NC(O)=C3C)C(=N)C2=N1 Intermediate Fragment 
90 352.1516492361 C=NC1=C(N=C=[NH+]C2=NC(O)=NC(O)=C2C)C2=C(C=C1C)NCC(C)=N2 Intermediate Fragment 
91 201.1134728361 C=C1C=NC2=CC(C)C(=NC)C(=[NH2+])C2=N1
92 150.0298027881 C#[N+]C1=NC(O)=NC(=O)C1=C
93 152.0454528521 C=[NH+]C1=NC(O)=NC(=O)C1=C
94 154.0611029161 C=C1C(=O)N=C(O)N=C1[NH2+]C
95 167.0563518841 C=C1C(=O)N=C(O)N=C1[NH+]=CN
96 321.1094500761 [CH2+]C1=C(O)N=C(O)N=C1N=C=NC1=CC(C)=CC2=C1N=C(C)C=N2
97 323.1251001401 CC1=CC2=C(N=C(C)C=N2)C(N=C=[NH+]C2=NC(O)=NC(O)=C2C)=C1
98 325.1407502041 CC1=CC2=C(N=C(C)CN2)C(N=C=[NH+]C2=NC(O)=NC(O)=C2C)=C1
99 350.1359991721 C=NC1=C(N=C=[NH+]C2=NC(O)=NC(O)=C2C)C2=C(C=C1C)N=CC(C)=N2
100 352.1516492361 C=NC(N=C1C=C(C)C=C2NC=C(C)N=C21)=[NH+]C1=NC(O)=NC(O)=C1C Intermediate Fragment 
101 352.1516492361 [CH2+]C1=C(O)N=C(O)N=C1N=C(N)N(C)C1=CC2=C(C=C1C)N=CC(C)=N2 Intermediate Fragment 
102 352.1516492361 [CH2+]C1=C(O)N=C(O)N=C1N=C1N=C(C2=CN=CC(C)=N2)C(=C(C)C)N1C Intermediate Fragment 
103 352.1516492361 [CH2+]C1=C(O)N=C(O)N=C1N=C1N=CC(=C(C)C=C2C=NC(C)=CN2)N1C Intermediate Fragment 
104 220.0829009801 C=C1C(=O)N=C(O)N=C1[NH+]=C1N=CCN1C
105 222.0985510441 C=C1C(=O)N=C(O)N=C1[NH+]=C1NCCN1C
106 244.0829009801 C=C=C1C=NC(=[NH+]C2=NC(O)=NC(=O)C2=C)N1C
107 246.0985510441 C=C1C(=O)N=C(O)N=C1[NH+]=C1N=CC(=CC)N1C
108 93.0447245801 [CH2+]C1=NC=CN=C1
109 258.0985510441 [CH+]=C1C(=O)N=C(O)N=C1N=C1N=CC(=C(C)C)N1C
110 350.1359991721 [CH+]=C1C(=O)N=C(O)N=C1N=C1N=CC(=C(C)C=C2C=NC(C)=CN2)N1C
111 352.1516492361 C=C=C=C1NC=C(C)N=C1C1=NC(=[NH+]C2=NC(O)=NC(O)=C2C)N(C)C1 Intermediate Fragment 
112 133.0760247081 C=C1C=NC(=C=[CH2+]C)C=N1
113 352.1516492361 CC=C=NC1=CC(C)=C2C(=NC(=[NH+]C3=NC(O)=NC(O)=C3C)N2C)C1=N Intermediate Fragment 
114 352.1516492361 C=CN=C1C(N=C)=CC(C)=C2C1=NC(=[NH+]C1=NC(O)=NC(O)=C1C)N2C Intermediate Fragment 
115 325.1407502041 C=CN=C1C=CC(C)=C2C1=NC(=[NH+]C1=NC(O)=NC(O)=C1C)N2C
116 352.1516492361 C=C(C)N=C1C(N)=CC(C)=C2C1=NC(=NC1=NC(O)=NC(O)=C1[CH2+])N2C Intermediate Fragment 
117 312.1203491081 C=C1C(=O)N=C(O)N=C1[NH+]=C1N=C2C(=N)C(N)=CC(C)=C2N1C
118 335.1251001401 [CH+]=C1C(=O)N=C(O)N=C1N=C1N=C2C(=NC(=C)C)C=CC(C)=C2N1C
119 352.1516492361 CC(=C=N)N=C1C=CC(C)=C2C1=NC(=[NH+]C1=NC(O)=NC(O)=C1C)N2C Intermediate Fragment 
120 352.1516492361 [CH2+]C1=C(O)N=C(O)N=C1N=C1N=C2CC(N=CC(C)=N)=CC(C)=C2N1C Intermediate Fragment 
121 335.1251001401 [CH+]=C1C(=O)N=C(O)N=C1N=C1N=C2CC(NC#CC)=CC(C)=C2N1C
122 111.0076703761 O=C1C=COC1=C=[OH+]
123 113.0233204401 OC1C=COC1=C=[OH+]
124 85.0284058201 [OH+]=C1C=COC1
125 113.0233204401 C=C=C(O)C(=O)C=[OH+] Intermediate Fragment 
126 115.0389705041 OC1C=COC1=C[OH2+]
127 87.0440558841 [OH2+]C1C=COC1
128 97.0284058201 [CH+]=C1OCC=C1O
129 97.0284058201 [OH+]=C=C1C=CCO1
130 115.0389705041 C=C=C(O)C(=O)C[OH2+] Intermediate Fragment 
131 97.0284058201 C=C=C(O)C#C[OH2+]
132 57.0334912001 C=C=C[OH2+]
133 115.0389705041 O=C=C=C(O)CC[OH2+] Intermediate Fragment 
134 45.0334912001 C=C[OH2+]
135 43.0178411361 C#C[OH2+]
136 115.0389705041 OC=C=COC=C[OH2+] Intermediate Fragment 
137 117.0546205681 OC1C=COC1C[OH2+]
138 89.0597059481 [OH2+]C1CCOC1
139 99.0440558841 [OH2+]C=C1C=CCO1
140 117.0546205681 C=COC(=C[OH2+])CO Intermediate Fragment 
141 91.0389705041 OCC(=[OH+])CO
142 117.0546205681 C=C=C(O)C(O)C[OH2+] Intermediate Fragment 
143 99.0440558841 C=C=C(O)C=C[OH2+]
144 59.0491412641 CC=C[OH2+]
145 61.0284058201 OCC=[OH+]
146 117.0546205681 OC=C=C(O)CC[OH2+] Intermediate Fragment 
147 89.0597059481 C=C(O)CC[OH2+]
148 117.0546205681 OC=C=COCC[OH2+] Intermediate Fragment 
149 450.1884286681 CC1=C2C(=NC(=[NH+]C3=C(C)C(=O)N=CN3C3C=C(O)C(=C=O)O3)N2C)C2NC(C)CNC2=C1
150 239.0662478721 CC1=CN(C2C=C(O)C(=C=[OH+])O2)C(O)NC1=O
151 241.0818979361 CC1=CN(C2C=C(O)C(=C=[OH+])O2)C(O)NC1O
152 241.0818979361 CC1=CN(C=C=C(O)C(=O)C=[OH+])C(O)NC1O Intermediate Fragment 
153 243.0975480001 CC1CN(C2C=C(O)C(=C=[OH+])O2)C(O)NC1O
154 258.1084470321 CC1C(O)NC(O)N(C2C=C(O)C(=C=O)O2)C1[NH3+]
155 258.1084470321 CC1C(O)NC(O)N(C(O)=C=C(O)C#CO)C1[NH3+] Intermediate Fragment 
156 452.1676932241 CC1=CC2NCC(C)NC2C2=NC(=[NH+]C3=C(C)C(=O)N=C(O)N3C3C=C(O)C(=C=O)O3)N=C12
157 452.1676932241 CC1=C2C(=NC(=[NH+]C3=C(C)C(=O)N=C(O)N3C3C=C(O)C(=C=O)O3)N2C)C2NCCNC2=C1
158 452.1676932241 CC1=C([NH+]=C2N=C3C(=CC=C4NCC(C)NC43)N2C)N(C2C=C(O)C(=C=O)O2)C(O)=NC1=O
159 338.1359991721 C=C1C(=O)N=C(O)N=C1[NH+]=C1N=C2C(=CC=C3NCC(C)N=C32)N1C
160 452.1676932241 CC1=C([NH+]=C2N=C3C(=CC=C4NCC(C)NC43)N2C)N(C=C=C(O)C(=O)C=O)C(O)=NC1=O Intermediate Fragment 
161 450.1884286681 CC1=C2C(=NC(=[NH+]C3=C(C)C(=O)N=C(O)N3C3C=CC(=C=O)O3)N2C)C2NC(C)CNC2=C1
162 450.1884286681 CC(C=C1C=NC(C)CN1)=C1C=NC(=[NH+]C2=C(C)C(=O)N=C(O)N2C2C=CC(=C=O)O2)N1C Intermediate Fragment 
163 468.1989933521 C=C(OC(=C=O)CO)N1C(O)=NC(=O)C(C)=C1[NH+]=C1N=C2C(=C(C)C=C3NCC(C)NC32)N1C Intermediate Fragment 
164 376.1516492361 C#CN1C(O)=NC(=O)C(C)=C1[NH+]=C1N=C2C3=NC(C)=CNC3=CC(C)=C2N1C
165 378.1672993001 C#CN1C(O)=NC(=O)C(C)=C1[NH+]=C1N=C2C3=NC(C)CNC3=CC(C)=C2N1C
166 378.1672993001 C#CN(C(=O)N=C=O)C(=C=C)[NH+]=C1N=C2C(=C(C)C=C3NCC(C)NC32)N1C Intermediate Fragment 
167 307.1665710281 C#C[NH+]=C(C#C)N=C1N=C2C(=C(C)C=C3NCC(C)NC32)N1C
168 378.1672993001 C#CN1C(O)=NC(=O)C(C)=C1[NH+]=C1N=CC(=C(C)C=C2C=NC(C)=CN2)N1C Intermediate Fragment 
169 380.1829493641 C#CN1C(O)=NC(=O)C(C)=C1[NH+]=C1N=C2C(=C(C)C=C3NCC(C)NC32)N1C
170 382.1985994281 C#CN1C(O)=NC(=O)C(C)=C1[NH+]=C1N=C2C(=C(C)CC3NCC(C)NC23)N1C
171 384.2142494921 C#CN1C(O)=NC(=O)C(C)=C1[NH+]=C1N=C2C3NC(C)CNC3CC(C)C2N1C
172 394.1622139201 C=C(O)N1C(O)=NC(=O)C(C)=C1[NH+]=C1N=C2C3=NC(C)=CNC3=CC(C)=C2N1C
173 396.1778639841 C=C(O)N1C(O)=NC(=O)C(C)=C1[NH+]=C1N=C2C3=NC(C)CNC3=CC(C)=C2N1C
174 468.1989933521 C=C(O)C(=C=O)OCN1C(O)=NC(=O)C(C)=C1[NH+]=C1N=C2C(=C(C)C=C3NCC(C)NC32)N1C Intermediate Fragment 
175 364.1516492361 C=C1C=NC2=CC(C)=C3C(=NC(=[NH+]C4=C(C)C(=O)N=C(O)N4C)N3C)C2=N1
176 366.1672993001 CC1=C2C(=NC(=[NH+]C3=C(C)C(=O)N=C(O)N3C)N2C)C2=NC(C)C=NC2=C1
177 468.1989933521 CC1=C2C(=NC(=[NH+]C3=C(C)C(=O)N=C(O)N3C=C=C(O)C(=O)C=O)N2C)C2NC(C)CNC2C1 Intermediate Fragment 
178 87.0076703761 O=CC(=[OH+])C=O
179 89.0233204401 O=CC(=[OH+])CO
180 73.0284058201 OCC#C[OH2+]
181 93.0546205681 OCC([OH2+])CO
182 75.0440558841 OCC=C[OH2+]
183 370.1985994281 CC1=C2C(=NC(=[NH+]C3=C(C)C(=O)N=C(O)N3C)N2C)C2NC(C)CNC2=C1
184 368.1829493641 CC1=C2C(=NC(=[NH+]C3=C(C)C(=O)N=C(O)N3C)N2C)C2=NC(C)CNC2=C1
185 362.1359991721 C=C1C=NC2=CC(C)=C3C(=NC(=NC4=C(C)C(=O)N=C(O)N4[CH2+])N3C)C2=N1
186 362.1359991721 [CH+]=NC(N=C1N=C2C3=NC(C)=CNC3=CC(C)=C2N1C)=C(C)C(=O)N=C=O Intermediate Fragment 
187 291.1352709001 C=C=C(N=C1N=C2C3=NC(=C)C=NC3=CC(C)=C2N1C)[NH+]=C
188 319.1301855201 C=[NH+]C(=NC1=NC2=C(C(=C)C=C3N=CC(=C)N=C32)N1C)C(C)=C=O
189 362.1359991721 C=C=C(N=C1N=C2C3=NC(C)=CNC3=CC(C)=C2N1C)N([CH2+])C(=O)N=C=O Intermediate Fragment 
190 319.1301855201 C#CC(=NC1=NC2=C(C(=C)C=C3N=CC(=C)N=C32)N1C)[NH+](C)C=O
191 362.1359991721 C=C1C=NC(=C=C(C)C2=CN=C(N=C3C(=C)C(=O)N=C(O)N3[CH2+])N2C)C=N1 Intermediate Fragment 
192 450.1884286681 CC1=C2C(=NC(=[NH+]C3=C(C)C(=O)N=C(O)N3C=C=C(O)C#CO)N2C)C2NC(C)CNC2=C1
193 432.1778639841 C#CC(O)=C=CN1C(O)=NC(=O)C(C)=C1[NH+]=C1N=C2C3=NC(C)CNC3=CC(C)=C2N1C
194 432.1778639841 CC1=C2C(=NC(=[NH+]C3=C(C)C(=O)N=C(O)N3CC#CC#CO)N2C)C2=NC(C)CNC2=C1
195 406.1622139201 CC1=CNC2=CC(C)=C3C(=NC(=[NH+]C4=C(C)C(=O)N=C(O)N4CC#CO)N3C)C2=N1
196 412.2091641121 CC1=C2C(=NC(=[NH+]C3=C(C)C(=O)N=C(O)N3CC#CO)N2C)C2NC(C)CNC2C1
197 410.1935140481 CC1=C2C(=NC(=[NH+]C3=C(C)C(=O)N=C(O)N3CC#CO)N2C)C2NC(C)CNC2=C1
198 392.1829493641 C#CCN1C(O)=NC(=O)C(C)=C1[NH+]=C1N=C2C3=NC(C)CNC3=CC(C)=C2N1C
199 390.1672993001 C#CCN1C(O)=NC(=O)C(C)=C1[NH+]=C1N=C2C3=NC(C)=CNC3=CC(C)=C2N1C
200 408.1778639841 C=C=C([NH+]=C1N=C2C(=C(C)C=C3NCC(C)NC32)N1C)N(CC#CO)C(=O)N=C=O Intermediate Fragment 
201 337.1771357121 C=C=C(N=C1N=C2C(=C(C)C=C3NCC(C)NC32)N1C)[NH+]=CC#CO
202 408.1778639841 CC1=CNC(=CC(C)=C2C=NC(=[NH+]C3=C(C)C(=O)N=C(O)N3CC#CO)N2C)C=N1 Intermediate Fragment 
203 468.1989933521 CC1=C2C(=NC(=[NH+]C3=C(C)C(=O)N=C(O)N3C(O)=C=C(O)C#CO)N2C)C2NC(C)CNC2C1 Intermediate Fragment 
204 400.2091641121 C=C(O)N1C(O)=NC(=O)C(C)=C1[NH+]=C1N=C2C(=C(C)CC3NCC(C)NC23)N1C
205 398.1935140481 C=C(O)N1C(O)=NC(=O)C(C)=C1[NH+]=C1N=C2C(=C(C)C=C3NCC(C)NC32)N1C
206 392.1465638561 [CH+]=C(O)N1C(O)=NC(=O)C(C)=C1N=C1N=C2C3=NC(C)=CNC3=CC(C)=C2N1C
207 68.9971056921 [O+]#CC#CO
208 71.0127557561 O=CC#C[OH2+]
209 55.0178411361 C#CC=[OH+]
210 384.1778639841 CC1=C2C(=NC(=[NH+]C3=C(C)C(=O)N=C(O)N3C=O)N2C)C2NC(C)CNC2=C1
211 382.1622139201 CC1=C2C(=NC(=[NH+]C3=C(C)C(=O)N=C(O)N3C=O)N2C)C2=NC(C)CNC2=C1
212 382.1622139201 CC1=C2C(=NC(=[NH+]C(N=C=O)=C(C)C(=O)N=C=O)N2C)C2NC(C)CNC2=C1 Intermediate Fragment 
213 382.1622139201 CC1=CNC2=CC(C)=C3C(=NC(=[NH+]C(=C(C)C=O)N(C=O)C(=N)O)N3C)C2=N1 Intermediate Fragment 
214 382.1622139201 C=C=C([NH+]=C1N=C2C(=C(C)C=C3NCC(C)NC32)N1C)N(C=O)C(=O)N=C=O Intermediate Fragment 
215 382.1622139201 CC(=C=[NH+]C1=NC2=C(C(C)=CC3=C2NC(C)CN3)N1C)C(=O)N=C(O)N=C=O Intermediate Fragment 
216 382.1622139201 CC1=CNC(=CC(C)=C2C=NC(=[NH+]C3=C(C)C(=O)N=C(O)N3C=O)N2C)C=N1 Intermediate Fragment 
217 380.1465638561 CC1=CNC(=CC(C)=C2C=NC(=NC3=C(C)C(=O)N=C(O)N3C#[O+])N2C)C=N1
218 382.1622139201 C=C(C)N=C1C(N)=CC(C)=C2C1=NC(=[NH+]C1=C(C)C(=O)N=C(O)N1C=O)N2C Intermediate Fragment 
219 365.1356648241 C=C(C)N=C1C=CC(C)=C2C1=NC(=NC1=C(C)C(=O)N=C(O)N1C#[O+])N2C
220 380.1465638561 C=C(C)N=C1C(N)=CC(C)=C2C1=NC(=NC1=C(C)C(=O)N=C(O)N1C#[O+])N2C
221 364.1152637281 CC1=CNC2=CC=C3C(=NC(=NC4=C(C)C(=O)N=C(O)N4C#[O+])N3C)C2=N1
222 380.1465638561 CC1=C2C(=NC(=[NH+]C(N=C=O)=C(C)C(=O)N=C=O)N2C)C2=NC(C)CNC2=C1 Intermediate Fragment 
223 337.1407502041 CC(C=O)=C(N=C1N=C2C3=NC(C)C=NC3=CC(C)=C2N1C)[NH+]=C=O
224 380.1465638561 CC1=CNC2=CC(C)=C3C(=NC(=NC(=C(C)C=O)N(C#[O+])C(=N)O)N3C)C2=N1 Intermediate Fragment 
225 380.1465638561 C=C=C([NH+]=C1N=C2C3=NC(C)CNC3=CC(C)=C2N1C)N(C=O)C(=O)N=C=O Intermediate Fragment 
226 352.1516492361 C=C=C(N=C1N=C2C3=NC(C)C=NC3=CC(C)=C2N1C)[NH+](C=O)C(=N)O
227 337.1407502041 C=C=C(N=C1N=C2C3=NC(C)C=NC3=CC(C)=C2N1C)[NH+](C=O)C=O
228 335.1251001401 C=C=C(N=C1N=C2C3=NC(=C)C=NC3=CC(C)=C2N1C)[NH+](C=O)C=O
229 380.1465638561 C=C=C(O)N=C(O)N(C=O)C=[NH+]C1=NC2=C(C(C)=CC3=C2N=C(C)C=N3)N1C Intermediate Fragment 
230 380.1465638561 CC(=C=[NH+]C1=NC2=C(C(C)=CC3=C2N=C(C)CN3)N1C)C(=O)N=C(O)N=C=O Intermediate Fragment 
231 337.1407502041 CC(=C=NC1=NC2=C(C(C)=CC3=C2N=C(C)CN3)N1C)C(=O)[NH+]=C=O
232 380.1465638561 C=NC1=C(N=C=[NH+]C2=C(C)C(=O)N=C(O)N2C=O)C2=C(C=C1C)NCC(C)=N2 Intermediate Fragment 
233 378.1309137921 C=NC1=C(N=C=[NH+]C2=C(C)C(=O)N=C(O)N2C=O)C2=C(C=C1C)N=CC(C)=N2
234 380.1465638561 C=C=C=C1NC=C(C)N=C1C1=NC(=[NH+]C2=C(C)C(=O)N=C(O)N2C=O)N(C)C1 Intermediate Fragment 
235 360.1203491081 C=C1C=NC2=CC(=C)C3=C(N=C(N=C4C(=C)C(=O)N=C(O)N4[CH2+])N3C)C2=N1
236 378.1309137921 CC1=CNC2=CC(C)=C3C(=NC(=[NH+]C(N=C=O)=C(C)C(=O)N=C=O)N3C)C2=N1 Intermediate Fragment 
237 87.0440558841 C=C(O)C=C[OH2+]
238 71.0491412641 C=CC(=C)[OH2+]
239 71.0491412641 C#CCC[OH2+]
240 91.0753560121 CC(O)CC[OH2+]
241 73.0647913281 C=C([OH2+])CC
242 426.1884286681 CC1=C2C(=NC(=[NH+]C3=C(C)C(=O)N=C(O)N3C(=O)C#CO)N2C)C2NC(C)CNC2C1
243 424.1727786041 CC(C=C1C=NC(C)CN1)=C1C=NC(=[NH+]C2=C(C)C(=O)N=C(O)N2C(=O)C#CO)N1C Intermediate Fragment 
244 422.1571285401 CC1=C2C(=NC(=[NH+]C3=C(C)C(=O)N=C(O)N3C(=O)C#CO)N2C)C2=NC(C)CNC2=C1
245 47.0491412641 CC[OH2+]
246 468.1989933521 CC1=C2C(=NC(=[NH+]C3=C(C)C(=O)N=C(O)N3C(=C=CO)OC#CO)N2C)C2NC(C)CNC2C1 Intermediate Fragment 
247 468.1989933521 C=C=C([NH+]=C1N=C2C3NC(C)CNC3CC(C)C2N1C)N(C(=O)N=C=O)C1C=C(O)C(=C=O)O1 Intermediate Fragment 
248 425.1931797001 C=C=C(N=C1N=C2C(=C(C)CC3NCC(C)NC23)N1C)[NH+](C=O)C1C=C(O)C(=C=O)O1
249 423.1775296361 C=C=C(N=C1N=C2C(=C(C)C=C3NCC(C)NC32)N1C)[NH+](C=O)C1C=C(O)C(=C=O)O1
250 397.1982650801 C=C=C(N=C1N=C2C3NC(C)CNC3CC(C)C2N1C)[NH+]=C1C=C(O)C(=C=O)O1
251 397.1982650801 C#CC(N=C1N=C2C3NC(C)CNC3CC(C)C2N1C)=[NH+]C(O)=C=C(O)C#CO Intermediate Fragment 
252 353.1720503321 C#CC(N=C1N=C2C(=C(C)CC3NCC(C)NC23)N1C)=[NH+]C(=O)C#CO
253 395.1826150161 C=C=C(N=C1N=C2C(=C(C)CC3NCC(C)NC23)N1C)[NH+]=C1C=C(O)C(=C=O)O1
254 468.1989933521 CC1=C2C(=NC(=[NH+]C(=C(C)C=O)N(C(=N)O)C3C=C(O)C(=C=O)O3)N2C)C2NC(C)CNC2=C1 Intermediate Fragment 
255 451.1724442561 CC1=C2C(=NC(=NC(=C(C)C=O)[NH+](C=O)C3C=C(O)C(=C=O)O3)N2C)C2=NC(C)CNC2=C1
256 425.1931797001 CC(C=O)=C(N=C1N=C2C(=C(C)CC3NCC(C)NC23)N1C)[NH+]=C1C=C(O)C(=C=O)O1
257 425.1931797001 CC(=C=O)C(N=C1N=C2C(=C(C)CC3NCC(C)NC23)N1C)=[NH+]C(O)=C=C(O)C#CO Intermediate Fragment 
258 423.1775296361 CC(C=O)=C(N=C1N=C2C(=C(C)C=C3NCC(C)NC32)N1C)[NH+]=C1C=C(O)C(=C=O)O1
259 468.1989933521 CC1=C2C(=NC(=[NH+]C(=C(C)C(N)=O)N(C=O)C3C=C(O)C(=C=O)O3)N2C)C2NC(C)CNC2=C1 Intermediate Fragment 
260 468.1989933521 CC(C(=O)N=C=O)=C(N=C1C=C(O)C(=C=O)O1)[NH+]=C1N=C2C3NC(C)CNC3CC(C)C2N1C Intermediate Fragment 
261 421.1618795721 CC(C=O)=C(N=C1N=C2C3=NC(C)CNC3=CC(C)=C2N1C)[NH+]=C1C=C(O)C(=C=O)O1
262 440.2040787321 CC1=C2C(=NC(=NC([NH+]=C3C=C(O)C(=C=O)O3)=C(C)C(N)=O)N2C)C2NC(C)CNC2C1
263 468.1989933521 CC(=C=[NH+]C1=NC2=C(C(C)CC3NCC(C)NC23)N1C)C(=O)N=C(O)N=C1C=C(O)C(=C=O)O1 Intermediate Fragment 
264 296.1505866161 CC(=C=[NH+]C1=NC2=C(C(C)C=C3N=CC(C)N=C32)N1C)C=O
265 130.0498695361 [NH3+]C1C=C(O)C(=CO)O1
266 339.1564002681 CC(=C=NC1=NC2=C(C(C)=CC3=C2NC(C)CN3)N1C)C(=O)[NH+]=C=O
267 468.1989933521 C=C=C(O)N=C(O)N(C=[NH+]C1=NC2=C(C(C)=CC3NCC(C)NC23)N1C)C1C=C(O)C(=C=O)O1 Intermediate Fragment 
268 371.1826150161 CC1CNC2CC(C)C3=C(N=C(N=C[NH+]=C4C=C(O)C(=C=O)O4)N3C)C2N1
269 468.1989933521 CC1=C(N(C)C=[NH+]C2=C(C)C(=O)N=C(O)N2C2C=C(O)C(=C=O)O2)C(=N)C2NC(C)CNC2=C1 Intermediate Fragment 
270 468.1989933521 C=NC1=C(N=C=[NH+]C2=C(C)C(=O)N=C(O)N2C2C=C(O)C(=C=O)O2)C2NC(C)CNC2CC1C Intermediate Fragment 
271 283.1036960001 CC1=C([NH2+]CN)N(C2C=C(O)C(=C=O)O2)C(O)NC1=O
272 283.1036960001 CC1=C([NH2+]CN)N(C(O)=C=C(O)C#CO)C(O)NC1=O Intermediate Fragment 
273 285.1193460641 CC1=C([NH2+]CN)N(C2C=C(O)C(=C=O)O2)C(O)NC1O
274 437.1567941921 CC1=CC2=C(NC(C)CN2)C(N=C=[NH+]C2=C(C)C(=O)N=C(O)N2C2C=C(O)C(=C=O)O2)=C1
275 437.1567941921 CC1=CC2=C(NC(C)CN2)C(N=C=[NH+]C2=C(C)C(=O)N=C(O)N2C=C=C(O)C(=O)C=O)=C1 Intermediate Fragment 
276 439.1724442561 CC1=CC2NCC(C)NC2C(N=C=[NH+]C2=C(C)C(=O)N=C(O)N2C2C=C(O)C(=C=O)O2)=C1
277 441.1880943201 CC1=C([NH+]=C=NC2=CC(C)CC3NCC(C)NC23)N(C2C=C(O)C(=C=O)O2)C(O)=NC1=O
278 468.1989933521 C=NC(N=C1C=C(C)CC2NCC(C)NC12)=[NH+]C1=C(C)C(=O)N=C(O)N1C1C=C(O)C(=C=O)O1 Intermediate Fragment 
279 295.1036960001 CNC[NH2+]C1=C(C)C(=O)N=C(O)N1C1C=C(O)C(=C=O)O1
280 297.1193460641 CNC[NH2+]C1=C(C)C(=O)NC(O)N1C1C=C(O)C(=C=O)O1
281 468.1989933521 CC1=CC2=C(C=C1N(C)C(N)=[NH+]C1=C(C)C(=O)N=C(O)N1C1C=C(O)C(=C=O)O1)NC(C)CN2 Intermediate Fragment 
282 468.1989933521 CC(C)=C1C(C2=CNCC(C)N2)=NC(=[NH+]C2=C(C)C(=O)N=C(O)N2C2C=C(O)C(=C=O)O2)N1C Intermediate Fragment 
283 468.1989933521 CC(C=C1CNC(C)CN1)=C1C=NC(=[NH+]C2=C(C)C(=O)N=C(O)N2C2C=C(O)C(=C=O)O2)N1C Intermediate Fragment 
284 332.0989449681 CC1=C([NH+]=C2N=CCN2C)N(C2C=C(O)C(=C=O)O2)C(O)=NC1=O
285 334.1145950321 CC1=C([NH+]=C2NCCN2C)N(C2C=C(O)C(=C=O)O2)C(O)=NC1=O
286 336.1302450961 CC1=C([NH2+]C2NCCN2C)N(C2C=C(O)C(=C=O)O2)C(O)=NC1=O
287 338.1458951601 CC1=C([NH2+]C2NCCN2C)N(C2C=C(O)C(=C=O)O2)C(O)NC1=O
288 107.0603746441 C=C1C=NC(=[CH3+])C=N1
289 358.1145950321 CC=C1C=NC(=[NH+]C2=C(C)C(=O)N=C(O)N2C2C=C(O)C(=C=O)O2)N1C
290 360.1302450961 CCC1C=NC(=[NH+]C2=C(C)C(=O)N=C(O)N2C2C=C(O)C(=C=O)O2)N1C
291 362.1458951601 CCC1CNC(=[NH+]C2=C(C)C(=O)N=C(O)N2C2C=C(O)C(=C=O)O2)N1C
292 362.1458951601 CCC1CNC(=[NH+]C2=C(C)C(=O)N=C(O)N2C=C=C(O)C(=O)C=O)N1C Intermediate Fragment 
293 97.0760247081 [CH4+]C1=NC=CNC1
294 95.0603746441 [CH4+]C1=NC=CN=C1
295 95.0603746441 C=C([CH4+])N=C=C=N Intermediate Fragment 
296 68.0494756121 C#[N+]C(=C)C
297 95.0603746441 C=NC=C=NC=[CH3+] Intermediate Fragment 
298 95.0603746441 C=CN=CC([CH2+])=N Intermediate Fragment 
299 95.0603746441 C=NC([CH2+])=C=NC Intermediate Fragment 
300 93.0447245801 C=NC=C=NC#[CH2+] Intermediate Fragment 
301 66.0338255481 C#C[NH+]=C=C
302 370.1145950321 [CH2+]C1=C(N=C2N=CC(=C(C)C)N2C)N(C2C=C(O)C(=C=O)O2)C(O)=NC1=O
303 260.1142011081 C=C1C(=O)N=C(O)N=C1[NH+]=C1N=CC(=C(C)C)N1C
304 372.1302450961 CC(C)=C1C=NC(=[NH+]C2=C(C)C(=O)N=C(O)N2C2C=C(O)C(=C=O)O2)N1C
305 374.1458951601 CC1=C([NH+]=C2N=CC(C(C)C)N2C)N(C2C=C(O)C(=C=O)O2)C(O)=NC1=O
306 374.1458951601 CC1=C([NH+]=C2N=CC(C(C)C)N2C)N(C=C=C(O)C(=O)C=O)C(O)=NC1=O Intermediate Fragment 
307 374.1458951601 CNC(=CN=C=[NH+]C1=C(C)C(=O)N=C(O)N1C1C=C(O)C(=C=O)O1)C(C)C Intermediate Fragment 
308 466.1833432881 CC(C=C1C=NC(C)CN1)=C1C=NC(=[NH+]C2=C(C)C(=O)N=C(O)N2C2C=C(O)C(=C=O)O2)N1C
309 468.1989933521 CC=C=C1NCC(C)NC1C1=NC(=[NH+]C2=C(C)C(=O)N=C(O)N2C2C=C(O)C(=C=O)O2)N(C)C1 Intermediate Fragment 
310 468.1989933521 CCCNC1=CC(C)=C2C(=NC(=[NH+]C3=C(C)C(=O)N=C(O)N3C3C=C(O)C(=C=O)O3)N2C)C1N Intermediate Fragment 
311 413.1567941921 CC1=C2C(=NC(=[NH+]C3=C(C)C(=O)N=C(O)N3C3C=C(O)C(=C=O)O3)N2C)C(N)CC1
312 468.1989933521 CCNC1C(NC)=CC(C)=C2C1=NC(=[NH+]C1=C(C)C(=O)N=C(O)N1C1C=C(O)C(=C=O)O1)N2C Intermediate Fragment 
313 441.1880943201 CCNC1CCC(C)=C2C1=NC(=[NH+]C1=C(C)C(=O)N=C(O)N1C1C=C(O)C(=C=O)O1)N2C
314 468.1989933521 CC1=C2C(=NC(=[NH+]C3=C(C)C(=O)N=C(O)N3C3C=C(O)C(=C=O)O3)N2C)C(NC(C)C)C(N)=C1 Intermediate Fragment 
315 426.1520431601 CC1=C2C(=NC(=[NH+]C3=C(C)C(=O)N=C(O)N3C3C=C(O)C(=C=O)O3)N2C)C(N)C(N)=C1
316 428.1676932241 CC1=C2C(=NC(=[NH+]C3=C(C)C(=O)N=C(O)N3C3C=C(O)C(=C=O)O3)N2C)C(N)C(N)C1
317 428.1676932241 CC1=C2C(=NC(=[NH+]C3=C(C)C(=O)N=C(O)N3C=C=C(O)C(=O)C=O)N2C)C(N)C(N)C1 Intermediate Fragment 
318 428.1676932241 CC1=C2C(=NC(=[NH+]C3=C(C)C(=O)N=C(O)N3C(O)=C=C(O)C#CO)N2C)C(N)C(N)C1 Intermediate Fragment 
319 451.1724442561 CC1=C2C(=NC(=[NH+]C3=C(C)C(=O)N=C(O)N3C3C=C(O)C(=C=O)O3)N2C)C(=NC(C)C)C=C1
320 468.1989933521 CC1=C2C(=NC(=[NH+]C3=C(C)C(=O)N=C(O)N3C3C=C(O)C(=C=O)O3)N2C)C(NC(C)CN)C=C1 Intermediate Fragment 
321 468.1989933521 CC1=C2C(=NC(=[NH+]C3=C(C)C(=O)N=C(O)N3C3C=C(O)C(=C=O)O3)N2C)CC(NCC(C)N)=C1 Intermediate Fragment 
322 451.1724442561 CC=CNC1=CC(C)=C2C(=NC(=[NH+]C3=C(C)C(=O)N=C(O)N3C3C=C(O)C(=C=O)O3)N2C)C1
323 400.1615452241 CC1=C([NH+]=C2N=C3CCCC(C)C3N2C)N(C2C=C(O)C(=C=O)O2)C(O)=NC1=O
324 398.1458951601 CC1=C2C(=NC(=[NH+]C3=C(C)C(=O)N=C(O)N3C3C=C(O)C(=C=O)O3)N2C)CCC1
