#In-silico ESI-MS/MS [M+H]+ Spectra
#PREDICTED BY CFM-ID 4.0.8
#SMILES=[nH]1c(nc2c(c1=O)NC(N2[C@H]1C[C@H]([C@H](O1)CO)O)O)N
#InChiKey=VVTJFTSEHTXHFV-SUBNAYBESA-N
energy0
170.06725 30.99 18 47 56 37 43 30 50 22 40 45 (21.002 0.16531 0.066044 0.045905 0.026437 0.022017 0.018793 0.0098502 0.0075365 0.00043387)
286.11460 100.00 0 135 124 241 133 240 220 152 84 108 105 87 112 121 (66.884 1.1675 0.48165 0.10476 0.090086 0.073155 0.056726 0.038745 0.016987 0.0081632 0.006604 0.0052427 0.0014965 0.00071677)
energy1
152.05669 18.98 20 19 (10.685 0.14982)
153.04070 6.77 21 39 23 54 46 (2.6586 0.55464 0.54976 0.07037 0.02929)
170.06725 100.00 18 50 37 22 30 56 40 47 43 45 (50.845 3.1079 1.4746 0.56249 0.49232 0.20456 0.20297 0.082409 0.069563 0.053685)
286.11460 14.58 0 124 220 241 87 105 240 152 133 135 108 84 112 121 (7.3813 0.42236 0.16771 0.071253 0.056941 0.0498 0.040321 0.036074 0.034241 0.026394 0.025511 0.0077566 0.0043337 0.0010112)
energy2
45.03349 9.80 10 (1.6323)
57.03349 19.37 225 (3.2274)
59.04914 33.72 224 (5.6184)
61.02841 12.51 157 (2.0846)
71.04914 7.86 140 141 (0.83808 0.47178)
73.02841 7.88 159 11 (1.2202 0.092324)
75.04406 6.39 156 12 (0.98953 0.076023)
87.04406 3.92 138 5 (0.64996 0.002813)
91.07536 4.02 142 (0.66989)
100.05054 4.43 33 (0.7384)
111.01890 4.37 27 (0.72866)
125.04579 4.54 48 32 (0.47732 0.27851)
127.06144 8.28 31 49 51 (0.88397 0.41642 0.079052)
139.06144 5.07 148 131 (0.42957 0.41501)
140.05669 21.10 52 36 (3.5132 0.0027217)
152.05669 100.00 20 19 (16.151 0.51169)
153.04070 14.07 21 46 54 23 39 (1.9106 0.34147 0.066264 0.023696 0.0022892)
154.07234 13.06 2 59 (1.1303 1.0453)
155.05635 6.09 114 60 123 (0.4632 0.30242 0.24896)
168.05160 24.75 17 55 57 (3.746 0.23478 0.14365)
170.06725 45.10 18 50 56 30 40 22 37 45 43 47 (3.9073 1.1949 0.63269 0.51301 0.45738 0.39197 0.19236 0.10715 0.071406 0.046079)
174.09855 10.42 63 66 70 68 69 67 65 71 (1.2136 0.087437 0.086695 0.077563 0.075855 0.072553 0.061255 0.060574)
176.11420 8.38 72 73 (1.2373 0.15902)
180.05160 8.77 150 151 (0.76229 0.69881)
184.08290 8.75 144 (1.4584)
194.06725 6.16 164 170 166 168 172 165 (0.36526 0.21387 0.17885 0.113 0.094958 0.060202)
196.08290 17.90 174 193 176 175 173 (0.6558 0.62802 0.59791 0.56596 0.53561)
198.06217 33.27 137 (5.5428)
226.09347 17.17 192 184 186 191 190 195 (1.1255 0.67032 0.5979 0.26874 0.10597 0.092297)
284.09894 16.06 120 218 134 132 239 (1.9034 0.35439 0.30226 0.10641 0.0092223)

0 286.1145950321 [NH3+]c1nc2c(c(=O)[nH]1)NC(O)N2C1CC(O)C(CO)O1
1 268.1040303481 [NH3+]C1=NC=C2N=C(O)N(C3CC(O)C(CO)O3)C2=N1
2 154.0723362961 [NH3+]C1N=C2N=C(O)N=C2CN1
3 119.0702706321 OC1CCOC1C[OH2+]
4 117.0546205681 OC1C=COC1C[OH2+]
5 87.0440558841 [OH2+]C1C=COC1
6 99.0440558841 CC1=C([OH2+])C=CO1
7 99.0440558841 [OH2+]CC1=CC=CO1
8 117.0546205681 C=C(O)C(=C[OH2+])OC Intermediate Fragment 
9 117.0546205681 C=COC(=CO)C[OH2+] Intermediate Fragment 
10 45.0334912001 C=C[OH2+]
11 73.0284058201 OC#CC[OH2+]
12 75.0440558841 OC=CC[OH2+]
13 91.0389705041 OC=C([OH2+])CO
14 117.0546205681 OC=C=COCC[OH2+] Intermediate Fragment 
15 117.0546205681 OC=C=C(O)CC[OH2+] Intermediate Fragment 
16 99.0440558841 C#CC(O)=CC[OH2+]
17 168.0516008521 [NH3+]C1=NC(O)=C2N=C(O)NC2=N1
18 170.0672509161 [NH3+]C1=NC(O)=C2NC(O)NC2=N1
19 152.0566862321 [NH3+]C1=NC=C2N=C(O)NC2=N1
20 152.0566862321 [NH3+]C1=NC(O)=C2N=CNC2=N1
21 153.0407018201 OC1=NC2=C([OH2+])N=CN=C2N1
22 170.0672509161 N=C([NH3+])N=C1NC(O)NC1=C=O Intermediate Fragment 
23 153.0407018201 N=C=[NH+]C1=C(C=O)N=C(O)N1
24 128.0454528521 [NH2+]=C1NC(O)N=C1C=O
25 126.0298027881 [NH2+]=C1N=C(O)N=C1C=O
26 45.0447245801 NC=[NH2+]
27 111.0189037561 O=C1N=CC(C=[OH+])=N1
28 109.0032536921 O=C1N=CC(C#[O+])=N1
29 142.0723362961 NC(=[NH2+])N=C1C=NC(O)N1
30 170.0672509161 [NH3+]C(=NC=O)N=C1C=NC(O)N1 Intermediate Fragment 
31 127.0614372641 NC=[NH+]C1C=NC(O)=N1
32 125.0457872001 N=C=[NH+]C1C=NC(O)=N1
33 100.0505382321 [NH2+]=C1C=NC(O)N1
34 98.0348881681 [NH2+]=C1C=NC(O)=N1
35 88.0505382321 NC(N)=[NH+]C=O
36 140.0566862321 NC(=[NH2+])N=C1C=NC(O)=N1
37 170.0672509161 NC([NH3+])=NC(=O)C1=CNC(O)=N1 Intermediate Fragment 
38 128.0454528521 [NH3+]C(=O)C1=NC(=O)NC1
39 153.0407018201 N=C=[NH+]C(=O)C1=CNC(O)=N1
40 170.0672509161 N=C1NC(O)=NC1=C(O)N=C[NH3+] Intermediate Fragment 
41 141.0407018201 N=C1N=C(O)N=C1C([NH3+])=O
42 124.0141527241 N=C1N=C(O)N=C1C#[O+]
43 170.0672509161 NC(=O)C1=C(N=C[NH3+])NC(O)=N1 Intermediate Fragment 
44 126.0298027881 [NH3+]C(=O)C1=NC(=O)N=C1
45 170.0672509161 N=C(O)NC1=NC([NH3+])=NC(O)=C1 Intermediate Fragment 
46 153.0407018201 NC1=NC(O)=CC([NH+]=C=O)=N1
47 170.0672509161 NC(O)=NC1=C(O)N=C([NH3+])N=C1 Intermediate Fragment 
48 125.0457872001 NC1=NC(=O)C(=[NH2+])C=N1
49 127.0614372641 NC1=NC(=O)C([NH3+])C=N1
50 170.0672509161 NC1=NC([NH3+])=NC(O)=C1N=CO Intermediate Fragment 
51 127.0614372641 NC1=NC(O)=CC([NH3+])=N1
52 140.0566862321 NC1=NC(=O)C(=[NH2+])C(N)=N1
53 142.0723362961 NC1=NC(=O)C([NH3+])C(N)=N1
54 153.0407018201 NC1=NC(O)=C([NH+]=C=O)C=N1
55 168.0516008521 NC1=NC(O)=C([NH+]=C=O)C(N)=N1
56 170.0672509161 NC1=C(O)N=C([NH3+])N=C1N=CO Intermediate Fragment 
57 168.0516008521 NC1=NC(O)=C([NH3+])C(N=C=O)=N1
58 172.0829009801 [NH3+]C1=NC(O)C2NC(O)NC2=N1
59 154.0723362961 [NH3+]C1=NC(O)=C2NCNC2=N1
60 155.0563518841 OC1NC2=NC=NC([OH2+])=C2N1
61 172.0829009801 [NH3+]C(=NC=O)N=C1CNC(O)N1 Intermediate Fragment 
62 172.0829009801 N=C1NC(O)NC1=C(O)N=C[NH3+] Intermediate Fragment 
63 174.0985510441 [NH3+]C1=NC(O)C2NC(O)NC2N1
64 156.0879863601 [NH3+]C1=NC(O)C2NCNC2=N1
65 174.0985510441 N=C([NH3+])N=C1NC(O)NC1CO Intermediate Fragment 
66 174.0985510441 [NH3+]C(=NCO)N=C1CNC(O)N1 Intermediate Fragment 
67 174.0985510441 NC([NH3+])=NC(O)C1=CNC(O)N1 Intermediate Fragment 
68 174.0985510441 N=C1NC(O)NC1C(O)N=C[NH3+] Intermediate Fragment 
69 174.0985510441 NC(O)NC1=NC([NH3+])=NC(O)C1 Intermediate Fragment 
70 174.0985510441 NC(O)NC1C=NC([NH3+])=NC1O Intermediate Fragment 
71 174.0985510441 NC1C(NCO)=NC([NH3+])=NC1O Intermediate Fragment 
72 176.1142011081 [NH3+]C1NC(O)C2NC(O)NC2N1
73 176.1142011081 NC([NH3+])=NC(O)C1CNC(O)N1 Intermediate Fragment 
74 254.0883802841 [NH3+]C1=NC(O)=C2N=C(O)N(C3CC(O)CO3)C2=N1
75 256.1040303481 [NH3+]C1=NC(O)=C2NC(O)N(C3CC(O)CO3)C2=N1
76 258.1196804121 [NH3+]C1=NC(O)C2NC(O)N(C3CC(O)CO3)C2=N1
77 268.1040303481 CC1OC(N2C(O)=NC3=C(O)N=C([NH3+])N=C32)CC1O
78 268.1040303481 CC(O)C(O)C=CN1C(O)=NC2=C(O)N=C([NH3+])N=C21 Intermediate Fragment 
79 268.1040303481 CCC(O)C=C(O)N1C(O)=NC2=C(O)N=C([NH3+])N=C21 Intermediate Fragment 
80 268.1040303481 [NH3+]C1=NC(O)=C2N=C(O)N(C3CCC(CO)O3)C2=N1
81 268.1040303481 [NH3+]C1=NC(O)=C2N=C(O)N(C(O)=CCCCO)C2=N1 Intermediate Fragment 
82 268.1040303481 [NH3+]C1=NC(O)=C2N=CN(C3CC(O)C(CO)O3)C2=N1
83 269.0880459361 OCC1OC(N2C(O)=NC3=C([OH2+])N=CN=C32)CC1O
84 286.1145950321 N=C([NH3+])N=C1C(=C=O)NC(O)N1C1CC(O)C(CO)O1 Intermediate Fragment 
85 269.0880459361 NC=[NH+]C1=C(C=O)N=C(O)N1C1=CC(O)C(CO)O1
86 258.1196804121 NC(=[NH2+])N=C1C=NC(O)N1C1CC(O)C(CO)O1
87 286.1145950321 [NH3+]C(=NC=O)N=C1C=NC(O)N1C1CC(O)C(CO)O1 Intermediate Fragment 
88 243.1087813801 NC=[NH+]C1=CN=C(O)N1C1CC(O)C(CO)O1
89 216.0978823481 [NH2+]=C1C=NC(O)N1C1CC(O)C(CO)O1
90 129.0770873281 NC=[NH+]C1=CNC(O)N1
91 243.1087813801 NC=[NH+]C1=CN=C(O)N1C=CC(O)C(O)CO Intermediate Fragment 
92 243.1087813801 NC=[NH+]C1=CN=C(O)N1C(O)=CC(O)CCO Intermediate Fragment 
93 241.0931313161 NC=[NH+]C1=CN=C(O)N1C1=CC(O)C(CO)O1
94 239.0774812521 NC=[NH+]C1=CN=C(O)N1C1=CC(O)=C(CO)O1
95 216.0978823481 N=CC(=[NH2+])N(CO)C1=CC(O)C(CO)O1 Intermediate Fragment 
96 216.0978823481 [NH2+]=C1C=NC(O)N1C=CC(O)C(O)CO Intermediate Fragment 
97 216.0978823481 [NH2+]=C1C=NC(O)N1C(O)=CC(O)CCO Intermediate Fragment 
98 216.0978823481 C=C(OC(CO)CO)N1C(=[NH2+])C=NC1O Intermediate Fragment 
99 214.0822322841 [NH2+]=C1C=NC(O)N1C1=CC(O)C(CO)O1
100 201.0869833161 OC1=NC=CN1C1CC(O)C(C[OH2+])O1
101 85.0396392001 [OH+]=C1N=CCN1
102 199.0713332521 OC1=NC=CN1C1=CC(O)C(C[OH2+])O1
103 197.0556831881 OC1=NC=CN1C1=CC(O)=C(C[OH2+])O1
104 256.1040303481 NC(=[NH2+])N=C1C=NC(O)N1C1=CC(O)C(CO)O1
105 286.1145950321 NC([NH3+])=NC(=O)C1=CN(C2CC(O)C(CO)O2)C(O)=N1 Intermediate Fragment 
106 227.0662478721 OCC1OC(N2C=C(C=[OH+])N=C2O)=CC1O
107 113.0345538201 O=C1N=C(C=[OH+])CN1
108 286.1145950321 N=C1C(=C(O)N=C[NH3+])N=C(O)N1C1CC(O)C(CO)O1 Intermediate Fragment 
109 240.0614968401 [NH2+]=C1C(=C=O)N=C(O)N1C1=CC(O)C(CO)O1
110 242.0771469041 [NH2+]=C1C(=C=O)N=C(O)N1C1CC(O)C(CO)O1
111 244.0927969681 [NH2+]=C1C(=C=O)NC(O)N1C1CC(O)C(CO)O1
112 286.1145950321 N=C(O)N(C1=NC([NH3+])=NC(O)=C1)C1CC(O)C(CO)O1 Intermediate Fragment 
113 269.0880459361 NC1=NC(O)=CC([NH+](CO)C2=CC(O)=C(CO)O2)=N1
114 155.0563518841 NC1=NC(O)=CC([NH+]=CO)=N1
115 243.1087813801 NC1=NC(O)=CC([NH2+]C2CC(O)C(CO)O2)=N1
116 241.0931313161 NC1=NC(O)=CC([NH+]=C2CC(O)C(CO)O2)=N1
117 241.0931313161 NC1=NC(O)=CC([NH+]=C=CC(O)C(O)CO)=N1 Intermediate Fragment 
118 241.0931313161 NC1=NC(O)=CC([NH+]=C(O)C=C(O)CCO)=N1 Intermediate Fragment 
119 112.0505382321 [NH3+]C1=NC(O)=CC=N1
120 284.0989449681 NC1=NC(O)=CC(N(C(=[NH2+])O)C2=CC(O)C(CO)O2)=N1
121 286.1145950321 [NH3+]C1=NC(O)=C(N=C(O)NC2CC(O)C(CO)O2)C=N1 Intermediate Fragment 
122 162.0760842841 OC=[NH+]C1CC(O)C(CO)O1
123 155.0563518841 NC1=NC(O)=C([NH+]=CO)C=N1
124 286.1145950321 [NH3+]C1=NC(O)=C(N=CO)C(NC2CC(O)C(CO)O2)=N1 Intermediate Fragment 
125 239.0774812521 NC1=NC(O)=CC([NH+]=C2C=C(O)C(CO)O2)=N1
126 256.1040303481 NC1=NC(O)=C([NH3+])C(N=C2CC(O)C(CO)O2)=N1
127 258.1196804121 NC1=NC(O)=C([NH3+])C(NC2CC(O)C(CO)O2)=N1
128 161.1033020761 NC1=NC(O)C([NH2+]CO)CN1
129 159.0876520121 NC1=NC(O)C([NH2+]CO)C=N1
130 157.0720019481 NC1=NC(O)=C([NH2+]CO)C=N1
131 139.0614372641 NC1=NC=C([NH+]=CO)C=N1
132 284.0989449681 NC1=NC(O)=C([NH+]=CO)C(N=C2CC(O)C(CO)O2)=N1
133 286.1145950321 NC1=C(O)N=C([NH3+])N=C1N(CO)C1=CC(O)C(CO)O1 Intermediate Fragment 
134 284.0989449681 NC1=NC(O)=C([NH3+])C(N(CO)C2=CC(O)=C(CO)O2)=N1
135 286.1145950321 CC(O)C(CO)OCN1C(O)=NC2=C(O)N=C([NH3+])N=C21 Intermediate Fragment 
136 200.0778156001 [NH3+]C1=NC(O)=C2NC(O)N(CO)C2=N1
137 198.0621655361 [NH3+]C1=NC(O)=C2N=C(O)N(CO)C2=N1
138 87.0440558841 C=C(O)C=C[OH2+]
139 89.0597059481 C=C(O)CC[OH2+]
140 71.0491412641 C=CC(=C)[OH2+]
141 71.0491412641 C#CCC[OH2+]
142 91.0753560121 CC(O)CC[OH2+]
143 188.1142011081 CN1C(O)NC2C(O)N=C([NH3+])NC21
144 184.0829009801 CN1C2=NC([NH3+])=NC(O)=C2NC1O
145 182.0672509161 CN1C(O)=NC2=C(O)N=C([NH3+])N=C21
146 182.0672509161 CN1C(O)=NC(=C=O)C1=NC(=N)[NH3+] Intermediate Fragment 
147 182.0672509161 CN1C(=O)N=CC1=NC([NH3+])=NC=O Intermediate Fragment 
148 139.0614372641 CN1C(=O)N=CC1=[NH+]C=N
149 182.0672509161 CN(C#[O+])C1=NC(N)=NC(O)=C1N Intermediate Fragment 
150 180.0516008521 [CH2+]N1C(O)=NC2=C(O)N=C(N)N=C21
151 180.0516008521 CN1C(=O)N=CC1=NC(N)=NC#[O+] Intermediate Fragment 
152 286.1145950321 [NH3+]C1=NC(O)=C2N=C(O)N(CCC(O)C(O)CO)C2=N1 Intermediate Fragment 
153 105.0546205681 C=C(O)C([OH2+])CO
154 186.0985510441 CN1C2=NC([NH3+])=NC(O)C2NC1O
155 93.0546205681 OCC([OH2+])CO
156 75.0440558841 CC([OH2+])=CO
157 61.0284058201 OCC=[OH+]
158 59.0127557561 OC#C[OH2+]
159 73.0284058201 CC([OH2+])=C=O
160 89.0233204401 O=CC([OH2+])=CO
161 71.0127557561 OC#CC=[OH+]
162 71.0127557561 [CH2+]C(O)=C=O
163 87.0076703761 O=C=C([OH2+])C=O
164 194.0672509161 C=CN1C(O)=NC2=C(O)N=C([NH3+])N=C21
165 194.0672509161 C=CN1C(O)=NC(=C=O)C1=NC(=N)[NH3+] Intermediate Fragment 
166 194.0672509161 C#CN1C(=NC([NH3+])=NC=O)C=NC1O Intermediate Fragment 
167 126.0661882961 C=CN1C(=[NH2+])C=NC1O
168 194.0672509161 C#CN(C(=N)O)C1=NC([NH3+])=NC(O)=C1 Intermediate Fragment 
169 151.0614372641 C=C=[NH+]C1=NC(N)=NC(O)=C1
170 194.0672509161 C=C=NC1=NC([NH3+])=NC(O)=C1N=CO Intermediate Fragment 
171 166.0723362961 CC=NC1=NC(N)=NC(=O)C1=[NH2+]
172 194.0672509161 C#CN(C=O)C1=NC([NH3+])=NC(O)=C1N Intermediate Fragment 
173 196.0829009801 CCN1C(O)=NC2=C(O)N=C([NH3+])N=C21
174 196.0829009801 C=CN1C(=NC([NH3+])=NC=O)C=NC1O Intermediate Fragment 
175 196.0829009801 CC=NC(O)=NC1=C(O)N=C([NH3+])N=C1 Intermediate Fragment 
176 196.0829009801 CC=NC1=NC([NH3+])=NC(O)=C1N=CO Intermediate Fragment 
177 198.0985510441 CCN1C2=NC([NH3+])=NC(O)=C2NC1O
178 200.1142011081 CCN1C2=NC([NH3+])=NC(O)C2NC1O
179 202.1298511721 CCN1C(O)NC2C(O)N=C([NH3+])NC21
180 63.0440558841 OCC[OH2+]
181 224.0778156001 [NH3+]C1=NC(O)=C2N=C(O)N(C=CCO)C2=N1
182 224.0778156001 [NH3+]C(=NC=O)N=C1C=NC(O)N1C#CCO Intermediate Fragment 
183 224.0778156001 [NH3+]C1=NC(O)=C(N=CO)C(N=C=CCO)=N1 Intermediate Fragment 
184 226.0934656641 [NH3+]C1=NC(O)=C2N=C(O)N(CCCO)C2=N1
185 208.0829009801 CC=CN1C(O)=NC2=C(O)N=C([NH3+])N=C21
186 226.0934656641 [NH3+]C(=NC=O)N=C1C=NC(O)N1C=CCO Intermediate Fragment 
187 183.0876520121 NC=[NH+]C1=CN=C(O)N1C=CCO
188 181.0720019481 NC=[NH+]C1=CN=C(O)N1C#CCO
189 156.0767529801 [NH2+]=C1C=NC(O)N1C=CCO
190 226.0934656641 N=C(O)N(C=CCO)C1=NC([NH3+])=NC(O)=C1 Intermediate Fragment 
191 226.0934656641 [NH3+]C1=NC(O)=C(N=C(O)N=CCCO)C=N1 Intermediate Fragment 
192 226.0934656641 [NH3+]C1=NC(O)=C(N=CO)C(N=CCCO)=N1 Intermediate Fragment 
193 196.0829009801 NC1=NC(O)=C([NH3+])C(N=C=CCO)=N1
194 198.0985510441 NC1=NC(O)=C([NH3+])C(N=CCCO)=N1
195 226.0934656641 NC1=C(O)N=C([NH3+])N=C1N(C#CCO)CO Intermediate Fragment 
196 228.1091157281 [NH3+]C1=NC(O)=C2NC(O)N(CCCO)C2=N1
197 210.0985510441 CCCN1C(O)=NC2=C(O)N=C([NH3+])N=C21
198 228.1091157281 [NH3+]C1=NC(O)=C(N=CO)C(NCCCO)=N1 Intermediate Fragment 
199 230.1247657921 [NH3+]C1=NC(O)C2NC(O)N(CCCO)C2=N1
200 268.1040303481 [NH3+]C1=NC(O)=C2N=C(O)N(C=CC(O)CCO)C2=N1
201 103.0753560121 C=CC(O)CC[OH2+]
202 178.0359507881 [CH2+]N1C(=O)N=C2C(=O)N=C(N)N=C21
203 77.0597059481 OCCC[OH2+]
204 192.0516008521 C#CN1C(O)=NC2=C(O)N=C([NH3+])N=C21
205 222.0621655361 [NH3+]C1=NC(O)=C2N=C(O)N(C#CCO)C2=N1
206 236.0778156001 CC(O)C#CN1C(O)=NC2=C(O)N=C([NH3+])N=C21
207 238.0934656641 CC(O)C=CN1C(O)=NC2=C(O)N=C([NH3+])N=C21
208 240.1091157281 CC(O)CCN1C(O)=NC2=C(O)N=C([NH3+])N=C21
209 250.0934656641 CCC(O)C#CN1C(O)=NC2=C(O)N=C([NH3+])N=C21
210 250.0934656641 [NH3+]C1=NC(O)=C2N=C(O)N(C#CCCCO)C2=N1
211 268.1040303481 N=C([NH3+])N=C1C(=C=O)N=C(O)N1C=CC(O)CCO Intermediate Fragment 
212 268.1040303481 [NH3+]C(=NC=O)N=C1C=NC(O)N1C#CC(O)CCO Intermediate Fragment 
213 225.0982166961 NC=[NH+]C1=CN=C(O)N1C#CC(O)CCO
214 200.1029677281 [NH2+]=C1C=NC(O)N1C=CC(O)CCO
215 268.1040303481 N=C(O)N(C#CC(O)CCO)C1=NC([NH3+])=NC(O)=C1 Intermediate Fragment 
216 268.1040303481 [NH3+]C1=NC(O)=C(N=CO)C(N=C=CC(O)CCO)=N1 Intermediate Fragment 
217 240.1091157281 NC1=NC(O)=C([NH3+])C(N=C=CC(O)CCO)=N1
218 284.0989449681 [NH3+]C1=NC(O)=C2N=C(O)N(C=CC(O)C(O)CO)C2=N1
219 266.0883802841 [NH3+]C1=NC(O)=C2N=C(O)N(C#CC(O)CCO)C2=N1
220 286.1145950321 [NH3+]C1=NC(O)=C2N=C(O)N(C(O)CC(O)CCO)C2=N1 Intermediate Fragment 
221 196.0465154721 [NH3+]C1=NC(O)=C2N=C(O)N(C=O)C2=N1
222 196.0465154721 N=C(O)N(C#[O+])C1=NC(N)=NC(O)=C1 Intermediate Fragment 
223 202.0934656641 [NH3+]C1=NC(O)C2NC(O)N(CO)C2=N1
224 59.0491412641 CC=C[OH2+]
225 57.0334912001 CC#C[OH2+]
226 43.0178411361 C#C[OH2+]
227 55.0178411361 [CH2+]C#CO
228 210.0621655361 C=C(O)N1C(O)=NC2=C(O)N=C([NH3+])N=C21
229 212.0778156001 CC(O)N1C(O)=NC2=C(O)N=C([NH3+])N=C21
230 212.0778156001 C=C(O)N(C(=N)O)C1=NC([NH3+])=NC(O)=C1 Intermediate Fragment 
231 212.0778156001 CC(O)=NC1=NC([NH3+])=NC(O)=C1N=CO Intermediate Fragment 
232 214.0934656641 CC(O)N1C2=NC([NH3+])=NC(O)=C2NC1O
233 216.1091157281 CC(O)N1C2=NC([NH3+])=NC(O)C2NC1O
234 218.1247657921 CC(O)N1C(O)NC2C(O)N=C([NH3+])NC21
235 47.0491412641 CC[OH2+]
236 240.0727302201 [NH3+]C1=NC(O)=C2N=C(O)N(C(O)=CCO)C2=N1
237 242.0883802841 [NH3+]C1=NC(O)=C2N=C(O)N(C(O)CCO)C2=N1
238 244.1040303481 [NH3+]C1=NC(O)=C2NC(O)N(C(O)CCO)C2=N1
239 284.0989449681 [NH3+]C1=NC(O)=C2N=C(O)N(C(O)=CC(O)CCO)C2=N1
240 286.1145950321 [NH3+]C1=NC(O)=C2N=C(O)N(C(CCO)OCCO)C2=N1 Intermediate Fragment 
241 286.1145950321 CC(OC(CO)CO)N1C(O)=NC2=C(O)N=C([NH3+])N=C21 Intermediate Fragment 
