#In-silico ESI-MS/MS [M+H]+ Spectra
#PREDICTED BY CFM-ID 4.0.8
#SMILES=N1C(=NC2C(C1=O)N(C(N2[C@H]1C[C@H]([C@H](O1)CO)O)O)O)NC
#InChiKey=WYSPLIPUMFXDBJ-IZHVCYDJSA-N
energy0
202.09347 10.29 36 75 54 71 69 48 42 64 61 60 (8.147 0.024437 0.018457 0.012123 0.010692 0.0087621 0.0021487 0.0012637 0.00090714 4.0759e-05)
318.14081 100.00 0 182 135 176 257 293 186 294 204 119 122 173 102 128 130 (78.834 0.45729 0.22595 0.080969 0.078391 0.06411 0.04732 0.044185 0.04217 0.03551 0.01101 0.010117 0.0064584 0.0025022 0.0018428)
energy1
99.04406 10.23 13 29 14 (2.1711 0.67166 0.64275)
117.05462 6.35 9 26 18 24 15 30 (1.21 0.30399 0.21927 0.20086 0.13218 0.097581)
184.08290 100.00 38 37 (20.932 13.145)
202.09347 78.29 36 75 64 71 48 54 60 69 61 42 (24.888 0.36884 0.3293 0.31774 0.28644 0.27204 0.088819 0.072871 0.031492 0.022737)
255.10878 6.40 146 (2.1812)
300.13025 9.37 87 92 97 95 245 91 98 89 1 93 251 94 88 90 254 96 256 (1.2878 0.80055 0.74619 0.079707 0.056651 0.054128 0.053854 0.027395 0.025584 0.019263 0.010204 0.0095288 0.0064775 0.0063708 0.005707 0.0025943 0.002285)
318.14081 30.46 0 176 182 257 122 135 173 294 293 204 128 119 102 186 130 (8.883 0.56435 0.27787 0.20889 0.10561 0.077692 0.052885 0.051069 0.04145 0.035504 0.027544 0.025546 0.015673 0.011322 0.0018497)
energy2
45.03349 26.43 17 (1.2833)
55.01784 21.21 260 (1.0297)
57.03349 76.80 25 (3.7289)
59.04914 75.99 259 (3.6895)
61.02841 59.33 207 (2.8803)
71.04914 64.21 191 192 (1.9945 1.1228)
73.02841 51.86 212 21 (2.2949 0.22281)
73.06479 19.58 194 (0.95053)
75.04406 45.59 208 22 (1.9731 0.2405)
103.05020 23.86 56 (1.1585)
117.05462 38.58 18 26 9 15 24 30 (0.59527 0.54423 0.26944 0.20787 0.16957 0.086938)
124.05054 50.80 68 156 162 153 (1.2801 0.73455 0.24343 0.2082)
126.06619 20.39 67 151 (0.90613 0.08393)
141.07709 88.82 66 175 (2.9851 1.3272)
171.08765 38.44 137 (1.8665)
172.08290 44.44 35 (2.1574)
184.08290 41.62 37 38 (1.4476 0.57313)
186.09855 34.75 80 79 (0.8473 0.83964)
197.10330 41.29 227 (2.0047)
202.09347 100.00 71 36 54 42 75 48 64 61 69 60 (1.8101 1.2456 0.81417 0.24372 0.1743 0.1719 0.16347 0.097391 0.068298 0.066116)
212.07782 24.36 201 202 203 (0.43746 0.38919 0.35602)
213.09822 19.25 145 270 (0.91086 0.023521)
214.09347 19.24 200 199 198 (0.36956 0.31637 0.24831)
228.07273 31.76 190 (1.5418)
228.10912 49.53 216 231 281 (1.9511 0.2771 0.17654)
230.08838 25.42 189 188 (1.1212 0.1128)
232.10403 65.61 187 (3.1854)
244.10403 20.84 269 263 277 266 279 267 268 276 (0.54513 0.12909 0.091437 0.084635 0.064626 0.034133 0.032036 0.030927)
256.10403 26.14 226 230 221 224 225 232 (0.44443 0.33136 0.3165 0.098997 0.067259 0.010668)
258.11968 20.03 237 233 235 236 291 239 (0.52905 0.15209 0.13608 0.085808 0.056487 0.012907)

0 318.1408097801 C[NH2+]C1=NC2C(C(=O)N1)N(O)C(O)N2C1CC(O)C(CO)O1
1 300.1302450961 C[NH2+]C1=NC=C2C(=N1)N(C1CC(O)C(CO)O1)C(O)N2O
2 119.0702706321 OC1CCOC1C[OH2+]
3 101.0597059481 CC1OC=CC1[OH2+]
4 101.0597059481 [OH2+]CC1CC=CO1
5 119.0702706321 C=COC(CO)C[OH2+] Intermediate Fragment 
6 119.0702706321 OC=CC(O)CC[OH2+] Intermediate Fragment 
7 119.0702706321 C=CC(O)C(O)C[OH2+] Intermediate Fragment 
8 101.0597059481 C#CC(O)CC[OH2+]
9 117.0546205681 OC1C=COC1C[OH2+]
10 85.0284058201 [OH2+]C1=COC=C1
11 87.0440558841 [OH2+]C1C=COC1
12 89.0597059481 [OH2+]C1CCOC1
13 99.0440558841 CC1=C([OH2+])C=CO1
14 99.0440558841 [OH2+]CC1=CC=CO1
15 117.0546205681 C=C(O)C(=C[OH2+])OC Intermediate Fragment 
16 43.0178411361 C#C[OH2+]
17 45.0334912001 C=C[OH2+]
18 117.0546205681 C=COC(=CO)C[OH2+] Intermediate Fragment 
19 89.0597059481 C=C[OH+]CCO
20 47.0491412641 CC[OH2+]
21 73.0284058201 OC#CC[OH2+]
22 75.0440558841 OC=CC[OH2+]
23 91.0389705041 OC=C([OH2+])CO
24 117.0546205681 OC=C=COCC[OH2+] Intermediate Fragment 
25 57.0334912001 C#CC[OH2+]
26 117.0546205681 OC=C=C(O)CC[OH2+] Intermediate Fragment 
27 89.0597059481 C=C(O)CC[OH2+]
28 87.0440558841 C=C(O)C=C[OH2+]
29 99.0440558841 C#CC(O)=CC[OH2+]
30 117.0546205681 C=C=C(O)C(O)C[OH2+] Intermediate Fragment 
31 115.0389705041 OC1=C(C[OH2+])OC=C1
32 200.0778156001 C[NH2+]C1=NC(O)=C2C(=N1)NC(O)N2O
33 200.0778156001 C[NH2+]C1=NC(O)=C(N(O)C=O)C(N)=N1 Intermediate Fragment 
34 139.0614372641 C=NC1=NC(O)=CC([NH3+])=N1
35 172.0829009801 CNC1=NC(O)=C([NH2+]O)C(N)=N1
36 202.0934656641 C[NH2+]C1=NC(O)C2C(=N1)NC(O)N2O
37 184.0829009801 C[NH2+]C1=NC(O)=C2C(=N1)NCN2O
38 184.0829009801 C[NH2+]C1=NC(O)=C2NC(O)NC2=N1
39 171.0512665041 OC1NC2=NC=NC([OH2+])=C2N1O
40 173.0669165681 OC1NC2=NC=NC([OH2+])C2N1O
41 186.0621655361 [NH3+]C1=NC(O)=C2C(=N1)NC(O)N2O
42 202.0934656641 C[NH2+]C(=N)N=C1NC(O)N(O)C1=CO Intermediate Fragment 
43 185.0669165681 CNC=[NH+]C1=C(C=O)N(O)C(O)=N1
44 146.0560175361 [NH2+]=C1NC(O)N(O)C1=CO
45 144.0403674721 [NH2+]=C1NC(O)N(O)C1=C=O
46 72.0556236121 C=NC(N)=[NH2+]
47 74.0712736761 CNC(N)=[NH2+]
48 202.0934656641 C[NH2+]C(N=C1CN(O)C(O)N1)=NC=O Intermediate Fragment 
49 118.0611029161 [NH2+]=C1CN(O)C(O)N1
50 116.0454528521 [NH2+]=C1CN(O)C(O)=N1
51 100.0505382321 C=NC(N)=[NH+]C=O
52 102.0661882961 CNC(N)=[NH+]C=O
53 174.0985510441 CNC(=[NH2+])N=C1CN(O)C(O)N1
54 202.0934656641 C[NH2+]C(N)=NC(=O)C1=CNC(O)N1O Intermediate Fragment 
55 101.0345538201 ON1C=CN=C1[OH2+]
56 103.0502038841 ON1C=CNC1[OH2+]
57 105.0658539481 ON1CCNC1[OH2+]
58 129.0294684401 OC1=NC=C(C=[OH+])N1O
59 131.0451185041 OC1NC=C(C=[OH+])N1O
60 202.0934656641 C[NH2+]C=NC(O)=C1C(=N)NC(O)N1O Intermediate Fragment 
61 202.0934656641 C[NH2+]C=NC1=C(C(N)=O)N(O)C(O)N1 Intermediate Fragment 
62 161.0669165681 N=C1NC(O)N(O)C1=C([NH3+])O
63 144.0403674721 [NH3+]C(=O)C1=CN=C(O)N1O
64 202.0934656641 C[NH2+]C1=NC(O)=CC(NC(O)NO)=N1 Intermediate Fragment 
65 169.0720019481 CNC1=NC(O)=CC([NH+]=CO)=N1
66 141.0770873281 CNC1=NC(O)=CC([NH3+])=N1
67 126.0661882961 C[NH2+]C1=NC(O)=CC=N1
68 124.0505382321 C=[NH+]C1=NC(O)=CC=N1
69 202.0934656641 C[NH2+]C1=NC(O)=C(N(O)C(N)O)C=N1 Intermediate Fragment 
70 185.0669165681 CNC1=NC(O)=C([NH+](O)C=O)C=N1
71 202.0934656641 C[NH2+]C1=NC(O)=C(N(O)CO)C(N)=N1 Intermediate Fragment 
72 64.0393048521 OC[NH2+]O
73 62.0236547881 OC=[NH+]O
74 174.0985510441 CNC1=NC(O)C([NH2+]O)C(N)=N1
75 202.0934656641 C[NH2+]C1=NC(O)=C(NO)C(NCO)=N1 Intermediate Fragment 
76 157.0720019481 CNC1=NC(O)=C([NH2+]O)C=N1
77 155.0563518841 CNC1=NC(O)=C([NH+]=O)C=N1
78 204.1091157281 C[NH2+]C1=NC(O)C2C(N1)NC(O)N2O
79 186.0985510441 C[NH2+]C1=NC(O)C2C(=N1)NCN2O
80 186.0985510441 C[NH2+]C1=NC(O)C2NC(O)NC2=N1
81 204.1091157281 C[NH2+]C(N)=NC(O)C1=CNC(O)N1O Intermediate Fragment 
82 206.1247657921 C[NH2+]C1NC(O)C2C(N1)NC(O)N2O
83 188.1142011081 C[NH2+]C1=NC(O)C2C(NCN2O)N1
84 286.1145950321 C[NH2+]C1=NC(O)=C2C(=N1)N(C1CC(O)CO1)C(O)N2O
85 288.1302450961 C[NH2+]C1=NC(O)C2C(=N1)N(C1CC(O)CO1)C(O)N2O
86 290.1458951601 C[NH2+]C1=NC(O)C2C(N1)N(C1CC(O)CO1)C(O)N2O
87 300.1302450961 C[NH2+]C1=NC(O)=C2C(=N1)N(C1CC(O)C(C)O1)C(O)N2O
88 300.1302450961 C[NH2+]C(=N)N=C1C(=C=O)N(O)C(O)N1C1CC(O)C(C)O1 Intermediate Fragment 
89 300.1302450961 C[NH2+]C1=NC(O)=CC(N(C(O)=NO)C2CC(O)C(C)O2)=N1 Intermediate Fragment 
90 300.1302450961 C[NH2+]C1=NC(O)=C2C(=N1)N(C=CC(O)C(C)O)C(O)N2O Intermediate Fragment 
91 300.1302450961 CCC(O)C=C(O)N1C2=NC([NH2+]C)=NC(O)=C2N(O)C1O Intermediate Fragment 
92 300.1302450961 C[NH2+]C1=NC(O)=C2C(=N1)N(C1CCC(CO)O1)C(O)N2O
93 300.1302450961 C[NH2+]C1=NC(O)=CC(N(C(O)=NO)C2CCC(CO)O2)=N1 Intermediate Fragment 
94 300.1302450961 C[NH2+]C1=NC(O)=C2C(=N1)N(C(O)=CCCCO)C(O)N2O Intermediate Fragment 
95 300.1302450961 C[NH2+]C1=NC(O)=C2C(=N1)N(C1CC(O)C(CO)O1)CN2O
96 300.1302450961 C[NH2+]C1=NC(O)=C2C(=N1)N(C(O)=CC(O)CCO)CN2O Intermediate Fragment 
97 300.1302450961 C[NH2+]C1=NC(O)=C2NC(O)N(C3CC(O)C(CO)O3)C2=N1
98 300.1302450961 C[NH2+]C1=NC(O)=C2N=C(O)N(C(O)CC(O)CCO)C2=N1 Intermediate Fragment 
99 287.0986106201 OCC1OC(N2C3=NC=NC([OH2+])=C3N(O)C2O)CC1O
100 287.0986106201 OCCC(O)C=C(O)N1C2=NC=NC([OH2+])=C2N(O)C1O Intermediate Fragment 
101 289.1142606841 OCC1OC(N2C3=NC=NC([OH2+])C3N(O)C2O)CC1O
102 318.1408097801 C[NH2+]C(=N)N=C1C(=CO)N(O)C(O)N1C1CC(O)C(CO)O1 Intermediate Fragment 
103 301.1142606841 CNC=[NH+]C1=C(C=O)N(O)C(O)N1C1=CC(O)C(CO)O1
104 262.1033616521 [NH2+]=C1C(=CO)N(O)C(O)N1C1CC(O)C(CO)O1
105 244.0927969681 [NH2+]=C1C(=C=O)NC(O)N1C1CC(O)C(CO)O1
106 262.1033616521 [NH+]#CN(C1CC(O)C(CO)O1)C(O)N(O)C=CO Intermediate Fragment 
107 262.1033616521 [NH2+]=C(C#CO)N(C(O)NO)C1CC(O)C(CO)O1 Intermediate Fragment 
108 262.1033616521 [NH2+]=C1C(=C=O)N(O)C(O)N1CCC(O)C(O)CO Intermediate Fragment 
109 249.1081126841 OCC1OC(N2C=C(C[OH2+])N(O)C2O)CC1O
110 247.0924626201 OCC1OC(N2C=C(C=[OH+])N(O)C2O)CC1O
111 247.0924626201 OCC(O)C(O)C=CN1C=C(C=[OH+])N(O)C1O Intermediate Fragment 
112 247.0924626201 OCCC(O)C=C(O)N1C=C(C=[OH+])N(O)C1O Intermediate Fragment 
113 245.0768125561 OCC1OC(N2C=C(C=[OH+])N(O)C2O)=CC1O
114 243.0611624921 OCC1=C(O)C=C(N2C=C(C=[OH+])N(O)C2O)O1
115 57.0447245801 CNC#[NH+]
116 286.1145950321 CNC(=[NH2+])N=C1CN(O)C(O)N1C1=CC(O)=C(CO)O1
117 288.1302450961 CNC(=[NH2+])N=C1CN(O)C(O)N1C1=CC(O)C(CO)O1
118 290.1458951601 CNC(=[NH2+])N=C1CN(O)C(O)N1C1CC(O)C(CO)O1
119 318.1408097801 C[NH2+]C(=NC=O)N=C1CN(O)C(O)N1C1CC(O)C(CO)O1 Intermediate Fragment 
120 234.1084470321 [NH2+]=C1CN(O)C(O)N1C1CC(O)C(CO)O1
121 234.1084470321 [NH2+]=C1CN(O)C(O)N1C=CC(O)C(O)CO Intermediate Fragment 
122 318.1408097801 C[NH2+]C(N)=NC(=O)C1=CN(C2CC(O)C(CO)O2)C(O)N1O Intermediate Fragment 
123 215.0662478721 OC1=C(C[OH2+])OC(N2C=CN(O)C2O)=C1
124 217.0818979361 OC1C=C(N2C=CN(O)C2O)OC1C[OH2+]
125 219.0975480001 OC1CC(N2C=CN(O)C2O)OC1C[OH2+]
126 219.0975480001 OC(C=CN1C=CN(O)C1O)C(O)C[OH2+] Intermediate Fragment 
127 219.0975480001 OC(=CC(O)CC[OH2+])N1C=CN(O)C1O Intermediate Fragment 
128 318.1408097801 C[NH2+]C=NC(O)=C1C(=N)N(C2CC(O)C(CO)O2)C(O)N1O Intermediate Fragment 
129 260.0877115881 [NH2+]=C1C(=C=O)N(O)C(O)N1C1CC(O)C(CO)O1
130 318.1408097801 C[NH2+]C=NC1=C(C(N)=O)N(O)C(O)N1C1CC(O)C(CO)O1 Intermediate Fragment 
131 277.1142606841 N=C1C(=C([NH3+])O)N(O)C(O)N1C1CC(O)C(CO)O1
132 273.1193460641 CNC=[NH+]C1=CN(O)C(O)N1C1=CC(O)C(CO)O1
133 275.1349961281 CNC=[NH+]C1=CN(O)C(O)N1C1CC(O)C(CO)O1
134 159.0876520121 CNC=[NH+]C1=CN(O)C(O)N1
135 318.1408097801 C[NH2+]C1=NC(O)=CC(N(C(O)NO)C2CC(O)C(CO)O2)=N1 Intermediate Fragment 
136 287.1349961281 CNC1=NC(O)=CC([NH+](CO)C2CC(O)C(CO)O2)=N1
137 171.0876520121 CNC1=NC(O)=CC([NH2+]CO)=N1
138 285.1193460641 CNC1=NC(O)=CC([NH+](CO)C2=CC(O)C(CO)O2)=N1
139 259.1400815081 CNC1=NC(O)CC([NH2+]C2CC(O)C(CO)O2)=N1
140 257.1244314441 CNC1=NC(O)=CC([NH2+]C2CC(O)C(CO)O2)=N1
141 257.1244314441 CNC(N)=NC(O)=C=C[NH+]=C1CC(O)C(CO)O1 Intermediate Fragment 
142 257.1244314441 CNC1=NC(O)=CC([NH+]=CCC(O)C(O)CO)=N1 Intermediate Fragment 
143 257.1244314441 CNC1=NC(O)=CC([NH+]=C(O)CC(O)CCO)=N1 Intermediate Fragment 
144 257.1244314441 CNC1=NC(O)=CC([NH+]=C(CCO)OCCO)=N1 Intermediate Fragment 
145 213.0982166961 CNC1=NC(O)=CC([NH+]=C(O)CCO)=N1
146 255.1087813801 CNC1=NC(O)=CC([NH+]=C2CC(O)C(CO)O2)=N1
147 128.0818383601 C[NH2+]C1=NC(O)CC=N1
148 110.0712736761 C[NH2+]C1=NC=CC=N1
149 128.0818383601 C=NC(=NC(=C)O)[NH2+]C Intermediate Fragment 
150 86.0712736761 C=NC(=[NH2+])NC
151 126.0661882961 C=C=NC(=NC=O)[NH2+]C Intermediate Fragment 
152 98.0712736761 C=C=NC(=[NH2+])NC
153 124.0505382321 C[NH2+]C(=N)N=C=C=C=O Intermediate Fragment 
154 70.0287401681 [NH+]#CC=CO
155 96.0556236121 C=C=NC(=[NH2+])N=C
156 124.0505382321 C=C=NC(=NC=O)[NH+]=C Intermediate Fragment 
157 81.0447245801 C#C[NH+]=C=NC
158 44.0130901041 [NH2+]=C=O
159 46.0287401681 [NH3+]C=O
160 42.0338255481 CC#[NH+]
161 96.0192381041 C#[N+]C(=N)N=C=O
162 124.0505382321 C[NH+]=C=NC(O)=C=C=N Intermediate Fragment 
163 68.0130901041 [NH+]#CC=C=O
164 191.0662478721 OCC1OC(=NC(O)=[NH+]O)CC1O
165 193.0818979361 OCC1OC(NC(O)=[NH+]O)CC1O
166 134.0811696641 [NH3+]C1CC(O)C(CO)O1
167 132.0655196001 [NH2+]=C1CC(O)C(CO)O1
168 77.0345538201 NC(O)=[NH+]O
169 193.0818979361 OCCOC(CCO)=NC(O)=[NH+]O Intermediate Fragment 
170 149.0556831881 OCCC(O)=NC(O)=[NH+]O
171 193.0818979361 OCC(O)C(O)CC=NC(O)=[NH+]O Intermediate Fragment 
172 195.0975480001 OCC1OC(NC(O)[NH2+]O)CC1O
173 318.1408097801 C[NH2+]C1=NC(O)=C(N(O)C(O)NC2CC(O)C(CO)O2)C=N1 Intermediate Fragment 
174 159.0876520121 CNC1=NC(O)C([NH2+]O)C=N1
175 141.0770873281 CNC1=NC=C([NH2+]O)C=N1
176 318.1408097801 C[NH2+]C1=NC(O)=C(N(O)CO)C(NC2CC(O)C(CO)O2)=N1 Intermediate Fragment 
177 288.1302450961 CNC1=NC(O)=C([NH2+]O)C(NC2CC(O)C(CO)O2)=N1
178 288.1302450961 CNC(N=C(C=[NH+]O)NC1CC(O)C(CO)O1)=NC=O Intermediate Fragment 
179 290.1458951601 CNC1=NC(O)C([NH2+]O)C(NC2CC(O)C(CO)O2)=N1
180 290.1458951601 CNC(N=C(C[NH2+]O)NC1CC(O)C(CO)O1)=NC=O Intermediate Fragment 
181 189.0982166961 CNC1=NC(O)C([NH+](O)CO)C=N1
182 318.1408097801 C[NH2+]C1=NC(O)=C(NO)C(N(CO)C2CC(O)C(CO)O2)=N1 Intermediate Fragment 
183 163.1189521401 CNC1NCC([NH2+]O)C(O)N1
184 161.1033020761 CNC1=NC(O)C([NH2+]O)CN1
185 162.0760842841 OC=[NH+]C1CC(O)C(CO)O1
186 318.1408097801 C[NH2+]C1=NC(O)=C2C(=N1)N(COC(CO)C(C)O)C(O)N2O Intermediate Fragment 
187 232.1040303481 C[NH2+]C1=NC(O)C2C(=N1)N(CO)C(O)N2O
188 230.0883802841 C[NH2+]C1=NC(O)=C2C(=N1)N(CO)C(O)N2O
189 230.0883802841 C[NH2+]C1=NC(O)=C(NO)C(N(C=O)CO)=N1 Intermediate Fragment 
190 228.0727302201 C[NH2+]C1=NC(O)=C2C(=N1)N(CO)C(=O)N2O
191 71.0491412641 C=CC(=C)[OH2+]
192 71.0491412641 C#CCC[OH2+]
193 91.0753560121 CC(O)CC[OH2+]
194 73.0647913281 C=C([OH2+])CC
195 220.1404158561 C[NH2+]C1NC(O)C2C(N1)N(C)C(O)N2O
196 218.1247657921 C[NH2+]C1=NC(O)C2C(N1)N(C)C(O)N2O
197 216.1091157281 C[NH2+]C1=NC(O)C2C(=N1)N(C)C(O)N2O
198 214.0934656641 C[NH2+]C1=NC(O)=C2C(=N1)N(C)C(O)N2O
199 214.0934656641 C[NH2+]C1=NC(O)=CC(N(C)C(O)=NO)=N1 Intermediate Fragment 
200 214.0934656641 C=NC1=NC([NH2+]C)=NC(O)=C1N(O)CO Intermediate Fragment 
201 212.0778156001 C[NH2+]C1=NC(O)=C2C(=N1)N(C)C(=O)N2O
202 212.0778156001 C=[NH+]C1=NC(O)=CC(N(C)C(O)=NO)=N1 Intermediate Fragment 
203 212.0778156001 C=NC1=NC([NH2+]C)=NC(O)=C1N(O)C=O Intermediate Fragment 
204 318.1408097801 C[NH2+]C1=NC(O)=C2C(=N1)N(CCC(O)C(O)CO)C(O)N2O Intermediate Fragment 
205 107.0702706321 CC(O)C([OH2+])CO
206 93.0546205681 OCC([OH2+])CO
207 61.0284058201 OCC=[OH+]
208 75.0440558841 CC([OH2+])=CO
209 63.0440558841 OCC[OH2+]
210 31.0178411361 C=[OH+]
211 59.0127557561 OC#C[OH2+]
212 73.0284058201 CC([OH2+])=C=O
213 89.0233204401 O=CC([OH2+])=CO
214 226.0934656641 C=CN1C2=NC([NH2+]C)=NC(O)=C2N(O)C1O
215 226.0934656641 C=CN(C(O)=NO)C1=NC([NH2+]C)=NC(O)=C1 Intermediate Fragment 
216 228.1091157281 CCN1C2=NC([NH2+]C)=NC(O)=C2N(O)C1O
217 230.1247657921 CCN1C2=NC([NH2+]C)=NC(O)C2N(O)C1O
218 212.1142011081 CCN1C2=NC([NH2+]C)=NC(O)=C2NC1O
219 232.1404158561 CCN1C2NC([NH2+]C)=NC(O)C2N(O)C1O
220 234.1560659201 CCN1C2NC([NH2+]C)NC(O)C2N(O)C1O
221 256.1040303481 C[NH2+]C1=NC(O)=C2C(=N1)N(C=CCO)C(O)N2O
222 210.0621655361 C=[NH+]C1=NC(O)=C2C(=N1)N(C)C(=O)N2O
223 238.0934656641 CC#CN1C2=NC([NH2+]C)=NC(O)=C2N(O)C1O
224 256.1040303481 C[NH2+]C(=N)N=C1C(=C=O)N(O)C(O)N1C=CCO Intermediate Fragment 
225 256.1040303481 C[NH2+]C(=NC=O)N=C1CN(O)C(O)N1C#CCO Intermediate Fragment 
226 256.1040303481 C[NH2+]C1=NC(O)=CC(N(C=CCO)C(O)=NO)=N1 Intermediate Fragment 
227 197.1033020761 CNC1=NC(O)=CC([NH+]=CCCO)=N1
228 195.0876520121 CNC1=NC(O)=CC([NH+]=C=CCO)=N1
229 133.0607685681 OCCC=NC(O)=[NH+]O
230 256.1040303481 C[NH2+]C1=NC(O)=C(N(O)CO)C(N=C=CCO)=N1 Intermediate Fragment 
231 228.1091157281 CNC1=NC(O)=C([NH2+]O)C(N=CCCO)=N1
232 256.1040303481 C[NH2+]C1=NC(O)=C(NO)C(N(C#CCO)CO)=N1 Intermediate Fragment 
233 258.1196804121 C[NH2+]C1=NC(O)=C2C(=N1)N(CCCO)C(O)N2O
234 240.1091157281 CC=CN1C2=NC([NH2+]C)=NC(O)=C2N(O)C1O
235 258.1196804121 C[NH2+]C1=NC(O)=CC(N(CCCO)C(O)=NO)=N1 Intermediate Fragment 
236 258.1196804121 C[NH2+]C1=NC(O)=C(N(O)C(O)=NCCCO)C=N1 Intermediate Fragment 
237 258.1196804121 C[NH2+]C1=NC(O)=C(N(O)CO)C(N=CCCO)=N1 Intermediate Fragment 
238 199.1189521401 CNC1=NC(O)=CC([NH2+]CCCO)=N1
239 258.1196804121 C[NH2+]C1=NC(O)=C(NO)C(N(C=CCO)CO)=N1 Intermediate Fragment 
240 260.1353304761 C[NH2+]C1=NC(O)C2C(=N1)N(CCCO)C(O)N2O
241 242.1247657921 CCCN1C2=NC([NH2+]C)=NC(O)=C2N(O)C1O
242 242.1247657921 C[NH2+]C1=NC(O)=C2NC(O)N(CCCO)C2=N1
243 260.1353304761 C[NH2+]C1=NC(O)=C(N(O)CO)C(NCCCO)=N1 Intermediate Fragment 
244 262.1509805401 C[NH2+]C1=NC(O)C2C(N1)N(CCCO)C(O)N2O
245 300.1302450961 C[NH2+]C1=NC(O)=C2C(=N1)N(C=CC(O)CCO)C(O)N2O
246 103.0753560121 C=CC(O)CC[OH2+]
247 77.0597059481 OCCC[OH2+]
248 254.0883802841 C[NH2+]C1=NC(O)=C2C(=N1)N(C#CCO)C(O)N2O
249 282.1196804121 CCC(O)C#CN1C2=NC([NH2+]C)=NC(O)=C2N(O)C1O
250 282.1196804121 C[NH2+]C1=NC(O)=C2C(=N1)N(C#CCCCO)C(O)N2O
251 300.1302450961 C[NH2+]C1=NC(O)=CC(N(C=CC(O)CCO)C(O)=NO)=N1 Intermediate Fragment 
252 241.1295168241 CNC1=NC(O)=CC([NH+]=CCC(O)CCO)=N1
253 177.0869833161 OCCC(O)CC=NC(O)=[NH+]O
254 300.1302450961 C[NH2+]C1=NC(O)=C(N(O)CO)C(N=C=CC(O)CCO)=N1 Intermediate Fragment 
255 239.1138667601 CNC1=NC(O)=CC([NH+]=C=CC(O)CCO)=N1
256 300.1302450961 C[NH2+]C1=NC(O)=C(NO)C(N(C#CC(O)CCO)CO)=N1 Intermediate Fragment 
257 318.1408097801 C[NH2+]C1=NC(O)=C2C(=N1)N(C(O)CC(O)CCO)C(O)N2O Intermediate Fragment 
258 234.1196804121 C[NH2+]C1=NC(O)C2C(N1)N(CO)C(O)N2O
259 59.0491412641 CC=C[OH2+]
260 55.0178411361 [CH2+]C#CO
261 242.0883802841 C=C(O)N1C2=NC([NH2+]C)=NC(O)=C2N(O)C1O
262 242.0883802841 C=C(O)N(C(O)=NO)C1=NC([NH2+]C)=NC(O)=C1 Intermediate Fragment 
263 244.1040303481 C[NH2+]C1=NC(O)=C2C(=N1)N(C(C)O)C(O)N2O
264 198.0621655361 C[NH2+]C1=NC(O)=C2C(=N1)N=C(O)N2O
265 226.0934656641 C[NH2+]C1=NC(O)=C2N=C(O)N(C(C)O)C2=N1
266 244.1040303481 C[NH2+]C(=N)N=C1C(=C=O)N(O)C(O)N1C(C)O Intermediate Fragment 
267 244.1040303481 C=C(O)N1C(=NC(=NC=O)[NH2+]C)CN(O)C1O Intermediate Fragment 
268 244.1040303481 C=C(O)N1C=C(C(=O)N=C(N)[NH2+]C)N(O)C1O Intermediate Fragment 
269 244.1040303481 C[NH2+]C1=NC(O)=CC(N(C(O)=NO)C(C)O)=N1 Intermediate Fragment 
270 213.0982166961 C=C(O)[NH+](CO)C1=NC(NC)=NC(O)=C1
271 211.0825666321 C=C(O)[NH+](C=O)C1=NC(NC)=NC(O)=C1
272 185.1033020761 CNC1=NC(O)=CC([NH2+]C(C)O)=N1
273 183.0876520121 CNC1=NC(O)=CC([NH+]=C(C)O)=N1
274 119.0451185041 C=C(O)N=C(O)[NH2+]O
275 121.0607685681 CC(O)N=C(O)[NH2+]O
276 244.1040303481 C[NH2+]C1=NC(O)=C(N(O)C(O)=NC(C)O)C=N1 Intermediate Fragment 
277 244.1040303481 C[NH2+]C1=NC(O)=C(N(O)CO)C(N=C(C)O)=N1 Intermediate Fragment 
278 181.0720019481 C=NC1=NC(O)=CC([NH+]=C(C)O)=N1
279 244.1040303481 C=C(O)N(CO)C1=NC([NH2+]C)=NC(O)=C1NO Intermediate Fragment 
280 246.1196804121 C[NH2+]C1=NC(O)C2C(=N1)N(C(C)O)C(O)N2O
281 228.1091157281 C[NH2+]C1=NC(O)=C2NC(O)N(C(C)O)C2=N1
282 246.1196804121 C[NH2+]C1=NC(O)=CC(N(C(C)O)C(O)NO)=N1 Intermediate Fragment 
283 246.1196804121 C[NH2+]C1=NC(O)=C(NO)C(N(CO)C(C)O)=N1 Intermediate Fragment 
284 248.1353304761 C[NH2+]C1=NC(O)C2C(N1)N(C(C)O)C(O)N2O
285 250.1509805401 C[NH2+]C1NC(O)C2C(N1)N(C(C)O)C(O)N2O
286 272.0989449681 C[NH2+]C1=NC(O)=C2C(=N1)N(C(O)=CCO)C(O)N2O
287 272.0989449681 C[NH2+]C1=NC(O)=CC(N(C(O)=CCO)C(O)=NO)=N1 Intermediate Fragment 
288 274.1145950321 C[NH2+]C1=NC(O)=C2C(=N1)N(C(O)CCO)C(O)N2O
289 274.1145950321 C[NH2+]C1=NC(O)=CC(N(C(O)=NO)C(O)CCO)=N1 Intermediate Fragment 
290 276.1302450961 C[NH2+]C1=NC(O)C2C(=N1)N(C(O)CCO)C(O)N2O
291 258.1196804121 C[NH2+]C1=NC(O)=C2NC(O)N(C(O)CCO)C2=N1
292 316.1251597161 C[NH2+]C1=NC(O)=C2C(=N1)N(C(O)=CC(O)CCO)C(O)N2O
293 318.1408097801 C[NH2+]C1=NC(O)=C2C(=N1)N(C(CCO)OCCO)C(O)N2O Intermediate Fragment 
294 318.1408097801 C[NH2+]C1=NC(O)=C2C(=N1)N(C(C)OC(CO)CO)C(O)N2O Intermediate Fragment 
