#In-silico ESI-MS/MS [M+H]+ Spectra
#PREDICTED BY CFM-ID 4.0.8
#SMILES=n1c(nc2c(c1Oc1c(c3c(cc1)cccc3)N)ncn2[C@@H]1O[C@H](CO)[C@@H](C1)O)N
#InChiKey=ARKLWHMYRIGJBL-BPLDGKMQSA-N
energy0
293.11454 100.00 42 67 57 65 89 44 90 82 70 75 80 64 47 97 94 61 78 79 69 96 (78.04 0.4057 0.28886 0.22587 0.17721 0.11373 0.058267 0.042383 0.03756 0.037057 0.02934 0.028629 0.025107 0.024198 0.023389 0.016539 0.016293 0.012347 0.0061445 0.005811)
409.16188 16.28 0 172 164 145 109 126 124 129 118 133 128 112 132 156 120 144 143 136 127 121 (12.638 0.18907 0.052934 0.033483 0.020425 0.010377 0.0064586 0.0030185 0.0021968 0.0013543 0.0011534 0.00083366 0.00079134 0.0006196 0.00050322 0.00047617 0.00042128 0.00040197 0.00017784 0.00010028)
energy1
276.08799 57.59 32 43 45 60 (27.489 3.7857 1.1485 0.28559)
293.11454 100.00 42 57 44 65 67 47 82 80 64 89 61 78 96 75 97 69 90 79 94 70 (52.684 0.65928 0.47916 0.43013 0.36858 0.35173 0.28956 0.25899 0.23052 0.19057 0.1856 0.1493 0.13174 0.098363 0.092838 0.070503 0.055685 0.0318 0.031517 0.0059728)
energy2
45.03349 6.58 167 (1.3959)
57.03349 21.94 158 (4.654)
109.05087 9.71 49 (2.0604)
134.04612 12.09 4 (2.565)
136.06177 13.71 6 (2.9078)
142.06513 17.94 22 17 24 (1.9583 1.0073 0.84085)
144.08078 36.89 15 21 18 16 23 (5.3067 0.97787 0.7406 0.43764 0.36156)
150.04104 30.83 26 (6.54)
152.05669 15.89 28 (3.3712)
160.07569 7.55 1 (1.6008)
251.09274 12.69 46 59 92 (1.5728 0.81666 0.30312)
264.08799 6.06 66 98 62 (0.92751 0.21552 0.14156)
266.10364 15.50 91 95 63 76 (1.7171 0.59124 0.53796 0.4425)
276.08799 23.24 32 43 45 60 (3.1693 1.6128 0.081564 0.065673)
291.09889 22.24 41 56 99 88 93 (3.3118 0.81525 0.36107 0.14607 0.083161)
293.11454 100.00 42 96 47 61 75 64 97 82 44 94 70 67 65 57 90 69 80 78 89 79 (5.6697 5.1353 2.9205 1.6923 0.8745 0.8448 0.66494 0.63027 0.53833 0.40165 0.32117 0.29186 0.27354 0.18154 0.17236 0.16877 0.16552 0.12123 0.091839 0.052032)
339.15640 10.30 161 (2.1853)
341.17205 10.30 162 (2.1853)
382.15098 7.05 125 122 (0.87472 0.62132)

0 409.1618795721 Nc1nc(Oc2ccc3ccccc3c2[NH3+])c2ncn(C3CC(O)C(CO)O3)c2n1
1 160.0756903601 [NH3+]C1C(=O)C=CC2=C1C=CC=C2
2 158.0600402961 [NH2+]=C1C(=O)C=CC2=C1C=CC=C2
3 244.0465154721 [NH3+]C1=NC=C2N=CN(C3=CC(=O)C(=C=O)O3)C2=N1
4 134.0461215481 [NH2+]=C1N=CC2=NC=NC2=N1
5 248.0778156001 [NH3+]C1=NC=C2N=CN(C3CC(O)C(=C=O)O3)C2=N1
6 136.0617716121 [NH2+]=C1N=C2N=CN=C2CN1
7 250.0934656641 [NH3+]C1=NC=C2N=CN(C3CC(O)C(=CO)O3)C2=N1
8 252.1091157281 [NH3+]C1=NC=C2N=CN(C3CC(O)C(CO)O3)C2=N1
9 234.0985510441 [NH3+]C1=NC=C2N=CN(C3CCC(=CO)O3)C2=N1
10 252.1091157281 [NH3+]C1=NC=C2N=CN(C(=O)CC(O)CCO)C2=N1 Intermediate Fragment 
11 150.1277259321 [NH3+]C1=CCCC2=C1CCCC2
12 148.1120758681 [NH3+]C1=CC=CC2=C1CCCC2
13 131.0855267721 C1=CC2=C(C=[CH2+]C=C2)CC1
14 146.0964258041 [NH3+]C1=CC=CC2=C1CCC=C2
15 144.0807757401 [NH3+]C1=CC=CC2=C1C=CC=C2
16 144.0807757401 C=C=C=C([NH3+])C1=CC=CC=C1 Intermediate Fragment 
17 142.0651256761 C#C[C+]=C(N)C1=CC=CC=C1
18 144.0807757401 [NH2+]=C=CC=CC1=CC=CC=C1 Intermediate Fragment 
19 115.0542266441 [CH2+]C#CC1=CC=CC=C1
20 117.0698767081 [CH4+]C#CC1=CC=CC=C1
21 144.0807757401 CC=C=C1C=CC=CC1=C=[NH2+] Intermediate Fragment 
22 142.0651256761 C=C=C=C1C=CC=CC1=C=[NH2+]
23 144.0807757401 C=C=C=CC1=CC([NH3+])=CC=C1 Intermediate Fragment 
24 142.0651256761 C#CC#CC1=CC([NH3+])=CC=C1
25 260.0414300921 [NH3+]C1=NC(O)=C2N=CN(C3=CC(=O)C(=C=O)O3)C2=N1
26 150.0410361681 [NH3+]C1=NC(=O)C2=NC=NC2=N1
27 262.0570801561 [NH3+]C1=NC(O)=C2N=CN(C3CC(=O)C(=C=O)O3)C2=N1
28 152.0566862321 [NH3+]C1=NC(=O)C2=NCNC2=N1
29 264.0727302201 [NH3+]C1=NC(O)=C2N=CN(C3CC(O)C(=C=O)O3)C2=N1
30 266.0883802841 [NH3+]C1=NC(O)=C2N=CN(C3CC(O)C(=CO)O3)C2=N1
31 392.1353304761 [NH3+]C1=NC(OC2=CC3=C(C=CC=C3)C=C2)=C2N=CN(C3CC(O)C(=CO)O3)C2=N1
32 276.0879863601 [NH2+]=C1N=C2N=CN=C2C(OC2=CC3=C(C=CC=C3)C=C2)=N1
33 278.1036364241 [NH2+]=C1N=C2N=CN=C2C(OC2=CC3=C(C=CC=C3)C=C2)N1
34 119.0702706321 OC1CCOC1C[OH2+]
35 119.0702706321 O=CCC(O)CC[OH2+] Intermediate Fragment 
36 117.0546205681 OC1CCOC1=C[OH2+]
37 99.0440558841 C=C1OCC=C1[OH2+]
38 117.0546205681 CCC(O)C(=O)C=[OH+] Intermediate Fragment 
39 99.0440558841 CC=C(O)C#C[OH2+]
40 117.0546205681 O=CCC(O)C=C[OH2+] Intermediate Fragment 
41 291.0988853921 N=C1N=C2N=CN=C2C(OC2=C([NH3+])C3=C(C=CC=C3)C=C2)=N1
42 293.1145354561 N=C1N=C2N=CN=C2C(OC2=C([NH3+])C3=C(C=CC=C3)C=C2)N1
43 276.0879863601 NC1=C([O+]=C2N=CN=C3N=CN=C32)C=CC2=C1C=CC=C2
44 293.1145354561 N=C(N)N=C1NC=NC1=C=[O+]C1=C(N)C2=C(C=CC=C2)C=C1 Intermediate Fragment 
45 276.0879863601 N=C=NC1=NC=NC1=C=[O+]C1=C(N)C2=C(C=CC=C2)C=C1
46 251.0927373921 N=C1NC=NC1=C=[O+]C1=C(N)C2=C(C=CC=C2)C=C1
47 293.1145354561 NC(=NC=[O+]C1=C(N)C2=C(C=CC=C2)C=C1)N=C1C=NC=N1 Intermediate Fragment 
48 111.0665226441 NC=[NH+]C1C=NC=N1
49 109.0508725801 N=C=[NH+]C1C=NC=N1
50 107.0352225161 N=C=[N+]=C1C=NC=N1
51 185.0709393281 N=C1C2=C(C=CC=C2)C=CC1OC#[NH+]
52 187.0865893921 N=C1C2=C(C=CC=C2)C=CC1OC=[NH2+]
53 82.0399735481 [NH2+]=C1C=NC=N1
54 210.0661882961 N#CN=C=[O+]C1=C(N)C2=C(C=CC=C2)C=C1
55 212.0818383601 N#C[NH+]=COC1=C(N)C2=C(C=CC=C2)C=C1
56 291.0988853921 N=C(N=C=[O+]C1=C(N)C2=C(C=CC=C2)C=C1)N=C1C=NC=N1
57 293.1145354561 N=C1C(=[O+]C(N=C(N)N)=C2C=NC=N2)C=CC2=C1C=CC=C2 Intermediate Fragment 
58 43.0290745161 [NH+]#CN
59 251.0927373921 N=C([O+]=C1C=CC2=C(C=CC=C2)C1=N)C1=CNC=N1
60 276.0879863601 N=C=NC([O+]=C1C=CC2=C(C=CC=C2)C1=N)=C1C=NC=N1
61 293.1145354561 N=C=NC(OC1=C([NH3+])C2=C(C=CC=C2)C=C1)=C1N=CNC1=N Intermediate Fragment 
62 264.0879863601 N=C1N=CN=C1C(=N)[O+]=C1C=CC2=C(C=CC=C2)C1=N
63 266.1036364241 N=C1N=CN=C1C(=[NH2+])OC1C=CC2=C(C=CC=C2)C1=N
64 293.1145354561 N=C=NC1=C(C(=N)OC2=C([NH3+])C3=C(C=CC=C3)C=C2)N=CN1 Intermediate Fragment 
65 293.1145354561 NC1=NC(OC(=C=[NH2+])C=CC2=CC=CC=C2)=C2N=CNC2=N1 Intermediate Fragment 
66 264.0879863601 [NH2+]=C1N=C2N=CN=C2C(OCC#CC2=CC=CC=C2)=N1
67 293.1145354561 C=C=C(OC1=C2N=CNC2=NC(N)=N1)C(=[NH2+])C1=CC=CC=C1 Intermediate Fragment 
68 188.0566862321 C#CCOC1=NC(=[NH2+])N=C2N=CN=C21
69 293.1145354561 C=C(OC1=NC(=N)N=C2N=CN=C21)C(=[NH2+])C1=C(C)C=CC=C1 Intermediate Fragment 
70 293.1145354561 C=CC1=C(C(N)=C=[O+]C2=C3N=CNC3=NC(N)=N2)C=CC=C1 Intermediate Fragment 
71 105.0698767081 C#[CH+]C1=CCCC=C1
72 191.0675852641 N=C1N=C2N=CN=C2C(OC=C=[NH2+])N1
73 265.0832353281 N=C1N=C2N=CN=C2C([O+]=C=C(N)C2=CC=CC=C2)=N1
74 267.0988853921 N=C1N=C2N=CN=C2C(OC=C([NH3+])C2=CC=CC=C2)=N1
75 293.1145354561 NC1=NC(OCC=C=C2C=CC=CC2=C=[NH2+])=C2N=CNC2=N1 Intermediate Fragment 
76 266.1036364241 [NH2+]=C1N=C2N=CN=C2C(OCC#CC2=CC=CC=C2)N1
77 262.0723362961 N=C1N=C2N=CN=C2C([O+]=CC#CC2=CC=CC=C2)=N1
78 293.1145354561 C=C=C=C1C(=C)C=CC(OC2=C3N=CNC3=NC(N)=N2)=C1[NH3+] Intermediate Fragment 
79 293.1145354561 C=C=C1C=CC(OC2=C3N=CNC3=NC(N)=N2)=C([NH3+])C1=C=C Intermediate Fragment 
80 293.1145354561 C=C=C=C1C=CC(OC2=C3N=CNC3=NC(N)=N2)=C([NH3+])C1=C Intermediate Fragment 
81 267.0988853921 C=C1C=CC(OC2=NC(=N)N=C3N=CN=C32)=C([NH3+])C1=C
82 293.1145354561 C=C=C=CC1=CC([NH3+])=C(OC2=C3N=CNC3=NC(N)=N2)C=C1 Intermediate Fragment 
83 241.0832353281 N=C1N=C2N=CN=C2C(OC2C=CC=CC2=[NH2+])=N1
84 253.0832353281 [CH2+]C1=CC(N)=C(OC2=NC(=N)N=C3N=CN=C32)C=C1
85 263.0675852641 [C+]#CC1=CC(N)=C(OC2=NC(=N)N=C3N=CN=C32)C=C1
86 267.0988853921 C#CC1=CC([NH3+])=C(OC2NC(=N)N=C3N=CN=C32)C=C1
87 277.0832353281 [CH2+]C#CC1=CC(N)=C(OC2=NC(=N)N=C3N=CN=C32)C=C1
88 291.0988853921 C#CC#CC1=CC([NH3+])=C(OC2=C3N=CNC3=NC(N)=N2)C=C1
89 293.1145354561 C=C=C=CC1=CC=CC(OC2=C3N=CNC3=NC(N)=N2)=C1[NH3+] Intermediate Fragment 
90 293.1145354561 N=C=NC1=NC(N)=NC(OC2=C([NH3+])C3=C(C=CC=C3)C=C2)=C1 Intermediate Fragment 
91 266.1036364241 N=C1C(=[O+]C2=CC(N)=NC(N)=N2)C=CC2=C1C=CC=C2
92 251.0927373921 N=C1C(=[O+]C2=CC=NC(N)=N2)C=CC2=C1C=CC=C2
93 291.0988853921 N#CNC1=NC(N)=NC([O+]=C2C=CC3=C(C=CC=C3)C2=N)=C1
94 293.1145354561 N=C=NC1=C(OC2=C([NH3+])C3=C(C=CC=C3)C=C2)N=C(N)N=C1 Intermediate Fragment 
95 266.1036364241 N=C1N=CC(=N)C(OC2C=CC3=C(C=CC=C3)C2=[NH2+])=N1
96 293.1145354561 C=NC1=C([O+]=C2C=CC3=C(C=CC=C3)C2=N)N=C(N)N=C1N Intermediate Fragment 
97 293.1145354561 C=NC1=NC(=N)N=C(OC2=C([NH3+])C3=C(C=CC=C3)C=C2)C1=N Intermediate Fragment 
98 264.0879863601 N=C1N=CC(=N)C([O+]=C2C=CC3=C(C=CC=C3)C2=N)=N1
99 291.0988853921 C#[N+]C1=NC(=N)N=C(OC2=C(N)C3=C(C=CC=C3)C=C2)C1=N
100 295.1301855201 NC1N=C2N=CN=C2C(OC2=C([NH3+])C3=C(C=CC=C3)C=C2)N1
101 297.1458355841 NC1N=C2NCN=C2C(OC2=C([NH3+])C3=C(C=CC=C3)C=C2)N1
102 299.1614856481 NC1N=C2NCNC2C(OC2=C([NH3+])C3=C(C=CC=C3)C=C2)N1
103 377.1356648241 NC1=NC(OC2=C([NH3+])C3=C(C=CC=C3)C=C2)=C2N=CN(C3CC(O)=CO3)C2=N1
104 379.1513148881 NC1=NC(OC2=C([NH3+])C3=C(C=CC=C3)C=C2)=C2N=CN(C3CC(O)CO3)C2=N1
105 381.1669649521 NC1=NC(OC2=C([NH3+])C3=C(C=CC=C3)C=C2)=C2NCN(C3CC(O)CO3)C2=N1
106 391.1513148881 C=C1OC(N2C=NC3=C(OC4=C([NH3+])C5=C(C=CC=C5)C=C4)N=C(N)N=C32)CC1O
107 391.1513148881 NC1=NC(OC2=C([NH3+])C3=C(C=CC=C3)C=C2)=C2N=CN(C3CCC(=CO)O3)C2=N1
108 392.1353304761 [NH3+]C1=C(OC2=C3N=CN(C4CC(O)C(=CO)O4)C3=NC=N2)C=CC2=C1C=CC=C2
109 409.1618795721 N=C(N)N=C1C(=COC2=C([NH3+])C3=C(C=CC=C3)C=C2)N=CN1C1CC(O)C(=CO)O1 Intermediate Fragment 
110 367.1400815081 NC1=C(OC=C2N=CN(C3CC(O)C(=CO)O3)C2=[NH2+])C=CC2=C1C=CC=C2
111 350.1135324121 [NH3+]C1=C(OCC2=CN(C3C=C(O)C(=C=O)O3)C=N2)C=CC2=C1C=CC=C2
112 409.1618795721 NC(=NCOC1=C([NH3+])C2=C(C=CC=C2)C=C1)N=C1C=NCN1C1CC(O)C(=C=O)O1 Intermediate Fragment 
113 227.1138667601 NC=[NH+]C1=CN=CN1C1CC(O)C(CO)O1
114 225.0982166961 NC=[NH+]C1=CN=CN1C1CC(O)C(=CO)O1
115 225.0982166961 NC=[NH+]C1=CN=CN1C(=O)CC(O)C=CO Intermediate Fragment 
116 223.0825666321 NC=[NH+]C1=CN=CN1C1CC(O)C(=C=O)O1
117 198.0873176641 [NH2+]=C1C=NCN1C1CC(O)C(=CO)O1
118 409.1618795721 NC(N)=NC(OC1=C([NH3+])C2=C(C=CC=C2)C=C1)C1=CN(C2CC(O)C(=C=O)O2)C=N1 Intermediate Fragment 
119 367.1400815081 NC1=C(OC([NH3+])C2=CN(C3CC(O)C(=C=O)O3)C=N2)C=CC2=C1C=CC=C2
120 409.1618795721 N=C1C(=C(N=CN)OC2=C([NH3+])C3=C(C=CC=C3)C=C2)N=CN1C1CC(O)C(=CO)O1 Intermediate Fragment 
121 409.1618795721 NC=NC1=C(C(N)OC2=C([NH3+])C3=C(C=CC=C3)C=C2)N=CN1C1CC(O)C(=C=O)O1 Intermediate Fragment 
122 382.1509805401 N=C1C(=C([NH3+])OC2=C(N)C3=C(C=CC=C3)C=C2)N=CN1C1CC(O)C(=CO)O1
123 392.1353304761 NC=[NH+]C1=C(COC2=C(N)C3=C(C=CC=C3)C=C2)N=CN1C1C=C(O)C(=C=O)O1
124 409.1618795721 NC1=NC(OC(=C=[NH2+])C=CC2=CC=CC=C2)=C2N=CN(C3CC(O)C(CO)O3)C2=N1 Intermediate Fragment 
125 382.1509805401 [NH3+]C1=NC(OCC#CC2=CC=CC=C2)=C2N=CN(C3CC(O)C(CO)O3)C2=N1
126 409.1618795721 C=CC(OC1=C2N=CN(C3CC(O)C(=CO)O3)C2=NC(N)=N1)=C([NH3+])C1=CC=CC=C1 Intermediate Fragment 
127 409.1618795721 CC1=C(C([NH3+])=C(C)OC2=C3N=CN(C4CC(O)C(=C=O)O4)C3=NC(N)=N2)C=CC=C1 Intermediate Fragment 
128 409.1618795721 C=CC1=C(C([NH3+])=COC2=C3N=CN(C4CC(O)C(=CO)O4)C3=NC(N)=N2)C=CC=C1 Intermediate Fragment 
129 409.1618795721 NC1=NC(OCC=C=C2C=CC=CC2=C=[NH2+])=C2N=CN(C3CC(O)C(CO)O3)C2=N1 Intermediate Fragment 
130 380.1353304761 [NH3+]C1=NC(OCC#CC2=CC=CC=C2)=C2N=CN(C3CC(O)C(=CO)O3)C2=N1
131 378.1196804121 [NH3+]C1=NC(OCC#CC2=CC=CC=C2)=C2N=CN(C3CC(O)C(=C=O)O3)C2=N1
132 409.1618795721 C=C=CC1=C(C)C=CC(OC2=C3N=CN(C4CC(O)C(=CO)O4)C3=NC(N)=N2)=C1[NH3+] Intermediate Fragment 
133 409.1618795721 C=C=C=CC1=CC([NH3+])=C(OC2=C3N=CN(C4CC(O)C(CO)O4)C3=NC(N)=N2)C=C1 Intermediate Fragment 
134 369.1305794441 CC1=CC([NH3+])=C(OC2=C3N=CN(C4CC(O)C(=C=O)O4)C3=NC(N)=N2)C=C1
135 383.1462295081 C#CC1=CC([NH3+])=C(OC2=C3N=CN(C4CC(O)C(CO)O4)C3=NC(N)=N2)C=C1
136 409.1618795721 N=CN(C1=NC(N)=NC(OC2=C([NH3+])C3=C(C=CC=C3)C=C2)=C1)C1CC(O)C(=CO)O1 Intermediate Fragment 
137 392.1353304761 CN(C1=NC(N)=NC(OC2=C([NH3+])C3=C(C=CC=C3)C=C2)=C1)C1C=C(O)C(=C=O)O1
138 253.1083874561 NC1=NC(OC2C=CC3=C(C=CC=C3)C2=[NH2+])=CC=N1
139 159.0764186321 [NH+]#CNC1CC(O)C(CO)O1
140 142.0498695361 C=[NH+]C1CC(O)C(=C=O)O1
141 159.0764186321 [NH+]#CN=C(O)CC(O)CCO Intermediate Fragment 
142 159.0764186321 CC(O)C(CO)OC=NC#[NH+] Intermediate Fragment 
143 409.1618795721 NC1=NC(OC2=C([NH3+])C3=C(C=CC=C3)C=C2)=C(N=C=NC2CC(O)C(CO)O2)C=N1 Intermediate Fragment 
144 409.1618795721 C=NC1=C(OC2=C([NH3+])C3=C(C=CC=C3)C=C2)N=C(N)N=C1N=C1CC(O)C(CO)O1 Intermediate Fragment 
145 409.1618795721 NC1=NC(OC2=C([NH3+])C3=C(C=CC=C3)C=C2)=C2N=CN(CCC(O)C(=O)CO)C2=N1 Intermediate Fragment 
146 391.1513148881 NC1=NC(OC2=C([NH3+])C3=C(C=CC=C3)C=C2)=C2N=CN(CCC(O)C#CO)C2=N1
147 373.1407502041 C#CC(O)=CCN1C=NC2=C(OC3=C([NH3+])C4=C(C=CC=C4)C=C3)N=C(N)N=C21
148 349.1407502041 NC1=NC(OC2=C([NH3+])C3=C(C=CC=C3)C=C2)=C2N=CN(CC=CO)C2=N1
149 347.1251001401 NC1=NC(OC2=C([NH3+])C3=C(C=CC=C3)C=C2)=C2N=CN(CC#CO)C2=N1
150 319.1301855201 C=CN1C=NC2=C(OC3=C([NH3+])C4=C(C=CC=C4)C=C3)N=C(N)N=C21
151 373.1407502041 NC1=NC(OC2=C([NH3+])C3=C(C=CC=C3)C=C2)=C2N=CN(CC=CC#CO)C2=N1
152 353.1720503321 NC1=NC(OC2=C([NH3+])C3=C(C=CC=C3)C=C2)=C2NCN(CCCO)C2=N1
153 351.1564002681 NC1=NC(OC2=C([NH3+])C3=C(C=CC=C3)C=C2)=C2N=CN(CCCO)C2=N1
154 321.1458355841 CCN1C=NC2=C(OC3=C([NH3+])C4=C(C=CC=C4)C=C3)N=C(N)N=C21
155 317.1145354561 C#CN1C=NC2=C(OC3=C([NH3+])C4=C(C=CC=C4)C=C3)N=C(N)N=C21
156 409.1618795721 CC(OC(=CO)CO)N1C=NC2=C(OC3=C([NH3+])C4=C(C=CC=C4)C=C3)N=C(N)N=C21 Intermediate Fragment 
157 75.0440558841 OCC=C[OH2+]
158 57.0334912001 C#CC[OH2+]
159 335.1251001401 CC(=O)N1C=NC2=C(OC3=C([NH3+])C4=C(C=CC=C4)C=C3)N=C(N)N=C21
160 337.1407502041 CC(O)N1C=NC2=C(OC3=C([NH3+])C4=C(C=CC=C4)C=C3)N=C(N)N=C21
161 339.1564002681 CC(O)N1CNC2=C(OC3=C([NH3+])C4=C(C=CC=C4)C=C3)N=C(N)N=C21
162 341.1720503321 CC(O)N1CNC2=C(OC3=C([NH3+])C4=C(C=CCC4)C=C3)N=C(N)N=C21
163 379.1513148881 CC(OC=CO)N1C=NC2=C(OC3=C([NH3+])C4=C(C=CC=C4)C=C3)N=C(N)N=C21
164 409.1618795721 NC1=NC(OC2=C([NH3+])C3=C(C=CC=C3)C=C2)=C2N=CN(C(CCO)OC=CO)C2=N1 Intermediate Fragment 
165 47.0491412641 CC[OH2+]
166 29.0385765801 C=[CH3+]
167 45.0334912001 C=C[OH2+]
168 363.1200147601 NC1=NC(OC2=C([NH3+])C3=C(C=CC=C3)C=C2)=C2N=CN(C(=O)C=CO)C2=N1
169 365.1356648241 NC1=NC(OC2=C([NH3+])C3=C(C=CC=C3)C=C2)=C2N=CN(C(=O)CCO)C2=N1
170 367.1513148881 NC1=NC(OC2=C([NH3+])C3=C(C=CC=C3)C=C2)=C2N=CN(C(O)CCO)C2=N1
171 365.1356648241 NC1=NC(OC2=C([NH3+])C3=C(C=CC=C3)C=C2)=C2N=CN(COC=CO)C2=N1
172 409.1618795721 NC1=NC(OC2=C([NH3+])C3=C(C=CC=C3)C=C2)=C2N=CN(C(=O)CC(O)CCO)C2=N1 Intermediate Fragment 
173 333.1094500761 [CH2+]C(=O)N1C=NC2=C(OC3=C(N)C4=C(C=CC=C4)C=C3)N=C(N)N=C21
174 68.9971056921 [O+]#CC#CO
175 71.0127557561 O=CC#C[OH2+]
176 73.0284058201 OCC#C[OH2+]
177 43.0178411361 C#C[OH2+]
178 55.0178411361 C#CC=[OH+]
179 325.1407502041 NC1=NC(OC2=C([NH3+])C3=C(C=CC=C3)C=C2)=C2NCN(CO)C2=N1
180 323.1251001401 NC1=NC(OC2=C([NH3+])C3=C(C=CC=C3)C=C2)=C2N=CN(CO)C2=N1
181 321.1094500761 NC1=NC(OC2=C([NH3+])C3=C(C=CC=C3)C=C2)=C2N=CN(C=O)C2=N1
182 319.0938000121 NC1=NC(OC2=C(N)C3=C(C=CC=C3)C=C2)=C2N=CN(C#[O+])C2=N1
183 87.0440558841 CC(O)C#C[OH2+]
184 89.0597059481 CC(O)C=C[OH2+]
185 71.0491412641 C#CC(C)[OH2+]
186 71.0491412641 CCC#C[OH2+]
187 91.0753560121 CC(O)CC[OH2+]
188 73.0647913281 C=CC(C)[OH2+]
189 73.0647913281 CCC=C[OH2+]
190 407.1462295081 NC1=NC(OC2=C([NH3+])C3=C(C=CC=C3)C=C2)=C2N=CN(C(=O)CC(O)C=CO)C2=N1
