#In-silico ESI-MS/MS [M+H]+ Spectra
#PREDICTED BY CFM-ID 4.0.8
#SMILES=n1cnc2c(c1N)[n+](cn2[C@H]1C[C@H]([C@H](O1)CO)O)CCC
#InChiKey=BCVZJRYAUYPKIP-OPRDCNLKSA-N
energy0
178.10872 100.00 14 42 55 23 43 34 52 33 50 29 (42.33 0.12323 0.097508 0.045304 0.020482 0.01877 0.011892 0.0078343 0.0048741 0.0021129)
180.12437 59.38 59 74 94 91 70 80 69 87 64 68 (23.504 0.92268 0.5515 0.1099 0.090575 0.052928 0.031688 0.030895 0.030445 0.0075195)
294.15607 32.37 0 153 160 146 138 143 141 136 167 145 142 151 137 (11.87 0.89909 0.55043 0.23882 0.10149 0.067374 0.031952 0.020705 0.016646 0.0074724 0.0018694 0.0015578 0.0013169)
energy1
136.06177 30.31 11 (12.751)
178.10872 100.00 14 43 52 34 55 33 23 29 42 50 (37.845 1.9681 0.73083 0.437 0.33457 0.2611 0.25809 0.097229 0.084532 0.046229)
180.12437 70.46 59 80 91 94 70 64 74 69 68 87 (22.261 4.2432 0.97828 0.66738 0.56168 0.26971 0.22082 0.20329 0.13789 0.094366)
energy2
70.06513 8.95 83 (2.2502)
121.05087 16.26 47 (4.0912)
123.06652 25.85 46 (6.5029)
127.09782 3.86 44 (0.97187)
136.06177 100.00 11 (25.154)
136.08692 4.97 30 26 (0.99999 0.24982)
138.07742 11.20 18 (2.8183)
140.09307 4.47 61 (1.1233)
149.08217 6.10 40 57 28 (0.81538 0.68959 0.030235)
150.07742 10.81 20 (2.7197)
151.09782 23.81 51 25 32 76 (3.294 2.0526 0.47103 0.1727)
153.11347 8.93 89 66 75 (1.3387 0.79876 0.10803)
163.09782 13.97 65 60 90 71 (1.5825 1.2209 0.56432 0.14512)
164.09307 7.23 63 93 (1.4718 0.34594)
178.10872 23.68 14 55 34 42 52 29 23 43 33 50 (1.8624 1.205 0.84819 0.77503 0.35227 0.2634 0.26227 0.17179 0.16669 0.049438)
180.12437 44.28 59 94 70 80 91 64 87 74 68 69 (7.2006 1.6314 0.45025 0.4371 0.36623 0.3513 0.32394 0.25267 0.10016 0.023751)
236.11420 6.10 127 118 117 (1.1862 0.21102 0.13621)

0 294.1560659201 CCC[N+]1=CN(C2CC(O)C(CO)O2)C2=NC=NC(N)=C21
1 119.0702706321 OC1CCOC1C[OH2+]
2 117.0546205681 OC1C=COC1C[OH2+]
3 99.0440558841 CC1=C([OH2+])C=CO1
4 99.0440558841 [OH2+]CC1=CC=CO1
5 117.0546205681 C=COC(=CO)C[OH2+] Intermediate Fragment 
6 45.0334912001 C=C[OH2+]
7 117.0546205681 OC=C=COCC[OH2+] Intermediate Fragment 
8 117.0546205681 OC=C=C(O)CC[OH2+] Intermediate Fragment 
9 115.0389705041 OC1=C(C[OH2+])OC=C1
10 176.0930717401 CC=CN1C=NC2=NC=NC([NH3+])=C21
11 136.0617716121 [NH2+]=C1N=CN=C2NCN=C12
12 176.0930717401 CC=CN=C=NC1=NC=NC([NH3+])=C1 Intermediate Fragment 
13 176.0930717401 C=NC1=NC=NC([NH3+])=C1N=C=CC Intermediate Fragment 
14 178.1087218041 CCCN1C=NC2=NC=NC([NH3+])=C21
15 161.0821727081 CC=[CH2+]N1C=NC2=NC=NC=C21
16 43.0542266441 CC=[CH3+]
17 134.0461215481 [NH2+]=C1N=CN=C2N=CN=C12
18 138.0774216761 [NH2+]=C1N=CN=C2NCNC12
19 148.0617716121 [CH2+]N1C=NC2=NC=NC(N)=C21
20 150.0774216761 CN1C=NC2=NC=NC([NH3+])=C21
21 152.0930717401 CN1CNC2=NC=NC([NH3+])=C21
22 162.0774216761 C=CN1C=NC2=NC=NC([NH3+])=C21
23 178.1087218041 CCCN1CNC(N=C=N)=C1C#[NH+] Intermediate Fragment 
24 161.0821727081 C=[NH+]C1=C(C#N)N(C=CC)C=N1
25 151.0978227721 CCCN1C=NC(=[NH2+])C1=C=N
26 136.0869237401 CCCN1C=NC=C1C#[NH+]
27 134.0712736761 CC=CN1C=NC=C1C#[NH+]
28 149.0821727081 CC=CN1C=NC(=NC#[NH+])C1
29 178.1087218041 CCCN1C=C(N=C=NC#[NH+])NC1 Intermediate Fragment 
30 136.0869237401 C=[NH+]C1=CN(C=CC)C=N1
31 134.0712736761 C=[NH+]C1=CN(C#CC)C=N1
32 151.0978227721 CCCN1C=NC(=NC#[NH+])C1
33 178.1087218041 CCCN1C=NC=C1C(=[NH2+])N=C=N Intermediate Fragment 
34 178.1087218041 C=NC([NH3+])=C1C(=N)N=CN1C=CC Intermediate Fragment 
35 161.0821727081 C=[NH+]C(=N)C1=CN=CN1C#CC
36 122.0712736761 CC#CN1C=NC(=[NH2+])C1
37 124.0869237401 CC=CN1C=NC(=[NH2+])C1
38 126.1025738041 CCCN1C=NC(=[NH2+])C1
39 147.0665226441 CC#CN1C=NC(=[NH2+])C1=C=N
40 149.0821727081 CC=CN1C=NC(=[NH2+])C1=C=N
41 176.0930717401 C=[NH+]C(N)=C1C(=N)N=CN1C#CC
42 178.1087218041 C=NC1=C(C(N)=[NH2+])N(C=CC)C=N1 Intermediate Fragment 
43 178.1087218041 CCCN=C=NC1=NC=NC([NH3+])=C1 Intermediate Fragment 
44 127.0978227721 CNC1=NC=NC([NH3+])C1
45 125.0821727081 CNC1=NC=NC([NH3+])=C1
46 123.0665226441 C=NC1=NC=NC([NH3+])=C1
47 121.0508725801 C#[N+]C1=NC=NC(N)=C1
48 68.0494756121 C=[NH+]C#CC
49 96.0556236121 [NH3+]C1=CC=NC=N1
50 178.1087218041 CC=CN(C=N)C1=C([NH3+])N=CN=C1 Intermediate Fragment 
51 151.0978227721 CCC=NC1=C([NH3+])N=CN=C1
52 178.1087218041 CC#CN(C)C1=C([NH3+])N=CN=C1N Intermediate Fragment 
53 111.0665226441 NC1=NC=NC([NH3+])=C1
54 161.0821727081 C=[N+](C#CC)C1=C(N)N=CN=C1
55 178.1087218041 C=NC1=NC=NC([NH3+])=C1N=CCC Intermediate Fragment 
56 58.0651256761 CCC=[NH2+]
57 149.0821727081 CC=C=NC1=C([NH3+])N=CN=C1
58 147.0665226441 C=C=C=NC1=C([NH3+])N=CN=C1
59 180.1243718681 CCCN1CNC2=NC=NC([NH3+])=C21
60 163.0978227721 CC[CH3+]N1C=NC2=NC=NC=C21
61 140.0930717401 [NH3+]C1N=CN=C2NCNC21
62 154.1087218041 CN1CNC2=NC=NC([NH3+])C21
63 164.0930717401 CCN1C=NC2=NC=NC([NH3+])=C21
64 180.1243718681 CCCN1CNC(N=C=N)=C1C=[NH2+] Intermediate Fragment 
65 163.0978227721 C=[NH+]C1=C(C#N)N(CCC)C=N1
66 153.1134728361 CCCN1CNC(=[NH2+])C1=C=N
67 138.1025738041 CCCN1CNC=C1C#[NH+]
68 180.1243718681 CCCN1C=C(N=C=NC=[NH2+])NC1 Intermediate Fragment 
69 180.1243718681 CCCN1CNC=C1C(=[NH2+])N=C=N Intermediate Fragment 
70 180.1243718681 C=NC([NH3+])=C1C(=N)N=CN1CCC Intermediate Fragment 
71 163.0978227721 C=[NH+]C(=N)C1=CN=CN1C=CC
72 55.0290745161 C=[NH+]C#N
73 128.1182238681 CCCN1CNC(=[NH2+])C1
74 180.1243718681 C=NC1=C(C(N)=[NH2+])N(CCC)C=N1 Intermediate Fragment 
75 153.1134728361 CCCN1C=NC=C1C(=N)[NH3+]
76 151.0978227721 CC=CN1C=NC=C1C(=N)[NH3+]
77 45.0447245801 N=C[NH3+]
78 43.0290745161 N#C[NH3+]
79 138.1025738041 C=[NH+]C1=CN(CCC)C=N1
80 180.1243718681 CCCN=CNC1=NC=NC([NH3+])=C1 Intermediate Fragment 
81 129.1134728361 CNC1CC([NH3+])N=CN1
82 115.0978227721 NC1CC([NH3+])N=CN1
83 70.0651256761 C=[NH+]C=CC
84 100.0869237401 [NH3+]C1CCNC=N1
85 98.0712736761 [NH3+]C1CC=NC=N1
86 85.0760247081 CCC[NH+]=C=N
87 180.1243718681 CCCN(C=N)C1=C([NH3+])N=CN=C1 Intermediate Fragment 
88 83.0603746441 CC=C[NH+]=C=N
89 153.1134728361 CCCNC1=C([NH3+])N=CN=C1
90 163.0978227721 CC#CN(C)C1=C([NH3+])N=CN=C1
91 180.1243718681 CC=CN(C)C1=C([NH3+])N=CN=C1N Intermediate Fragment 
92 113.0821727081 NC1=NC=NC([NH3+])C1
93 164.0930717401 CC=C=NC1=C([NH3+])N=CN=C1N
94 180.1243718681 C=NC1=NC=NC([NH3+])=C1NCCC Intermediate Fragment 
95 60.0807757401 CCC[NH3+]
96 56.0494756121 CCC#[NH+]
97 182.1400219321 CCCN1CNC2=NC=NC([NH3+])C21
98 182.1400219321 CCCNC1=C([NH3+])N=CN=C1NC Intermediate Fragment 
99 184.1556719961 CCCN1CNC2NC=NC([NH3+])C21
100 262.1298511721 CCCN1CN(C2=CC(O)=CO2)C2=NC=NC([NH3+])=C21
101 264.1455012361 CCCN1CN(C2=CC(O)CO2)C2=NC=NC([NH3+])=C21
102 266.1611513001 CCCN1CN(C2CC(O)CO2)C2=NC=NC([NH3+])=C21
103 276.1455012361 CCCN1CN(C2=CC(O)=C(C)O2)C2=NC=NC([NH3+])=C21
104 276.1455012361 CCCN1CN(C2=CC=C(CO)O2)C2=NC=NC([NH3+])=C21
105 276.1455012361 CCCN1CN(C(O)=C=C=CCO)C2=NC=NC([NH3+])=C21 Intermediate Fragment 
106 250.0934656641 [NH3+]C1=C2N=CN(C3=CC(O)C(CO)O3)C2=NC=N1
107 252.1091157281 [NH3+]C1=C2N=CN(C3CC(O)C(CO)O3)C2=NC=N1
108 252.1091157281 [NH3+]C1=C2N=CN(C=CC(O)C(O)CO)C2=NC=N1 Intermediate Fragment 
109 192.0879863601 [NH3+]C1=C2N=CN(C=CCO)C2=NC=N1
110 234.0985510441 [NH3+]C1=C2N=CN(C#CC(O)CCO)C2=NC=N1
111 252.1091157281 [NH3+]C1=C2N=CN(C(O)=CC(O)CCO)C2=NC=N1 Intermediate Fragment 
112 208.0829009801 [NH3+]C1=C2N=CN(C(O)=CCO)C2=NC=N1
113 252.1091157281 [NH3+]C1=C2N=CN(C(=CCO)OCCO)C2=NC=N1 Intermediate Fragment 
114 254.1247657921 [NH3+]C1=C2NCN(C3CC(O)C(CO)O3)C2=NC=N1
115 142.1087218041 [NH3+]C1N=CNC2NCNC12
116 144.1243718681 [NH3+]C1NCNC2NCNC12
117 236.1142011081 CC1OC(N2C=NC3=C([NH3+])N=CN=C32)CC1O
118 236.1142011081 [NH3+]C1=C2N=CN(C3CCC(CO)O3)C2=NC=N1
119 254.1247657921 N=C=NC(=[NH2+])C1=CN(C2CC(O)C(CO)O2)CN1 Intermediate Fragment 
120 252.1091157281 N=C=[NH+]C(=N)C1=CN(C2CC(O)C(CO)O2)C=N1
121 254.1247657921 C=NC([NH3+])=C1N=CN(C2CC(O)C(CO)O2)C1=N Intermediate Fragment 
122 254.1247657921 N=CN(C1=NC=NC([NH3+])=C1)C1CC(O)C(CO)O1 Intermediate Fragment 
123 237.0982166961 CN(C1=CC(O)=C(CO)O1)C1=NC=NC([NH3+])=C1
124 254.1247657921 C=NC1=C([NH3+])N=CN=C1NC1CC(O)C(CO)O1 Intermediate Fragment 
125 254.1247657921 CC(O)C(CO)OCN1C=NC2=C([NH3+])N=CN=C21 Intermediate Fragment 
126 254.1247657921 [NH3+]C1=C2N=CN(CCC(O)C(O)CO)C2=NC=N1 Intermediate Fragment 
127 236.1142011081 [NH3+]C1=C2N=CN(C=CC(O)CCO)C2=NC=N1
128 254.1247657921 [NH3+]C1=C2N=CN(C(O)CC(O)CCO)C2=NC=N1 Intermediate Fragment 
129 254.1247657921 [NH3+]C1=C2N=CN(C(CCO)OCCO)C2=NC=N1 Intermediate Fragment 
130 264.1091157281 CN1CN(C2=CC(O)=C(CO)O2)C2=NC=NC([NH3+])=C21
131 266.1247657921 CN1CN(C2=CC(O)C(CO)O2)C2=NC=NC([NH3+])=C21
132 266.1247657921 CN1CN(C(O)=C=C(O)CCO)C2=NC=NC([NH3+])=C21 Intermediate Fragment 
133 268.1404158561 CN1CN(C2CC(O)C(CO)O2)C2=NC=NC([NH3+])=C21
134 268.1404158561 CN1CN(C(O)=CC(O)CCO)C2=NC=NC([NH3+])=C21 Intermediate Fragment 
135 278.1247657921 CCN1CN(C2=CC(O)=C(CO)O2)C2=NC=NC([NH3+])=C21
136 294.1560659201 CCCN1CN(C2CC(O)C(CO)O2)C(N=C=N)=C1C#[NH+] Intermediate Fragment 
137 294.1560659201 CCCN1C=C(N=C=NC#[NH+])N(C2CC(O)C(CO)O2)C1 Intermediate Fragment 
138 294.1560659201 C=NC([NH3+])=C1C(=N)N(C2=CC(O)=C(CO)O2)CN1CCC Intermediate Fragment 
139 240.1342678561 CCCN1CC(=[NH2+])N(C2=CC(O)=C(CO)O2)C1
140 267.1451668881 CCCN1CN(C2=CC(O)C(CO)O2)C(=[NH2+])C1=C=N
141 294.1560659201 CCCN=CN(C1=CC(O)C(CO)O1)C1=NC=NC([NH3+])=C1 Intermediate Fragment 
142 294.1560659201 CCCN(C=NC1=CC(O)C(CO)O1)C1=C([NH3+])N=CN=C1 Intermediate Fragment 
143 294.1560659201 CCCN(C)C1=C([NH3+])N=CN=C1N=C1C=C(O)C(CO)O1 Intermediate Fragment 
144 225.0982166961 [NH3+]C1=CC(N=C2CC(O)C(CO)O2)=NC=N1
145 294.1560659201 CCCNC1=C([NH3+])N=CN=C1N(C)C1=CC(O)=C(CO)O1 Intermediate Fragment 
146 294.1560659201 C=C(O)C(=CO)OCN1CN(CCC)C2=C([NH3+])N=CN=C21 Intermediate Fragment 
147 206.1036364241 CC#CN1CN(CO)C2=NC=NC([NH3+])=C21
148 87.0440558841 C=C(O)C=C[OH2+]
149 192.1243718681 CC=CN1CN(C)C2=NC=NC([NH3+])=C21
150 190.1087218041 CC#CN1CN(C)C2=NC=NC([NH3+])=C21
151 294.1560659201 CCCN1CN(C=C=C(O)C(O)CO)C2=NC=NC([NH3+])=C21 Intermediate Fragment 
152 276.1455012361 CCCN1CN(C#CC(O)=CCO)C2=NC=NC([NH3+])=C21
153 294.1560659201 CCCN1CN(C(O)=C=C(O)CCO)C2=NC=NC([NH3+])=C21 Intermediate Fragment 
154 208.1192864881 CC=CN1CN(CO)C2=NC=NC([NH3+])=C21
155 210.1349365521 CCCN1CN(CO)C2=NC=NC([NH3+])=C21
156 222.1349365521 C=C(O)N1CN(CCC)C2=C([NH3+])N=CN=C21
157 248.1142011081 CCCN1CN(C(O)=C=C=O)C2=NC=NC([NH3+])=C21
158 250.1298511721 CCCN1CN(C(O)=C=CO)C2=NC=NC([NH3+])=C21
159 252.1455012361 CCCN1CN(C(O)=CCO)C2=NC=NC([NH3+])=C21
160 294.1560659201 CCCN1CN(C(=C=CO)OCCO)C2=NC=NC([NH3+])=C21 Intermediate Fragment 
161 250.1298511721 CCCN1CN(COC#CO)C2=NC=NC([NH3+])=C21
162 266.1611513001 C=C(OCCO)N1CN(CCC)C2=C([NH3+])N=CN=C21
163 238.1662366801 CCCN1CN(CCCO)C2=NC=NC([NH3+])=C21
164 236.1505866161 CCCN1CN(C=CCO)C2=NC=NC([NH3+])=C21
165 234.1349365521 CCCN1CN(C#CCO)C2=NC=NC([NH3+])=C21
166 232.1192864881 CCCN1CN(C#CC=O)C2=NC=NC([NH3+])=C21
167 294.1560659201 C=C(OC(=CO)CO)N1CN(CCC)C2=C([NH3+])N=CN=C21 Intermediate Fragment 
