#In-silico ESI-MS/MS [M+H]+ Spectra
#PREDICTED BY CFM-ID 4.0.8
#SMILES=[nH]1c(nc2c(c1=O)ncn2[C@@H]1O[C@H](CO)[C@@H](C1)O)NC1C(C(C(c2c1c1c(cc2)c2c(c(c1C)C)cccc2)O)O)O
#InChiKey=BTCPBWQHXXAWRZ-CBJQSXGBSA-N
energy0
440.17172 100.00 32 33 34 21 278 (68.411 2.9175 1.9198 0.011938 1.4625e-06)
458.18228 16.16 20 66 87 101 79 102 43 100 35 63 86 51 98 45 109 52 82 57 50 106 97 47 105 104 (11.5 0.10565 0.068035 0.037312 0.029518 0.02002 0.01251 0.010061 0.0097605 0.0077266 0.0071071 0.0061198 0.0052927 0.005135 0.00494 0.003075 0.0026789 0.0025415 0.0021709 0.00075398 0.00072029 0.00071099 0.00053734 0.00027744)
energy1
152.05669 8.43 27 (5.5611)
440.17172 100.00 32 34 33 21 278 (49.875 11.945 4.066 0.077699 3.9457e-05)
458.18228 18.94 20 35 66 87 101 43 57 86 79 98 82 51 63 100 102 47 109 52 104 97 105 50 45 106 (11.585 0.17303 0.1547 0.14611 0.056913 0.046473 0.042647 0.042616 0.041719 0.040293 0.038753 0.028745 0.024277 0.020336 0.0099003 0.0080083 0.007762 0.0053768 0.0033236 0.0032536 0.0028413 0.0028293 0.0026996 0.0023132)
energy2
47.04914 5.13 221 (1.0003)
57.03349 24.29 12 (4.7371)
59.04914 6.10 11 (1.19)
73.02841 6.91 213 (1.3474)
91.03897 7.20 84 (1.4037)
105.06988 4.69 288 (0.91533)
144.06552 4.79 197 (0.9333)
150.04104 19.88 26 (3.877)
152.05669 9.79 27 (1.9093)
250.09347 8.92 140 142 118 (0.78881 0.62338 0.32761)
265.12231 4.25 77 (0.82901)
267.13796 4.09 78 (0.79671)
291.13796 8.30 131 133 132 (0.77313 0.71339 0.13149)
307.13287 6.33 24 (1.2348)
309.14852 6.74 23 134 (1.2642 0.050459)
328.10403 6.86 307 (1.3388)
368.15059 21.27 85 (4.1492)
370.13572 5.67 267 (1.1062)
382.15098 6.32 294 (1.2327)
398.16115 17.49 72 89 (2.1511 1.2604)
428.17172 5.47 69 68 40 (0.68235 0.35818 0.026575)
440.17172 27.45 33 32 21 34 278 (2.3733 1.8932 0.44867 0.34719 0.29205)
441.15573 4.98 56 36 49 64 (0.80923 0.11579 0.024516 0.020763)
442.15098 4.27 31 30 61 (0.59795 0.17387 0.060105)
458.18228 100.00 57 20 87 66 35 82 79 86 63 47 52 101 43 50 102 98 45 106 51 109 105 104 100 97 (6.1492 2.8526 2.4659 1.8471 1.373 0.70111 0.51865 0.40541 0.38358 0.36044 0.35219 0.33136 0.23359 0.22281 0.19852 0.18648 0.18437 0.12858 0.1263 0.11999 0.1072 0.097576 0.079728 0.077429)
468.20302 6.64 277 (1.2943)
482.18228 5.17 265 210 215 (0.6473 0.34795 0.01341)
484.19793 11.92 207 266 162 (2.0848 0.221 0.018013)
518.23980 3.97 202 251 (0.5146 0.25875)
546.23471 7.97 174 248 116 219 249 (0.94461 0.22692 0.19814 0.14954 0.034751)

0 574.2296247841 Cc1c(C)c2c3c(ccc2c2ccccc12)C(O)C(O)C(O)C3[NH2+]c1nc2c(ncn2C2CC(O)C(CO)O2)c(=O)[nH]1
1 556.2190601001 CC1C2=C3C(=[NH+]C4=NC=C5N=CN(C6C=C(O)C(=C=O)O6)C5=N4)C(O)=C(O)C(O)=C3CC=C2C2CCCCC2C1C
2 442.1873660481 CC1=C(C)C2=C3C(=[NH+]C4=NC=C5N=CNC5=N4)C(O)=C(O)C(O)=C3CC=C2C2=C1CCCC2
3 119.0702706321 OC1CCOC1C[OH2+]
4 119.0702706321 O=CCC(O)CC[OH2+] Intermediate Fragment 
5 117.0546205681 OC1CCOC1=C[OH2+]
6 89.0597059481 [OH2+]C1CCOC1
7 99.0440558841 C=C1OCC=C1[OH2+]
8 99.0440558841 [OH+]=C=C1CCCO1
9 117.0546205681 CCC(O)C(=O)C=[OH+] Intermediate Fragment 
10 99.0440558841 CC=C(O)C#C[OH2+]
11 59.0491412641 CC=C[OH2+]
12 57.0334912001 CC#C[OH2+]
13 61.0284058201 OCC=[OH+]
14 117.0546205681 O=CCC(O)C=C[OH2+] Intermediate Fragment 
15 89.0597059481 CC(O)C=C[OH2+]
16 117.0546205681 OCCCOC#C[OH2+] Intermediate Fragment 
17 117.0546205681 CCOC(=C=[OH+])CO Intermediate Fragment 
18 115.0389705041 OC1CCOC1=C=[OH+]
19 456.1666306041 CC1=C(C)C2=C3C(=[NH+]C4=NC(O)=C5N=CNC5=N4)C(O)=C(O)C(O)=C3CC=C2C2=C1C=CCC2
20 458.1822806681 CC1=C(C)C2=C3C(=[NH+]C4=NC(O)=C5N=CNC5=N4)C(O)=C(O)C(O)=C3CC=C2C2=C1CCCC2
21 440.1717159841 CC1=C(C)C2=C3C(=[NH+]C4=NC=C5N=CNC5=N4)C(O)=C(O)C(O)=C3CC=C2C2=C1C=CCC2
22 324.1594199841 CC1=C(C)C2=C3C(=[NH2+])C(O)=C(O)C(O)C3CC=C2C2=C1C=CCC2
23 309.1485209521 CC1=C(C)C2=C(C=CC3=C2C=C(O)C(O)C3[OH2+])C2=C1C=CCC2
24 307.1328708881 CC1=C(C)C2=C(C=CC3=C2C=C(O)C(O)C3[OH2+])C2=C1C=CC=C2
25 305.1172208241 CC1=C(C)C2=C(C=CC3=C2C=C(O)C(O)C3=[OH+])C2=C1C=CC=C2
26 150.0410361681 [NH3+]C1=NC(=O)C2=NC=NC2=N1
27 152.0566862321 [NH3+]C1=NC(=O)C2=NCNC2=N1
28 154.0723362961 [NH3+]C1=NC(=O)C2NCNC2=N1
29 156.0879863601 [NH3+]C1=NC(O)C2NCNC2=N1
30 442.1509805401 CC1=CC2=C3C(=[NH+]C4=NC(O)=C5N=CNC5=N4)C(O)=C(O)C(O)=C3CC=C2C2=C1C=CCC2
31 442.1509805401 CC1=CC2=C(CCC=C2)C2=CCC3=C(O)C(O)=C(O)C(=[NH+]C4=NC(O)=C5N=CNC5=N4)C3=C12
32 440.1717159841 CC1=C(C)C2=C3C(=CC(O)=C(O)C3=[NH+]C3=NC(O)=C4N=CNC4=N3)CC=C2C2=C1C=CCC2
33 440.1717159841 CC1=C(C)C2=C3C(=[NH+]C4=NC(O)=C5N=CNC5=N4)C(O)=CC(O)=C3CC=C2C2=C1C=CCC2
34 440.1717159841 CC1=C(C)C2=C3C(=[NH+]C4=NC(O)=C5N=CNC5=N4)C=C(O)C(O)=C3CC=C2C2=C1C=CCC2
35 458.1822806681 CC1=C(C)C2=C3C(=[NH+]C(=N)N=C4NC=NC4=C=O)C(O)=C(O)C(O)=C3CC=C2C2=C1CCCC2 Intermediate Fragment 
36 441.1557315721 CC1=C(C)C2=C(C=CC3=C2C(N=C=[NH+]C2=C(C=O)N=CN2)=C(O)C(O)=C3O)C2=C1C=CCC2
37 349.1546689521 CC1=C(C)C2=C3C(=NC#[NH+])C(O)=C(O)C(O)=C3CC=C2C2=C1CCCC2
38 351.1703190161 CC1C2=C(CCCC2)C2=CCC3=C(O)C(O)=C(O)C(=NC#[NH+])C3=C2C1C
39 364.1655679841 CC1=C(C)C2=C3C(=NC(N)=[NH2+])C(O)=C(O)C(O)C3CC=C2C2=C1C=CC=C2
40 428.1717159841 CC1=C(C)C2=C3C(=NC(=[NH2+])N=C4C=NC=N4)C(O)=C(O)C(O)=C3CC=C2C2=C1C=CCC2
41 430.1873660481 CC1=C(C)C2=C3C(=NC(=[NH2+])N=C4C=NC=N4)C(O)=C(O)C(O)=C3CC=C2C2=C1CCCC2
42 456.1666306041 CC1=C(C)C2=C3C(=NC(=[NH2+])N=C4NC=NC4=C=O)C(O)=C(O)C(O)=C3CC=C2C2=C1C=CCC2
43 458.1822806681 CC1=C(C)C2=C3C(=[NH+]C(N=C4C=NC=N4)=NC=O)C(O)=C(O)C(O)=C3CC=C2C2=C1CCCC2 Intermediate Fragment 
44 413.1608169521 CC1=C(C)C2=C(C=CC3=C2C(N=C=[NH+]C2=CN=CN2)=C(O)C(O)=C3O)C2=C1C=CCC2
45 458.1822806681 CC1=C(C)C2=C3C(=[NH+]C(N)=NC(=O)C4=CNC=N4)C(O)=C(O)C(O)=C3CC=C2C2=C1C=CCC2 Intermediate Fragment 
46 456.1666306041 CC1=C(C)C2=C3C(=NC(N)=[NH+]C(=O)C4=CNC=N4)C(O)=C(O)C(O)=C3CC=C2C2=C1C=CC=C2
47 458.1822806681 CC1=C(C)C2=C(C=CC3=C2C([NH+]=C=NC(O)=C2N=CNC2=N)=C(O)C(O)=C3O)C2=C1CCCC2 Intermediate Fragment 
48 334.1437699201 C=[NH+]C1=C(O)C(O)=C(O)C2=C1C1=C(C=C2)C2=C(C=CCC2)C(C)=C1C
49 441.1557315721 CC1=C(C)C2=C(C=CC3=C2C(N=C=[NH+]C(=O)C2=CNC=N2)=C(O)C(O)=C3O)C2=C1C=CCC2
50 458.1822806681 CC1=C(C)C2=C(C=CC3=C2C([NH+]=C=NC2=C(C(N)=O)N=CN2)=C(O)C(O)=C3O)C2=C1CCCC2 Intermediate Fragment 
51 458.1822806681 CC1=C(C)C2=C3C(=[NH+]C4=NC(O)=CC(N=C=N)=N4)C(O)=C(O)C(O)=C3CC=C2C2=C1CCCC2 Intermediate Fragment 
52 458.1822806681 CC1=C(C)C2=C3C(=[NH+]C4=NC(O)=C(N=C=N)C=N4)C(O)=C(O)C(O)=C3CC=C2C2=C1CCCC2 Intermediate Fragment 
53 414.1448325401 CC1=C(C)C2=C3C(=[NH+]C4=NC(O)=CC=N4)C(O)=C(O)C(O)=C3CC=C2C2=C1C=CC=C2
54 416.1604826041 CC1=C(C)C2=C3C(=[NH+]C4=NC(O)=CC=N4)C(O)=C(O)C(O)=C3CC=C2C2=C1C=CCC2
55 431.1713816361 CC1=C(C)C2=C3C(=NC4=NC(O)=C([NH3+])C=N4)C(O)=C(O)C(O)=C3CC=C2C2=C1C=CCC2
56 441.1557315721 C=[NH+]C1=C(O)N=C(N=C2C(O)=C(O)C(O)=C3CC=C4C5=C(C=CC=C5)C(C)=C(C)C4=C23)N=C1
57 458.1822806681 C=NC1=C(O)N=C([NH+]=C2C(O)=C(O)C(O)=C3CC=C4C5=C(C=CCC5)C(C)=C(C)C4=C23)N=C1N Intermediate Fragment 
58 427.1400815081 [CH2+]C1=C(C)C2=C(C=CC=C2)C2=CCC3=C(O)C(O)=C(O)C(=NC4=NC(O)=CC(N)=N4)C3=C21
59 429.1557315721 CC1=C(C)C2=C3C(=NC4=NC(O)=CC([NH3+])=N4)C(O)=C(O)C(O)=C3CC=C2C2=C1C=CC=C2
60 431.1713816361 CC1=C(C)C2=C3C(=NC4=NC(O)=CC([NH3+])=N4)C(O)=C(O)C(O)=C3CC=C2C2=C1C=CCC2
61 442.1509805401 [CH2+]C1=C(C)C2=C(C=CC=C2)C2=CCC3=C(O)C(O)=C(O)C(=NC4=NC(O)=C(N)C(N)=N4)C3=C21
62 456.1666306041 C=[NH+]C1=C(O)N=C(N=C2C(O)=C(O)C(O)=C3CC=C4C5=C(C=CC=C5)C(C)=C(C)C4=C23)N=C1N
63 458.1822806681 C=NC1=NC([NH+]=C2C(O)=C(O)C(O)=C3CC=C4C5=C(C=CCC5)C(C)=C(C)C4=C23)=NC(O)=C1N Intermediate Fragment 
64 441.1557315721 C=[NH+]C1=NC(N=C2C(O)=C(O)C(O)=C3CC=C4C5=C(C=CC=C5)C(C)=C(C)C4=C23)=NC(O)=C1
65 427.1400815081 [CH2+]C1=C(C)C2=C(C=CC=C2)C2=CCC3=C(O)C(O)=C(O)C(=NC4=NC(O)=C(N)C=N4)C3=C21
66 458.1822806681 CC1=C(C)C2=C(C=CC(C(O)=CO)=C2C(CO)=[NH+]C2=NC(O)=C3N=CNC3=N2)C2=C1C=CCC2 Intermediate Fragment 
67 426.1560659201 CC1=C(C)C2=C(C=CC(C(O)=CO)=C2C=[NH+]C2=NC(O)=C3N=CNC3=N2)C2=C1C=CC=C2
68 428.1717159841 CC1=C(C)C2=C(C=CC(C(O)=CO)=C2C=[NH+]C2=NC(O)=C3N=CNC3=N2)C2=C1C=CCC2
69 428.1717159841 CC1=C(C)C2=C(C(CO)=[NH+]C3=NC(O)=C4N=CNC4=N3)C(=CO)CC=C2C2=C1C=CC=C2
70 402.1924514281 CC1=C(C)C2=C(C=CC=C2C(CO)=[NH+]C2=NC(O)=C3N=CNC3=N2)C2=C1CCCC2
71 400.1768013641 CC1=C(C)C2=C(C=CC=C2C(CO)=[NH+]C2=NC(O)=C3N=CNC3=N2)C2=C1C=CCC2
72 398.1611513001 CC1=C(C)C2=C(C=CC=C2C(CO)=[NH+]C2=NC(O)=C3N=CNC3=N2)C2=C1C=CC=C2
73 396.1455012361 CC1=C(C)C2=C(C=CC=C2C(C=O)=[NH+]C2=NC(O)=C3N=CNC3=N2)C2=C1C=CC=C2
74 63.0440558841 OCC[OH2+]
75 194.0672509161 O=C1N=C([NH2+]CCO)N=C2N=CN=C12
76 192.0516008521 O=C1N=C([NH+]=CCO)N=C2N=CN=C12
77 265.1223062041 C=C1C(=C)C2=C(CCC=C2)C2=C1C=C(C([OH2+])=CO)C=C2
78 267.1379562681 C=C1C(=C)C2=C(CCCC2)C2=C1C=C(C([OH2+])=CO)C=C2
79 458.1822806681 CC1=C(C)C2=C(C(=[NH+]C3=NC(O)=C4N=CNC4=N3)C(O)=CO)C(=CO)CC=C2C2=C1C=CCC2 Intermediate Fragment 
80 235.1117415201 C=C1C(=C)C2=C(C=CC=C2)C2=CCC(=C[OH2+])C=C12
81 237.1273915841 C=C1C(=C)C2=C(CCC=C2)C2=CCC(=C[OH2+])C=C12
82 458.1822806681 CC1=C(C)C2=C(C=CC=C2C(=[NH+]C2=NC(O)=C3N=CNC3=N2)C(O)=C(O)CO)C2=C1C=CCC2 Intermediate Fragment 
83 93.0546205681 OCC(O)C[OH2+]
84 91.0389705041 OC=C(O)C[OH2+]
85 368.1505866161 CC1=C(C)C2=C(C=CC=C2C=[NH+]C2=NC(O)=C3N=CNC3=N2)C2=C1C=CC=C2
86 458.1822806681 CC1=C(C)C2=C(CCCC2)C2=C1C=C(C(O)=C(O)C(O)=C=[NH+]C1=NC(O)=C3N=CNC3=N1)C=C2 Intermediate Fragment 
87 458.1822806681 CC1=C(C)C2=C(C=[NH+]C3=NC(O)=C4N=CNC4=N3)C(=C(O)C(O)=CO)CC=C2C2=C1C=CCC2 Intermediate Fragment 
88 430.1873660481 CC1=C(C)C2=C(C=CC(C(O)=CO)=C2C=[NH+]C2=NC(O)=C3N=CNC3=N2)C2=C1CCCC2
89 398.1611513001 CC1=C(C)C2=C(C=[NH+]C3=NC(O)=C4N=CNC4=N3)C(=CO)CC=C2C2=C1C=CC=C2
90 396.1455012361 CC1=C(C)C2=C(C=[NH+]C3=NC(O)=C4N=CNC4=N3)C(=C=O)CC=C2C2=C1C=CC=C2
91 59.0127557561 O=C=C[OH2+]
92 374.1975368081 CC1C2=C(CCCC2)C2=C(C(C=[NH+]C3=NC(O)=C4N=CNC4=N3)=CC=C2)C1C
93 372.1818867441 CC1=C(C)C2=C(C=CC=C2C=[NH+]C2=NC(O)=C3N=CNC3=N2)C2=C1CCCC2
94 370.1662366801 CC1=C(C)C2=C(C=CC=C2C=[NH+]C2=NC(O)=C3N=CNC3=N2)C2=C1C=CCC2
95 366.1349365521 CC1=C(C)C2=C(C=CC=C2C#[N+]C2=NC(O)=C3N=CNC3=N2)C2=C1C=CC=C2
96 89.0233204401 OC=C(O)C=[OH+]
97 458.1822806681 CC1=C(C)C2=C(CCC=C2)C(C=CC2=C(O)C(O)=C(O)C(=[NH+]C3=NC(O)=C4N=CNC4=N3)C2)=C1 Intermediate Fragment 
98 458.1822806681 C#CC1=C2C(=[NH+]C3=NC(O)=C4N=CNC4=N3)C(O)=C(O)C(O)=C2CC=C1C1=C(CC)CCCC1 Intermediate Fragment 
99 430.1509805401 C#CC1=C2C(=[NH+]C3=NC(O)=C4N=CNC4=N3)C(O)=C(O)C(O)=C2CC=C1C1=CCCCC1
100 458.1822806681 C=C=C(C)C1=C(C2=CCC3=C(O)C(O)=C(O)C(=[NH+]C4=NC(O)=C5N=CNC5=N4)C3=C2)CCCC1 Intermediate Fragment 
101 458.1822806681 CC(C1=CCCC=C1)=C(C)C1=C2C(=[NH+]C3=NC(O)=C4N=CNC4=N3)C(O)=C(O)C(O)=C2CC=C1 Intermediate Fragment 
102 458.1822806681 C=CCC1=C(C)C(C)=C(C)C2=C3C(=[NH+]C4=NC(O)=C5N=CNC5=N4)C(O)=C(O)C(O)=C3CC=C12 Intermediate Fragment 
103 430.1509805401 C=C1C(=C)C2=C3C(=[NH+]C4=NC(O)=C5N=CNC5=N4)C(O)=C(O)C(O)=C3CC=C2C(C)=C1C
104 458.1822806681 C=CC1=C(CC)C2=CCC3=C(O)C(O)=C(O)C(=[NH+]C4=NC(O)=C5N=CNC5=N4)C3=C2C(C)=C1C Intermediate Fragment 
105 458.1822806681 CC=CC1=C(C)C2=CCC3=C(O)C(O)=C(O)C(=[NH+]C4=NC(O)=C5N=CNC5=N4)C3=C2C(C)=C1C Intermediate Fragment 
106 458.1822806681 CCC=CC1=CC2=CCC3=C(O)C(O)=C(O)C(=[NH+]C4=NC(O)=C5N=CNC5=N4)C3=C2C(C)=C1C Intermediate Fragment 
107 416.1353304761 C=C1C(=C)C2=C3C(=[NH+]C4=NC(O)=C5N=CNC5=N4)C(O)=C(O)C(O)=C3CC=C2C=C1C
108 418.1509805401 C=C1C2=C3C(=[NH+]C4=NC(O)=C5N=CNC5=N4)C(O)=C(O)C(O)=C3CC=C2C=C(C)C1C
109 458.1822806681 C=CCCC1=CC(C)=C(C)C2=C3C(=[NH+]C4=NC(O)=C5N=CNC5=N4)C(O)=C(O)C(O)=C3CC=C12 Intermediate Fragment 
110 460.1979307321 CC1C2=C(CCCC2)C2=CCC3=C(O)C(O)=C(O)C(=[NH+]C4=NC(O)=C5N=CNC5=N4)C3=C2C1C
111 462.2135807961 CC1C2=C3C(=[NH+]C4=NC(O)=C5N=CNC5=N4)C(O)=C(O)C(O)=C3CC=C2C2CCCCC2C1C
112 464.2292308601 CC1C2=C3C(=[NH+]C4=NC(O)=C5N=CNC5=N4)C(O)=C(O)C(O)=C3CCC2C2CCCCC2C1C
113 446.2186661761 CC1C2=C3C(=CC(O)=C(O)C3=[NH+]C3=NC(O)=C4N=CNC4=N3)CC=C2C2CCCCC2C1C
114 542.2034100361 CC1=C(C)C2=C3C(=[NH+]C4=NC(O)=C5N=CN(C6CC(O)=CO6)C5=N4)C(O)=C(O)C(O)=C3CC=C2C2=C1CCCC2
115 544.2190601001 CC1C2=C(CCCC2)C2=CCC3=C(O)C(O)=C(O)C(=[NH+]C4=NC(O)=C5N=CN(C6CC(O)=CO6)C5=N4)C3=C2C1C
116 546.2347101641 CC1C2=C3C(=[NH+]C4=NC(O)=C5N=CN(C6CC(O)=CO6)C5=N4)C(O)=C(O)C(O)=C3CC=C2C2CCCCC2C1C
117 556.2190601001 C=C1OC(N2C=NC3=C(O)N=C([NH+]=C4C(O)=C(O)C(O)=C5CC=C6C7=C(CCCC7)C(C)C(C)C6=C45)N=C32)C=C1O
118 250.0934656641 C=C1OC(N2C=NC3=C(O)N=C([NH3+])N=C32)CC1O
119 252.1091157281 CC1OC(N2C=NC3=C(O)N=C([NH3+])N=C32)CC1O
120 538.2084954161 C=C1OC(N2C=NC3=C(O)N=C([NH+]=C4C(O)=C(O)C=C5CC=C6C7=C(CCCC7)C(C)=C(C)C6=C54)N=C32)C=C1O
121 556.2190601001 CC(=O)C(O)=CCN1C=NC2=C(O)N=C([NH+]=C3C(O)=C(O)C(O)=C4CC=C5C6=C(CCCC6)C(C)=C(C)C5=C34)N=C21 Intermediate Fragment 
122 556.2190601001 C=C(C=O)OC(C)N1C=NC2=C(O)N=C([NH+]=C3C(O)=C(O)C(O)=C4CC=C5C6=C(CCCC6)C(C)=C(C)C5=C34)N=C21 Intermediate Fragment 
123 556.2190601001 C#COC(C=C=O)N1C=NC2=C(O)N=C([NH+]=C3C(O)=C(O)C(O)=C4CC=C5C(=C34)C(C)C(C)C3CCCCC53)N=C21 Intermediate Fragment 
124 556.2190601001 C=C1OC(N2C=NC3=C(O)N=C([NH+]=CC4=C5C(=CCC4=C(O)C(O)=CO)C4=C(CCCC4)C(C)=C5C)N=C32)C=C1O Intermediate Fragment 
125 326.1750700481 CC1=C(C)C2=C3C(=[NH2+])C(O)=C(O)C(O)C3CC=C2C2=C1CCCC2
126 306.1488553001 CC1=C(C)C2=C3C(=[NH2+])C(O)=C(O)C=C3CC=C2C2=C1C=CCC2
127 324.1594199841 CC1=C(C)C2=C(C#[NH+])C(=C(O)C(O)=CO)CC=C2C2=C1CCCC2 Intermediate Fragment 
128 315.1954711441 CC1C2=C(C=CC3=C2C=C(O)C(O)C3[OH2+])C2CCCCC2C1C
129 313.1798210801 CC1C2=C(CCCC2)C2=C(C3=C(C=C2)C([OH2+])C(O)C(O)=C3)C1C
130 311.1641710161 CC1=C(C)C2=C(C=CC3=C2C=C(O)C(O)C3[OH2+])C2=C1CCCC2
131 291.1379562681 CC1=C(C)C2=C(C=CC3=C2C=C(O)C([OH2+])=C3)C2=C1C=CCC2
132 291.1379562681 CC1=C(C)C2=C(C=CC3=C2C=C(O)C=C3[OH2+])C2=C1C=CCC2
133 291.1379562681 CC1=C(C)C2=C(C=CC3=C2C=CC(O)=C3[OH2+])C2=C1C=CCC2
134 309.1485209521 CC1=C(C)C2=C(C=CC(C([OH2+])=CO)=C2C=CO)C2=C1C=CCC2 Intermediate Fragment 
135 289.1223062041 CC1=C(C)C2=C(C=CC3=C2C=C(O)C([OH2+])=C3)C2=C1C=CC=C2
136 260.0414300921 [NH3+]C1=NC(O)=C2N=CN(C3=CC(=O)C(=C=O)O3)C2=N1
137 264.0727302201 [NH3+]C1=NC(O)=C2N=CN(C3CC(O)C(=C=O)O3)C2=N1
138 266.0883802841 [NH3+]C1=NC(O)=C2N=CN(C3CC(O)C(=CO)O3)C2=N1
139 268.1040303481 [NH3+]C1=NC(O)=C2N=CN(C3CC(O)C(CO)O3)C2=N1
140 250.0934656641 [NH3+]C1=NC(O)=C2N=CN(C3CCC(=CO)O3)C2=N1
141 268.1040303481 [NH3+]C1=NC(O)=C2N=CN(C(=O)CC(O)CCO)C2=N1 Intermediate Fragment 
142 250.0934656641 [NH3+]C1=NC(O)=C2N=CN(CCC(O)C#CO)C2=N1
143 75.0440558841 OCC=C[OH2+]
144 266.0883802841 [NH3+]C1=NC(O)=C2N=CN(C(=O)CC(O)C=CO)C2=N1
145 270.1196804121 [NH3+]C1=NC(O)=C2NCN(C3CC(O)C(CO)O3)C2=N1
146 272.1353304761 [NH3+]C1=NC(O)C2NCN(C3CC(O)C(CO)O3)C2=N1
147 558.1983246561 CC1CC2CCCCC2C2=CCC3=C(O)C(O)=C(O)C(=[NH+]C4=NC(O)=C5N=CN(C6C=C(O)C(=C=O)O6)C5=N4)C3=C21
148 556.2190601001 CC1C2=C3C(=CC(O)=C(O)C3=[NH+]C3=NC(O)=C4N=CN(C5C=C(O)C(=C=O)O5)C4=N3)CC=C2C2CCCCC2C1C
149 438.1560659201 CC1=C(C)C2=C3C(=CC(O)=C(O)C3=[NH+]C3=NC(O)=C4N=CNC4=N3)CC=C2C2=C1C=CC=C2
150 442.1873660481 CC1=C(C)C2=C3C(=CC(O)=C(O)C3=[NH+]C3=NC(O)=C4N=CNC4=N3)CC=C2C2=C1CCCC2
151 526.2084954161 CC1=C(C)C2=C3C(=CC(O)=C(O)C3=[NH+]C3=NC(O)=C4N=CN(C5CC(O)=CO5)C4=N3)CC=C2C2=C1CCCC2
152 538.2084954161 CC1C2=C(CCCC2)C2=CCC3=CC(O)=C(O)C(=[NH+]C4=NC(O)=C5N=CN(C6C=CC(=C=O)O6)C5=N4)C3=C2C1C
153 308.1645053641 CC1=C(C)C2=C3C(=[NH2+])C(O)C(O)C=C3CC=C2C2=C1C=CCC2
154 293.1536063321 C=C1C2=C(C=CC3=C2C=C(O)C([OH2+])=C3)C2=C(CCCC2)C1C
155 538.2084954161 CC1C2=C(CCCC2)C2=CCC3=CC=C(O)C(=[NH+]C4=NC(O)=C5N=CN(C6C=C(O)C(=C=O)O6)C5=N4)C3=C2C1C
156 556.2190601001 CC1C2=C3C(=CC(O)=C(O)C3=[NH+]C(=N)N=C3C(=C=O)N=CN3C3C=C(O)C(=C=O)O3)CC=C2C2CCCCC2C1C Intermediate Fragment 
157 556.2190601001 CC1C2=C(CCCC2)C2=CCC3=CC(O)=C(O)C(=[NH+]C4=NC(O)=C5N=CN(CC=C(O)C(=O)C=O)C5=N4)C3=C2C1C Intermediate Fragment 
158 538.2084954161 CC1=C(C)C2=C3C(=CC(O)=C(O)C3=[NH+]C3=NC(O)=C4N=CN(CC=C(O)C#CO)C4=N3)CC=C2C2=C1CCCC2
159 498.2135807961 CC1C2=C(CCCC2)C2=CCC3=CC(O)=C(O)C(=[NH+]C4=NC(O)=C5N=CN(CC#CO)C5=N4)C3=C2C1C
160 496.1979307321 CC1=C(C)C2=C3C(=CC(O)=C(O)C3=[NH+]C3=NC(O)=C4N=CN(CC#CO)C4=N3)CC=C2C2=C1CCCC2
161 556.2190601001 CC1C2=C(CCCC2)C2=CCC3=CC(O)=C(O)C(=[NH+]C4=NC(O)=C5N=CN(C(C)OC(=C=O)C=O)C5=N4)C3=C2C1C Intermediate Fragment 
162 484.1979307321 CC(=O)N1C=NC2=C(O)N=C([NH+]=C3C(O)=C(O)C=C4CC=C5C6=C(CCCC6)C(C)=C(C)C5=C43)N=C21
163 556.2190601001 CC1C2=C3C(=CC(O)=C(O)C3=[NH+]C3=NC(O)=C4N=CN(C(C=C=O)OC#CO)C4=N3)CC=C2C2CCCCC2C1C Intermediate Fragment 
164 556.2190601001 CC1C2=C3C(=CC(O)=C(O)C3=[NH+]C3=NC(O)=C4N=CN(C(=O)C=C(O)C#CO)C4=N3)CC=C2C2CCCCC2C1C Intermediate Fragment 
165 556.2190601001 CC1C2=C(CCCC2)C2=CCC(=C=CO)C(C(CO)=[NH+]C3=NC(O)=C4N=CN(C5C=C(O)C(=C=O)O5)C4=N3)=C2C1C Intermediate Fragment 
166 556.2190601001 CC(O)=C(O)C(=[NH+]C1=NC(O)=C2N=CN(C3C=C(O)C(=C=O)O3)C2=N1)C1=CC=CC2=C1C(C)C(C)C1=C2CCCC1 Intermediate Fragment 
167 556.2190601001 CC1C2=CC(=C=C(O)C(O)=C=[NH+]C3=NC(O)=C4N=CN(C5C=C(O)C(=C=O)O5)C4=N3)CC=C2C2CCCCC2C1C Intermediate Fragment 
168 556.2190601001 CC(C1=CCCCC1)C(C)C1=C2C(=CC(O)=C(O)C2=[NH+]C2=NC(O)=C3N=CN(C4C=C(O)C(=C=O)O4)C3=N2)CC=C1 Intermediate Fragment 
169 556.2190601001 CC1C2=C3C(=[NH+]C4=NC(O)=C5N=CN(C6C=C(O)C(=C=O)O6)C5=N4)C(O)=CC(O)=C3CC=C2C2CCCCC2C1C
170 442.1873660481 CC1=C(C)C2=C3C(=[NH+]C4=NC(O)=C5N=CNC5=N4)C(O)=CC(O)=C3CC=C2C2=C1CCCC2
171 556.2190601001 CC1C2=C3C(=[NH+]C4=NC(O)=C5N=CN(C6C=C(O)C(=C=O)O6)C5=N4)C=C(O)C(O)=C3CC=C2C2CCCCC2C1C
172 442.1873660481 CC1=C(C)C2=C3C(=[NH+]C4=NC(O)=C5N=CNC5=N4)C=C(O)C(O)=C3CC=C2C2=C1CCCC2
173 574.2296247841 CC1C2=C3C(=[NH+]C(=N)N=C4C(=C=O)N=CN4C4C=C(O)C(=C=O)O4)C(O)=C(O)C(O)=C3CCC2C2CCCCC2C1C Intermediate Fragment 
174 546.2347101641 CC1C2=C3C(=NC(=[NH2+])N=C4C=NCN4C4C=C(O)C(=C=O)O4)C(O)=C(O)C(O)=C3CC=C2C2CCCCC2C1C
175 574.2296247841 CC1C2=C3C(=[NH+]C(=NC=O)N=C4C=NCN4C4C=C(O)C(=C=O)O4)C(O)=C(O)C(O)=C3CC=C2C2CCCCC2C1C Intermediate Fragment 
176 531.2238111321 CC1C2=C(CCC3=C2C(N=C=[NH+]C2=CN=CN2C2C=C(O)C(=C=O)O2)=C(O)C(O)=C3O)C2CCCCC2C1C
177 415.1764670161 CC1=C(C)C2=C(C=CC3=C2C(N=C=[NH+]C2=CN=CN2)=C(O)C(O)=C3O)C2=C1CCCC2
178 531.2238111321 CC1C2=C(CCC3=C2C(N=C=[NH+]C2=CN=CN2C(=O)C=C(O)C#CO)=C(O)C(O)=C3O)C2CCCCC2C1C Intermediate Fragment 
179 529.2081610681 CC1C2=C(C=CC3=C2C(N=C=[NH+]C2=CN=CN2C2C=C(O)C(=C=O)O2)=C(O)C(O)=C3O)C2CCCCC2C1C
180 527.1925110041 CC1C2=C(CCCC2)C2=C(C3=C(C=C2)C(O)=C(O)C(O)=C3N=C=[NH+]C2=CN=CN2C2C=C(O)C(=C=O)O2)C1C
181 183.0764186321 OC1CC(N2C=CN=C2)OC1=C[OH2+]
182 181.0607685681 OC1CC(N2C=CN=C2)OC1=C=[OH+]
183 544.2190601001 CC1C2=C(CCCC2)C2=CCC3=C(O)C(O)=C(O)C(=NC(=[NH2+])N=C4C=NCN4C4C=C(O)C(=C=O)O4)C3=C2C1C
184 574.2296247841 CC1C2=C3C(=[NH+]C(N)=NC(=O)C4=CN(C5C=C(O)C(=C=O)O5)C=N4)C(O)=C(O)C(O)=C3CC=C2C2CCCCC2C1C Intermediate Fragment 
185 574.2296247841 CC1C2=C(CCC3=C2C([NH+]=C=NC(O)=C2N=CN(C4C=C(O)C(=C=O)O4)C2=N)=C(O)C(O)=C3O)C2CCCCC2C1C Intermediate Fragment 
186 336.1594199841 C=[NH+]C1=C(O)C(O)=C(O)C2=C1C1=C(C=C2)C2=C(CCCC2)C(C)=C1C
187 224.0665822201 [NH2+]=C1C(=C=O)N=CN1C1CC(O)C(=CO)O1
188 574.2296247841 CC1C2=C3C(=[NH+]C4=NC(O)=CC(N(C=N)C5C=C(O)C(=C=O)O5)=N4)C(O)=C(O)C(O)=C3CC=C2C2CCCCC2C1C Intermediate Fragment 
189 557.2030756881 CC1=C(C)C2=C3C(=NC4=NC(O)=CC([NH+](C)C5C=C(O)C(=C=O)O5)=N4)C(O)=C(O)C(O)=C3CC=C2C2=C1CCCC2
190 547.2187257521 CC1C2=C3C(=NC4=NC(O)=CC([NH+]=C5C=C(O)C(=C=O)O5)=N4)C(O)=C(O)C(O)=C3CCC2C2CCCCC2C1C
191 547.2187257521 CC1C2=C3C(=NC4=NC(O)=CC([NH+]=C(O)C=C(O)C#CO)=N4)C(O)=C(O)C(O)=C3CC=C2C2CCCCC2C1C Intermediate Fragment 
192 418.1761326681 CC1=C(C)C2=C3C(=[NH+]C4=NC(O)=CC=N4)C(O)=C(O)C(O)=C3CC=C2C2=C1CCCC2
193 159.0764186321 [NH+]#CNC1CC(O)C(CO)O1
194 142.0498695361 C=[NH+]C1CC(O)C(=C=O)O1
195 159.0764186321 [NH+]#CN=C(O)CC(O)CCO Intermediate Fragment 
196 161.0920686961 [NH2+]=CNC1CC(O)C(CO)O1
197 144.0655196001 C=[NH+]C1CC(O)C(=CO)O1
198 574.2296247841 CC1C2=C3C(=[NH+]C4=NC(O)=C(N=C=NC5C=C(O)C(=C=O)O5)C=N4)C(O)=C(O)C(O)=C3CCC2C2CCCCC2C1C Intermediate Fragment 
199 574.2296247841 C=NC1=C(O)N=C([NH+]=C2C(O)=C(O)C(O)=C3CCC4C(=C23)C(C)C(C)C2CCCCC42)N=C1N=C1C=C(O)C(=C=O)O1 Intermediate Fragment 
200 574.2296247841 CC1C2=C3C(=[NH+]C4=NC(O)=C5N=CN(CC=C(O)C(=O)C=O)C5=N4)C(O)=C(O)C(O)=C3CC=C2C2CCCCC2C1C Intermediate Fragment 
201 556.2190601001 CC1C2=C(CCCC2)C2=CCC3=C(O)C(O)=C(O)C(=[NH+]C4=NC(O)=C5N=CN(CC=C(O)C#CO)C5=N4)C3=C2C1C
202 518.2397955441 CC1C2=C3C(=[NH+]C4=NC(O)=C5N=CN(CC#CO)C5=N4)C(O)=C(O)C(O)=C3CCC2C2CCCCC2C1C
203 516.2241454801 CC1C2=C3C(=[NH+]C4=NC(O)=C5N=CN(CC#CO)C5=N4)C(O)=C(O)C(O)=C3CC=C2C2CCCCC2C1C
204 514.2084954161 CC1C2=C(CCCC2)C2=CCC3=C(O)C(O)=C(O)C(=[NH+]C4=NC(O)=C5N=CN(CC#CO)C5=N4)C3=C2C1C
205 514.2084954161 CC1=C(C)C2=C(C=[NH+]C3=NC(O)=C4N=CN(CC#CO)C4=N3)C(=C(O)C(O)=CO)CC=C2C2=C1CCCC2 Intermediate Fragment 
206 512.1928453521 CC1=C(C)C2=C3C(=[NH+]C4=NC(O)=C5N=CN(CC#CO)C5=N4)C(O)=C(O)C(O)=C3CC=C2C2=C1CCCC2
207 484.1979307321 CCN1C=NC2=C(O)N=C([NH+]=C3C(O)=C(O)C(O)=C4CC=C5C6=C(C=CCC6)C(C)=C(C)C5=C34)N=C21
208 494.1822806681 CC1=C(C)C2=C3C(=CC(O)=C(O)C3=[NH+]C3=NC(O)=C4N=CN(CC#CO)C4=N3)CC=C2C2=C1C=CCC2
209 486.2135807961 CCN1C=NC2=C(O)N=C([NH+]=C3C(O)=C(O)C(O)=C4CC=C5C6=C(CCCC6)C(C)=C(C)C5=C34)N=C21
210 482.1822806681 CCN1C=NC2=C(O)N=C([NH+]=C3C(O)=C(O)C(O)=C4CC=C5C6=C(C=CC=C6)C(C)=C(C)C5=C34)N=C21
211 574.2296247841 C=C(O)C(=C=O)OCN1C=NC2=C(O)N=C([NH+]=C3C(O)=C(O)C(O)=C4CC=C5C(=C34)C(C)C(C)C3CCCCC53)N=C21 Intermediate Fragment 
212 574.2296247841 CC1C2=C3C(=[NH+]C4=NC(O)=C5N=CN(C(C)OC(=C=O)C=O)C5=N4)C(O)=C(O)C(O)=C3CC=C2C2CCCCC2C1C Intermediate Fragment 
213 73.0284058201 OCC#C[OH2+]
214 500.1928453521 CC(=O)N1C=NC2=C(O)N=C([NH+]=C3C(O)=C(O)C(O)=C4CC=C5C6=C(CCCC6)C(C)=C(C)C5=C34)N=C21
215 482.1822806681 CC(=O)N1C=NC2=C(O)N=C([NH+]=C3C(O)=C(O)C=C4CC=C5C6=C(C=CCC6)C(C)=C(C)C5=C43)N=C21
216 502.2084954161 CC(=O)N1C=NC2=C(O)N=C([NH+]=C3C(O)=C(O)C(O)=C4CC=C5C6=C(CCCC6)C(C)C(C)C5=C34)N=C21
217 504.2241454801 CC(=O)N1C=NC2=C(O)N=C([NH+]=C3C(O)=C(O)C(O)=C4CC=C5C(=C34)C(C)C(C)C3CCCCC53)N=C21
218 506.2397955441 CC(=O)N1C=NC2=C(O)N=C([NH+]=C3C(O)=C(O)C(O)=C4CCC5C(=C34)C(C)C(C)C3CCCCC53)N=C21
219 546.2347101641 CC1C2=C3C(=[NH+]C4=NC(O)=C5N=CN(C(C)OC#CO)C5=N4)C(O)=C(O)C(O)=C3CC=C2C2CCCCC2C1C
220 574.2296247841 CC1C2=C3C(=[NH+]C4=NC(O)=C5N=CN(C(C=C=O)OC#CO)C5=N4)C(O)=C(O)C(O)=C3CCC2C2CCCCC2C1C Intermediate Fragment 
221 47.0491412641 CC[OH2+]
222 530.2034100361 CC1C2=C3C(=[NH+]C4=NC(O)=C5N=CN(C(=O)C#CO)C5=N4)C(O)=C(O)C(O)=C3CC=C2C2CCCCC2C1C
223 532.2190601001 CC1C2=C3C(=[NH+]C4=NC(O)=C5N=CN(C(=O)C#CO)C5=N4)C(O)=C(O)C(O)=C3CCC2C2CCCCC2C1C
224 532.2190601001 CC1C2=C3C(=[NH+]C4=NC(O)=C5N=CN(COC#CO)C5=N4)C(O)=C(O)C(O)=C3CC=C2C2CCCCC2C1C
225 530.2034100361 CC1C2=C(CCCC2)C2=CCC3=C(O)C(O)=C(O)C(=[NH+]C4=NC(O)=C5N=CN(COC#CO)C5=N4)C3=C2C1C
226 574.2296247841 CC1C2=C3C(=[NH+]C4=NC(O)=C5N=CN(C(=O)C=C(O)C#CO)C5=N4)C(O)=C(O)C(O)=C3CCC2C2CCCCC2C1C Intermediate Fragment 
227 528.1877599721 CC1C2=C(CCCC2)C2=CCC3=C(O)C(O)=C(O)C(=[NH+]C4=NC(O)=C5N=CN(C(=O)C#CO)C5=N4)C3=C2C1C
228 510.1771952881 CC1=C(C)C2=C3C(=CC(O)=C(O)C3=[NH+]C3=NC(O)=C4N=CN(C(=O)C#CO)C4=N3)CC=C2C2=C1CCCC2
229 45.0334912001 C=C[OH2+]
230 498.1771952881 CC(=O)N1C=NC2=C(O)N=C([NH+]=C3C(O)=C(O)C(O)=C4CC=C5C6=C(C=CCC6)C(C)=C(C)C5=C34)N=C21
231 68.9971056921 [O+]#CC#CO
232 71.0127557561 O=CC#C[OH2+]
233 43.0178411361 C#C[OH2+]
234 77.0597059481 OCCC[OH2+]
235 490.2084954161 CC1C2=C3C(=[NH+]C4=NC(O)=C5N=CN(C=O)C5=N4)C(O)=C(O)C(O)=C3CC=C2C2CCCCC2C1C
236 488.1928453521 CC1C2=C(CCCC2)C2=CCC3=C(O)C(O)=C(O)C(=[NH+]C4=NC(O)=C5N=CN(C=O)C5=N4)C3=C2C1C
237 470.1822806681 CC1=C(C)C2=C3C(=[NH+]C4=NC(O)=C5N=CN(C)C5=N4)C(O)=C(O)C(O)=C3CC=C2C2=C1C=CCC2
238 486.1771952881 CC1=C(C)C2=C3C(=[NH+]C4=NC(O)=C5N=CN(C=O)C5=N4)C(O)=C(O)C(O)=C3CC=C2C2=C1CCCC2
239 484.1615452241 CC1=C(C)C2=C3C(=[NH+]C4=NC(O)=C5N=CN(C=O)C5=N4)C(O)=C(O)C(O)=C3CC=C2C2=C1C=CCC2
240 87.0440558841 CC(O)C#C[OH2+]
241 71.0491412641 C#CC(C)[OH2+]
242 71.0491412641 CCC#C[OH2+]
243 91.0753560121 CC(O)CC[OH2+]
244 73.0647913281 C=CC(C)[OH2+]
245 574.2296247841 CC1C2=C(C=CC(C(O)=CO)=C2C(CO)=[NH+]C2=NC(O)=C3N=CN(C4C=C(O)C(=C=O)O4)C3=N2)C2CCCCC2C1C Intermediate Fragment 
246 544.2190601001 CC1C2=C(C=CC(C(O)=CO)=C2C=[NH+]C2=NC(O)=C3N=CN(C4C=C(O)C(=C=O)O4)C3=N2)C2CCCCC2C1C
247 544.2190601001 CC1C2=C(C=CC(C(O)=CO)=C2C=[NH+]C2=NC(O)=C3N=CN(C(=O)C=C(O)C#CO)C3=N2)C2CCCCC2C1C Intermediate Fragment 
248 546.2347101641 CC1C2=C(CCC(C(O)=CO)=C2C=[NH+]C2=NC(O)=C3N=CN(C4C=C(O)C(=C=O)O4)C3=N2)C2CCCCC2C1C
249 546.2347101641 CC1C2=C(C(CO)=[NH+]C3=NC(O)=C4N=CN(C5C=C(O)C(=C=O)O5)C4=N3)C(=CO)CC=C2C2CCCCC2C1C
250 544.2190601001 CC1C2=C(CCCC2)C2=CCC(=CO)C(C(CO)=[NH+]C3=NC(O)=C4N=CN(C5C=C(O)C(=C=O)O5)C4=N3)=C2C1C
251 518.2397955441 CC1C2=C(CCC=C2C(CO)=[NH+]C2=NC(O)=C3N=CN(C4C=C(O)C(=C=O)O4)C3=N2)C2CCCCC2C1C
252 516.2241454801 CC1C2=C(C=CC=C2C(CO)=[NH+]C2=NC(O)=C3N=CN(C4C=C(O)C(=C=O)O4)C3=N2)C2CCCCC2C1C
253 516.2241454801 CC1C2=C(C=CC=C2C(CO)=[NH+]C2=NC(O)=C3N=CN(C(=O)C=C(O)C#CO)C3=N2)C2CCCCC2C1C Intermediate Fragment 
254 514.2084954161 CC1C2=C(CCCC2)C2=C(C(C(CO)=[NH+]C3=NC(O)=C4N=CN(C5C=C(O)C(=C=O)O5)C4=N3)=CC=C2)C1C
255 514.2084954161 CC1C2=C(CCCC2)C2=C(C(C(CO)=[NH+]C3=NC(O)=C4N=CN(C(=O)C=C(O)C#CO)C4=N3)=CC=C2)C1C Intermediate Fragment 
256 512.1928453521 CC1=C(C)C2=C(C=CC=C2C(CO)=[NH+]C2=NC(O)=C3N=CN(C4C=C(O)C(=C=O)O4)C3=N2)C2=C1CCCC2
257 310.1145950321 OC=C1OC(N2C=NC3=C(O)N=C([NH2+]CCO)N=C32)CC1O
258 574.2296247841 CC1C2=C(C(=[NH+]C3=NC(O)=C4N=CN(C5C=C(O)C(=C=O)O5)C4=N3)C(O)=CO)C(=CO)CC=C2C2CCCCC2C1C Intermediate Fragment 
259 512.1928453521 CC1=C(C)C2=C(C=[NH+]C3=NC(O)=C4N=CN(C5C=C(O)C(=C=O)O5)C4=N3)C(=CO)CC=C2C2=C1CCCC2
260 514.2084954161 CC1C2=C(CCCC2)C2=CCC(=CO)C(C=[NH+]C3=NC(O)=C4N=CN(C5C=C(O)C(=C=O)O5)C4=N3)=C2C1C
261 544.2190601001 CC1C2=C(C=CC=C2C(=[NH+]C2=NC(O)=C3N=CN(C4C=C(O)C(=C=O)O4)C3=N2)C(O)=CO)C2CCCCC2C1C
262 340.1251597161 OC=C1OC(N2C=NC3=C(O)N=C([NH2+]CC(O)CO)N=C32)CC1O
263 207.1168269001 C=C1C(=[CH3+])C2=C(C=CC=C2)C2=C1C=CCC2
264 574.2296247841 CC1C2=C(C=CC=C2C(=[NH+]C2=NC(O)=C3N=CN(C4C=C(O)C(=C=O)O4)C3=N2)C(O)=C(O)CO)C2CCCCC2C1C Intermediate Fragment 
265 482.1822806681 CC1=C(C)C2=C(C=CC=C2C=[NH+]C2=NC(O)=C3N=CN(C4C=C(O)C(=C=O)O4)C3=N2)C2=C1CCCC2
266 484.1979307321 CC1C2=C(CCCC2)C2=C(C(C=[NH+]C3=NC(O)=C4N=CN(C5C=C(O)C(=C=O)O5)C4=N3)=CC=C2)C1C
267 370.1357244001 OC=C1OC(N2C=NC3=C(O)N=C([NH2+]CC(O)C(O)CO)N=C32)CC1O
268 574.2296247841 CC1C2=C(CCC(C(O)=C(O)C(O)=C=[NH+]C3=NC(O)=C4N=CN(C5C=C(O)C(=C=O)O5)C4=N3)=C2)C2CCCCC2C1C Intermediate Fragment 
269 574.2296247841 CC1C2=C(C=[NH+]C3=NC(O)=C4N=CN(C5C=C(O)C(=C=O)O5)C4=N3)C(=C(O)C(O)=CO)CC=C2C2CCCCC2C1C Intermediate Fragment 
270 542.2034100361 CC1C2=C(CCCC2)C2=C(C(C=[NH+]C3=NC(O)=C4N=CN(C5C=C(O)C(=C=O)O5)C4=N3)=C(C(O)=CO)C=C2)C1C
271 516.2241454801 CC1C2=C(C=[NH+]C3=NC(O)=C4N=CN(C5C=C(O)C(=C=O)O5)C4=N3)C(=CO)CC=C2C2CCCCC2C1C
272 516.2241454801 CC1C2=C(C=[NH+]C3=NC(O)=C4N=CN(C(=O)C=C(O)C#CO)C4=N3)C(=CO)CC=C2C2CCCCC2C1C Intermediate Fragment 
273 490.2448809241 CC1C(C)C2C(C=[NH+]C3=NC(O)=C4N=CN(C5C=C(O)C(=C=O)O5)C4=N3)=CCCC2C2CCCCC12
274 488.2292308601 CC1C2=C(CCC=C2C=[NH+]C2=NC(O)=C3N=CN(C4C=C(O)C(=C=O)O4)C3=N2)C2CCCCC2C1C
275 486.2135807961 CC1C2=C(C=CC=C2C=[NH+]C2=NC(O)=C3N=CN(C4C=C(O)C(=C=O)O4)C3=N2)C2CCCCC2C1C
276 486.2135807961 CC1C2=C(C=CC=C2C=[NH+]C2=NC(O)=C3N=CN(C(=O)C=C(O)C#CO)C3=N2)C2CCCCC2C1C Intermediate Fragment 
277 468.2030161121 CC1=C(C)C2=C(C=CC=C2C=[NH+]C2=NC(O)=C3N=CN(CC=C(O)C#CO)C3=N2)C2=C1CCCC2
278 440.1717159841 CC1=C(C)C2=C(C=CC=C2C=[NH+]C2=NC(O)=C3N=CN(C(=O)C#CO)C3=N2)C2=C1CCCC2
279 486.2135807961 CC(C1=CCCCC1)C(C)C1=CC=CC=C1C=[NH+]C1=NC(O)=C2N=CN(C3C=C(O)C(=C=O)O3)C2=N1 Intermediate Fragment 
280 71.0127557561 [CH2+]C(O)=C=O
281 75.0440558841 CC([OH2+])=CO
282 574.2296247841 CC1C=C(C=CC2=C(O)C(O)=C(O)C(=[NH+]C3=NC(O)=C4N=CN(C5C=C(O)C(=C=O)O5)C4=N3)C2)C2CCCCC2C1C Intermediate Fragment 
283 181.1011768361 C#[CH+]C1=CC(=C)C(=C)C2=C1CCC=C2
284 183.1168269001 C#[CH+]C1=CC(=C)C(=C)C2=C1CCCC2
285 574.2296247841 C=CC1=C(O)C(O)=C(O)C(=[NH+]C2=NC(O)=C3N=CN(C4C=C(O)C(=C=O)O4)C3=N2)C1=C1CC2CCCCC2C(C)C1C Intermediate Fragment 
286 574.2296247841 CCC1=C2C(=[NH+]C3=NC(O)=C4N=CN(C5C=C(O)C(=C=O)O5)C4=N3)C(O)=C(O)C(O)=C2CC=C1C1CCCCC1CC Intermediate Fragment 
287 107.0855267721 C#[CH+]C1=CCCCC1
288 105.0698767081 C#[CH+]C1=CCCC=C1
289 546.1983246561 CCC1=C2C(=[NH+]C3=NC(O)=C4N=CN(C5C=C(O)C(=C=O)O5)C4=N3)C(O)=C(O)C(O)=C2CC=C1C1CCCCC1
290 548.2139747201 CCC1=C2C(=[NH+]C3=NC(O)=C4N=CN(C5C=C(O)C(=C=O)O5)C4=N3)C(O)=C(O)C(O)=C2CCC1C1CCCCC1
291 574.2296247841 CCC(C)C1CCCCC1C1=CCC2=C(O)C(O)=C(O)C(=[NH+]C3=NC(O)=C4N=CN(C5C=C(O)C(=C=O)O5)C4=N3)C2=C1 Intermediate Fragment 
292 574.2296247841 CC(C1=C2C(=[NH+]C3=NC(O)=C4N=CN(C5C=C(O)C(=C=O)O5)C4=N3)C(O)=C(O)C(O)=C2CC=C1)C(C)C1CCCCC1 Intermediate Fragment 
293 496.1826745921 CCC(C)C1CCCC2=C(O)C(O)=C(O)C(=[NH+]C3=NC(O)=C4N=CN(C5C=C(O)C(=C=O)O5)C4=N3)C21
294 382.1509805401 CCC(C)C1=C2C(=[NH+]C3=NC(O)=C4N=CNC4=N3)C(O)=C(O)C(O)=C2CC=C1
295 446.1670245281 O=C=C1OC(N2C=NC3=C(O)N=C([NH2+]C4C(O)C(O)C(O)C5CCCCC54)N=C32)C=C1O
296 442.1357244001 O=C=C1OC(N2C=NC3=C(O)N=C([NH+]=C4C(O)=C(O)C(O)C5CCCCC45)N=C32)C=C1O
297 494.1670245281 CCC(C)C1=C2C(=[NH+]C3=NC(O)=C4N=CN(C5C=C(O)C(=C=O)O5)C4=N3)C(O)=C(O)C(O)=C2CCC1
298 492.1513744641 CCC(C)C1=C2C(=[NH+]C3=NC(O)=C4N=CN(C5C=C(O)C(=C=O)O5)C4=N3)C(O)=C(O)C(O)=C2CC=C1
299 79.0542266441 C1=CC=[CH2+]C=C1
300 472.1826745921 CCC1CCCC2C(O)C(O)C(O)C(=[NH+]C3=NC(O)=C4N=CN(C5C=C(O)C(=C=O)O5)C4=N3)C12
301 470.1670245281 CCC1CCCC2C(O)C(O)=C(O)C(=[NH+]C3=NC(O)=C4N=CN(C5C=C(O)C(=C=O)O5)C4=N3)C12
302 354.1196804121 CCC1=C2C(=[NH+]C3=NC(O)=C4N=CNC4=N3)C(O)=C(O)C(O)=C2CC=C1
303 468.1513744641 CCC1CCCC2=C(O)C(O)=C(O)C(=[NH+]C3=NC(O)=C4N=CN(C5C=C(O)C(=C=O)O5)C4=N3)C21
304 466.1357244001 CCC1=C2C(=[NH+]C3=NC(O)=C4N=CN(C5C=C(O)C(=C=O)O5)C4=N3)C(O)=C(O)C(O)=C2CCC1
305 356.1353304761 CCC1=C2C(=[NH+]C3=NC(O)=C4N=CNC4=N3)C(O)=C(O)C(O)=C2CCC1
306 109.1011768361 C=[CH2+]C1=CCCCC1
307 328.1040303481 OC1=C2N=CNC2=NC([NH+]=C2C3=CCCCC3=C(O)C(O)=C2O)=N1
308 446.1670245281 O=C(C=C(O)C#CO)N1C=NC2=C(O)N=C([NH2+]C3C(O)C(O)C(O)C4CCCCC43)N=C21 Intermediate Fragment 
309 444.1513744641 O=C=C1OC(N2C=NC3=C(O)N=C([NH+]=C4C(O)C(O)C(O)C5CCCCC45)N=C32)C=C1O
310 444.1513744641 O=C(C=C(O)C#CO)N1C=NC2=C(O)N=C([NH+]=C3C(O)C(O)C(O)C4CCCCC34)N=C21 Intermediate Fragment 
311 440.1200743361 O=C=C1OC(N2C=NC3=C(O)N=C([NH+]=C4C(O)=C(O)C(O)=C5CCCCC45)N=C32)C=C1O
312 422.1095096521 O=C=C1OC(N2C=NC3=C(O)N=C([NH+]=C4C5=CCCCC5=CC(O)=C4O)N=C32)C=C1O
313 438.1044242721 O=C=C1OC(N2C=NC3=C(O)N=C([NH+]=C4C5=CCCCC5=C(O)C(O)=C4O)N=C32)C=C1O
314 131.0855267721 C#C[CH+](=C)C1=CCCC=C1
315 131.0855267721 C#C[CH+](C)=C=CCC=C=C Intermediate Fragment 
316 133.1011768361 C#C[CH+](=C)C1=CCCCC1
317 135.1168269001 C#C[CH2+](C)C1=CCCCC1
318 137.1324769641 C=C[CH2+](C)C1=CCCCC1
319 574.2296247841 CCC(C)C1=C2C(=[NH+]C3=NC(O)=C4N=CN(C5C=C(O)C(=C=O)O5)C4=N3)C(O)=C(O)C(O)=C2CC=C1C1CCCCC1 Intermediate Fragment 
320 574.2296247841 CCCC1C2=CCC3=C(O)C(O)=C(O)C(=[NH+]C4=NC(O)=C5N=CN(C6C=C(O)C(=C=O)O6)C5=N4)C3=C2C(C)C(C)C1C Intermediate Fragment 
321 574.2296247841 CCCC1C(C)C2=CCC3=C(O)C(O)=C(O)C(=[NH+]C4=NC(O)=C5N=CN(C6C=C(O)C(=C=O)O6)C5=N4)C3=C2C(C)C1C Intermediate Fragment 
322 574.2296247841 CCCCC1CC2=CCC3=C(O)C(O)=C(O)C(=[NH+]C4=NC(O)=C5N=CN(C6C=C(O)C(=C=O)O6)C5=N4)C3=C2C(C)C1C Intermediate Fragment 
323 518.1670245281 CC1CCC2=CCC3=C(O)C(O)=C(O)C(=[NH+]C4=NC(O)=C5N=CN(C6C=C(O)C(=C=O)O6)C5=N4)C3=C2C1C
324 406.1509805401 CC1C=CC2=CCC3=C(O)C(O)=C(O)C(=[NH+]C4=NC(O)=C5N=CNC5=N4)C3=C2C1C
325 520.1826745921 CC1CCC2CCC3=C(O)C(O)=C(O)C(=[NH+]C4=NC(O)=C5N=CN(C6C=C(O)C(=C=O)O6)C5=N4)C3=C2C1C
326 530.1670245281 CC1=CC2=CCC3=C(O)C(O)=C(O)C(=[NH+]C4=NC(O)=C5N=CN(C6C=C(O)C(=C=O)O6)C5=N4)C3=C2C(C)C1C
327 574.2296247841 CCCCC1CC(C)C(C)C2=C3C(=[NH+]C4=NC(O)=C5N=CN(C6C=C(O)C(=C=O)O6)C5=N4)C(O)=C(O)C(O)=C3CC=C21 Intermediate Fragment 
