#In-silico ESI-MS/MS [M+H]+ Spectra
#PREDICTED BY CFM-ID 4.0.8
#SMILES=n12c([nH]c3c(c1=O)nc(n3C1CC(C(O1)CO)O)C)ncc2CC(=O)CC
#InChiKey=NEPUZCPFGHJRQD-UHFFFAOYSA-N
energy0
260.11420 34.15 14 26 28 29 133 (20.223 0.08336 0.015596 0.0081263 0.00064683)
358.15098 16.72 148 62 40 66 160 58 165 155 153 52 156 226 166 51 167 60 61 53 (4.5662 2.6602 1.6203 0.50739 0.18548 0.16631 0.068514 0.055726 0.030657 0.021482 0.016081 0.01537 0.0095298 0.0091659 0.007793 0.0076354 0.0015859 0.0015578)
376.16155 100.00 0 230 192 202 262 264 182 189 175 273 184 268 190 265 183 272 176 186 (58.125 0.51691 0.28567 0.27134 0.12611 0.12048 0.028707 0.01305 0.011212 0.0048034 0.0047075 0.0039414 0.0038178 0.0035672 0.00294 0.002747 0.0023839 0.0015197)
energy1
99.04406 11.12 4 13 5 (1.7332 0.43414 0.25909)
260.11420 20.92 14 133 26 29 28 (4.4966 0.026409 0.025305 0.0085984 0.0077562)
286.12985 16.04 55 244 (3.4346 0.063843)
288.10912 6.42 43 196 38 63 100 (0.64971 0.39331 0.21439 0.13887 0.0035857)
302.12477 17.29 47 241 65 134 (2.4571 0.77567 0.53636 0.002259)
304.14042 7.36 243 48 229 (0.99645 0.60788 0.0020727)
316.14042 18.19 56 163 260 221 223 (2.4718 0.79157 0.69584 0.0059883 0.003073)
318.11968 6.80 116 118 117 (1.4585 0.015752 0.0099466)
328.14042 5.65 36 (1.2322)
330.15607 6.28 154 150 (0.83739 0.53365)
332.13533 11.24 59 193 257 258 (2.4183 0.026844 0.0044864 0.0035101)
334.15098 7.58 259 (1.6535)
340.14042 21.04 50 41 151 228 57 164 (2.307 1.842 0.2819 0.084608 0.065125 0.0093864)
346.15098 9.17 35 181 (1.9078 0.093637)
348.16663 6.74 179 39 263 180 (0.84906 0.34782 0.27113 0.0021458)
358.15098 96.18 40 148 62 58 165 153 60 155 51 226 156 52 160 166 53 66 167 61 (8.9118 6.8262 2.0637 0.55314 0.5179 0.50735 0.24672 0.24511 0.23383 0.20395 0.15488 0.13253 0.11545 0.10354 0.066805 0.050604 0.037227 0.012485)
376.16155 100.00 0 262 264 202 192 182 230 176 183 189 175 184 268 265 190 272 273 186 (18.31 1.3622 0.53718 0.53695 0.46242 0.28514 0.10219 0.057887 0.03542 0.033751 0.026971 0.023825 0.0154 0.013892 0.0059813 0.0030379 0.0029951 0.00087508)
energy2
45.03349 23.19 8 (1.8002)
55.01784 14.23 237 (1.1051)
55.05423 27.34 69 (2.1225)
57.03349 19.58 114 (1.5199)
59.04914 26.45 236 (2.0537)
103.07536 18.90 227 (1.467)
190.07234 21.96 18 (1.7049)
212.15059 15.51 141 (1.2043)
214.07234 25.65 93 (1.9915)
216.08799 100.00 79 199 (7.4258 0.33749)
218.10364 12.29 94 (0.95437)
230.10364 69.42 128 (5.3894)
232.08290 93.40 195 104 (3.7948 3.4564)
244.08290 35.24 97 242 (2.2421 0.4937)
246.09855 66.03 98 139 (3.5288 1.5969)
260.07782 12.35 81 (0.95914)
260.11420 33.59 133 14 26 29 28 (2.5765 0.016234 0.0084514 0.0033524 0.0033416)
262.09347 62.07 84 (4.8186)
274.09347 15.53 34 254 (1.1181 0.087696)
276.10912 48.01 137 37 (3.3295 0.39789)
286.09347 31.54 82 197 76 42 (1.53 0.71943 0.13391 0.064763)
286.12985 15.54 55 244 (0.94444 0.26213)
288.10912 68.95 100 43 63 38 196 (3.8919 0.6774 0.47436 0.27694 0.032443)
290.12477 43.70 112 64 44 122 194 (2.9206 0.26742 0.10359 0.087995 0.013175)
292.17680 11.89 212 (0.92282)
300.10912 11.01 119 240 46 (0.83273 0.018352 0.0035567)
302.12477 22.07 134 47 65 241 (1.0132 0.41095 0.26636 0.022865)
304.14042 18.82 229 48 243 (1.3823 0.057271 0.021707)
316.14042 25.38 260 56 223 221 163 (1.4516 0.26453 0.13552 0.07685 0.041439)
340.14042 19.77 57 228 164 151 50 41 (0.99693 0.46947 0.053477 0.0077618 0.0051751 0.0021505)

0 376.1615452241 CCC(=O)Cc1cnc2[nH]c3c(nc(C)n3C3CC(O)C(CO)O3)c(=[OH+])n12
1 119.0702706321 OC1CCOC1C[OH2+]
2 117.0546205681 OC1C=COC1C[OH2+]
3 87.0440558841 [OH2+]C1C=COC1
4 99.0440558841 CC1=C([OH2+])C=CO1
5 99.0440558841 [OH2+]CC1=CC=CO1
6 117.0546205681 C=C(O)C(=C[OH2+])OC Intermediate Fragment 
7 117.0546205681 C=COC(=CO)C[OH2+] Intermediate Fragment 
8 45.0334912001 C=C[OH2+]
9 73.0284058201 OC#CC[OH2+]
10 75.0440558841 OC=CC[OH2+]
11 117.0546205681 OC=C=COCC[OH2+] Intermediate Fragment 
12 117.0546205681 OC=C=C(O)CC[OH2+] Intermediate Fragment 
13 99.0440558841 C#CC(O)=CC[OH2+]
14 260.1142011081 CCC(O)C=C1C=NC2=NC3=C(N=C(C)N3)C(=[OH+])N12
15 73.0647913281 C=C([OH2+])CC
16 186.0410361681 [CH+]=C1N=C2N=C3N=CCN3C(=O)C2=N1
17 188.0566862321 C=C1N=C2N=C3N=CCN3C(=[OH+])C2=N1
18 190.0723362961 C=C1N=C2C(=[OH+])N3CC=NC3=NC2N1
19 200.0566862321 C=C1C=NC2=NC3=C(N=C([CH2+])N3)C(=O)N12
20 202.0723362961 C=C1C=NC2=NC3=C(N=C(C)N3)C(=[OH+])N12
21 204.0879863601 CC1=NC2=C(N=C3N=CC(C)N3C2=[OH+])N1
22 206.1036364241 CC1=NC2=C(N=C3NCC(C)N3C2=[OH+])N1
23 208.1192864881 CC1NC2=C(N1)C(=[OH+])N1C(=N2)NCC1C
24 242.1036364241 CCC=C=C1C=NC2=NC3=C(N=C(C)N3)C(=[OH+])N12
25 230.0672509161 CC1=NC2=C(N=C3N=CC(=C=CO)N3C2=[OH+])N1
26 260.1142011081 CCC(O)C=C1C=NC(N=C2NC(C)=NC2=C=[OH+])=N1 Intermediate Fragment 
27 232.1192864881 CCC(O)C=C1C=NC([NH+]=C2C=NC(C)=N2)=N1
28 260.1142011081 CCC(O)=CC(=C=N)N1C=NC2=C(N=C(C)N2)C1=[OH+] Intermediate Fragment 
29 260.1142011081 CCC(O)C=C=C=NC1=NC([OH2+])=C2N=C(C)NC2=N1 Intermediate Fragment 
30 262.1298511721 CCC(O)CC1C=NC2=NC3=C(N=C(C)N3)C(=[OH+])N21
31 264.1455012361 CCC(O)CC1CNC2=NC3=C(N=C(C)N3)C(=[OH+])N21
32 266.1611513001 CCC(O)CC1CNC2=NC3=C(NC(C)N3)C(=[OH+])N21
33 344.1353304761 CCC(O)CC1C=NC2=NC3=C(N=C(C)N3C3=CC(O)=CO3)C(=[OH+])N21
34 274.0934656641 CC1=NC2=C(N=C3NCCN3C2=[OH+])N1C1=CC(O)=CO1
35 346.1509805401 CCC(O)CC1CNC2=NC3=C(N=C(C)N3C3=CC(O)=CO3)C(=[OH+])N21
36 328.1404158561 CCC(O)CC1C=NC2=NC3=C(N=C(C)N3C3=CC=CO3)C(=[OH+])N21
37 276.1091157281 CC1=NC2=C(N=C3NCCN3C2=[OH+])N1C1=CC(O)CO1
38 288.1091157281 CC1=NC2=C(N=C3NCC(C)N3C2=[OH+])N1C1=CC(O)=CO1
39 348.1666306041 CCC(O)CC1CNC2=NC3=C(N=C(C)N3C3=CC(O)CO3)C(=[OH+])N21
40 358.1509805401 CCC(O)CC1C=NC2=NC3=C(N=C(C)N3C3=CC(O)=C(C)O3)C(=[OH+])N21
41 340.1404158561 CCC(O)C=C1C=NC2=NC3=C(N=C(C)N3C3=CC=C(C)O3)C(=[OH+])N12
42 286.0934656641 CC1=NC2=C(N=C3N=CCN3C2=[OH+])N1C1=CC(O)=C(C)O1
43 288.1091157281 CC1=NC2=C(N=C3NCCN3C2=[OH+])N1C1=CC(O)=C(C)O1
44 290.1247657921 CC1=NC2=C(N=C3NCCN3C2=[OH+])N1C1=CC(O)C(C)O1
45 298.0934656641 C=C1C=NC2=NC3=C(N=C(C)N3C3=CC(O)=C(C)O3)C(=[OH+])N12
46 300.1091157281 CC1=NC2=C(N=C3N=CC(C)N3C2=[OH+])N1C1=CC(O)=C(C)O1
47 302.1247657921 CC1=NC2=C(N=C3NCC(C)N3C2=[OH+])N1C1=CC(O)=C(C)O1
48 304.1404158561 CC1=NC2=C(N=C3NCC(C)N3C2=[OH+])N1C1=CC(O)C(C)O1
49 306.1560659201 CC1=NC2=C(N=C3NCC(C)N3C2=[OH+])N1C1CC(O)C(C)O1
50 340.1404158561 CCCC=C1C=NC2=NC3=C(N=C(C)N3C3=CC(O)=C(C)O3)C(=[OH+])N12
51 358.1509805401 CCC(O)CC1C=NC(N=C2C(=C=[OH+])N=C(C)N2C2=CC(O)=C(C)O2)=N1 Intermediate Fragment 
52 358.1509805401 C=C(O)C(=C)OCN1C(C)=NC2=C1N=C1N=CC(=CC(O)CC)N1C2=[OH+] Intermediate Fragment 
53 358.1509805401 CCC(O)CC1C=NC2=NC3=C(N=C(C)N3C=C=C(O)C(C)=O)C(=[OH+])N21 Intermediate Fragment 
54 284.1142011081 C#CN1C(C)=NC2=C1N=C1N=CC(=CC(O)CC)N1C2=[OH+]
55 286.1298511721 C#CN1C(C)=NC2=C1N=C1N=CC(CC(O)CC)N1C2=[OH+]
56 316.1404158561 CCC(O)CC1CNC2=NC3=C(N=C(C)N3C#CC=O)C(=[OH+])N21
57 340.1404158561 C=C=C(O)C#CN1C(C)=NC2=C1N=C1N=CC(CC(O)CC)N1C2=[OH+]
58 358.1509805401 C#CC(O)=C=C(O)N1C(C)=NC2=C1N=C1NCC(CC(O)CC)N1C2=[OH+] Intermediate Fragment 
59 332.1353304761 CCC(O)CC1CNC2=NC3=C(N=C(C)N3C(O)=C=C=O)C(=[OH+])N21
60 358.1509805401 C#COC(=C=CO)N1C(C)=NC2=C1N=C1NCC(CC(O)CC)N1C2=[OH+] Intermediate Fragment 
61 358.1509805401 CCC(O)CC(=C=N)N1C=NC2=C(N=C(C)N2C2=CC(O)=C(C)O2)C1=[OH+] Intermediate Fragment 
62 358.1509805401 CCC(O)CC1CNC2=NC3=C(N=C(C)N3C3=CC=C(C=O)O3)C(=[OH+])N21
63 288.1091157281 CC1=NC2=C(N=C3NCCN3C2=[OH+])N1C1=CC=C(CO)O1
64 290.1247657921 CC1=NC2=C(N=C3NCCN3C2=[OH+])N1C1=CCC(CO)O1
65 302.1247657921 CC1=NC2=C(N=C3NCC(C)N3C2=[OH+])N1C1=CC=C(CO)O1
66 358.1509805401 CCC(O)CC1CNC2=NC3=C(N=C(C)N3C(O)=C=C=C=CO)C(=[OH+])N21 Intermediate Fragment 
67 75.0804413921 CCC(C)[OH2+]
68 57.0698767081 CCC=[CH3+]
69 55.0542266441 [CH2+]#CCC
70 43.0178411361 C#C[OH2+]
71 71.0491412641 C=CC(=C)[OH2+]
72 302.0883802841 CC1=NC2=C(N=C3NCCN3C2=[OH+])N1C1=CC(O)=C(C=O)O1
73 302.0883802841 CC1=NC2=C(N=C3NCCN3C2=[OH+])N1C(O)=C=C(O)C#CO Intermediate Fragment 
74 304.1040303481 CC1=NC2=C(N=C3NCCN3C2=[OH+])N1C1=CC(O)=C(CO)O1
75 194.1036364241 CC1N=C2C(=[OH+])N3CCNC3=NC2N1
76 286.0934656641 CC1=NC2=C(N=C3NCCN3C2=[OH+])N1C1=CC=C(C=O)O1
77 304.1040303481 C=C(O)C(=C=O)OCN1C(C)=NC2=C1N=C1NCCN1C2=[OH+] Intermediate Fragment 
78 304.1040303481 CC1=NC2=C(N=C3NCCN3C2=[OH+])N1C=C=C(O)C(=O)CO Intermediate Fragment 
79 216.0879863601 C#CN1C(C)=NC2=C1N=C1NCCN1C2=[OH+]
80 304.1040303481 CC1=NC2=C(N=C3NCCN3C2=[OH+])N1C(O)=C=C(O)C=CO Intermediate Fragment 
81 260.0778156001 CC1=NC2=C(N=C3NCCN3C2=[OH+])N1C(O)=C=C=O
82 286.0934656641 CC1=NC2=C(N=C3NCCN3C2=[OH+])N1C#CC(O)=C=CO
83 304.1040303481 CC1=NC2=C(N=C3NCCN3C2=[OH+])N1C(=C=CO)OC=CO Intermediate Fragment 
84 262.0934656641 CC1=NC2=C(N=C3NCCN3C2=[OH+])N1C(O)=C=CO
85 304.1040303481 C=C(OC(C=O)=CO)N1C(C)=NC2=C1N=C1NCCN1C2=[OH+] Intermediate Fragment 
86 304.1040303481 CC1=NC2=C(N=CN(CCN)C2=[OH+])N1C1=CC(O)=C(C=O)O1 Intermediate Fragment 
87 306.1196804121 CC1=NC2=C(N=C3NCCN3C2=[OH+])N1C1=CC(O)C(CO)O1
88 196.1192864881 CC1NC2=C(N1)C([OH2+])N1CCNC1=N2
89 306.1196804121 CC1=NC=C(N=C2NCCN2C=[OH+])N1C1=CC(O)=C(CO)O1 Intermediate Fragment 
90 278.1247657921 CC1N=CC(=[NH+]C2=NCCN2)N1C1=CC(O)=C(CO)O1
91 306.1196804121 CCN(C1=CC(O)=C(C=O)O1)C1=C(N)C(=[OH+])N2CCNC2=N1 Intermediate Fragment 
92 306.1196804121 CC1=NC2=C(N=C3NCCN3C2=[OH+])N1C=C=C(O)C(O)CO Intermediate Fragment 
93 214.0723362961 C#CN1C(C)=NC2=C1N=C1N=CCN1C2=[OH+]
94 218.1036364241 C=CN1C(C)=NC2=C1N=C1NCCN1C2=[OH+]
95 220.1192864881 CCN1C(C)=NC2=C1N=C1NCCN1C2=[OH+]
96 222.1349365521 CCN1C2=C(NC1C)C(=[OH+])N1CCNC1=N2
97 244.0829009801 CC1=NC2=C(N=C3NCCN3C2=[OH+])N1C#CC=O
98 246.0985510441 CC1=NC2=C(N=C3NCCN3C2=[OH+])N1C#CCO
99 248.1142011081 CC1=NC2=C(N=C3NCCN3C2=[OH+])N1C=CCO
100 288.1091157281 CC1=NC2=C(N=C3NCCN3C2=[OH+])N1C#CC(O)=CCO
101 306.1196804121 CC1=NC2=C(N=C3NCCN3C2=[OH+])N1C(O)=C=C(O)CCO Intermediate Fragment 
102 306.1196804121 CC1=NC2=C(N=C3NCCN3C2=[OH+])N1C(=C=CO)OCCO Intermediate Fragment 
103 306.1196804121 C=C(OC(=CO)CO)N1C(C)=NC2=C1N=C1NCCN1C2=[OH+] Intermediate Fragment 
104 232.0829009801 C=C(O)N1C(C)=NC2=C1N=C1N=CCN1C2=[OH+]
105 306.1196804121 CC1=NC2=C(N=CN(CCN)C2=[OH+])N1C1=CC(O)=C(CO)O1 Intermediate Fragment 
106 289.0931313161 CCN1C=NC2=C(N=C(C)N2C2=CC(O)=C(C=O)O2)C1=[OH+]
107 306.1196804121 CCNC1=NC([OH2+])=C2N=C(C)N(C3=CC(O)=C(CO)O3)C2=N1 Intermediate Fragment 
108 306.1196804121 CCN1C(=[OH+])C2=C(N=C1N)N(C1=CC(O)=C(CO)O1)C(C)=N2 Intermediate Fragment 
109 308.1353304761 CC1=NC2=C(N=C3NCCN3C2=[OH+])N1C1CC(O)C(CO)O1
110 198.1349365521 CC1NC2N=C3NCCN3C([OH2+])C2N1
111 308.1353304761 CC1=NC2=C(N=C3NCCN3C2=[OH+])N1C=CC(O)C(O)CO Intermediate Fragment 
112 290.1247657921 CC1=NC2=C(N=C3NCCN3C2=[OH+])N1C#CC(O)CCO
113 308.1353304761 CC1=NC2=C(N=C3NCCN3C2=[OH+])N1C(O)=CC(O)CCO Intermediate Fragment 
114 57.0334912001 C=CC=[OH+]
115 316.1040303481 CC1=NC2=C(N=C3NCC(C)N3C2=[OH+])N1C1=CC(O)=C(C=O)O1
116 318.1196804121 CC1=NC2=C(N=C3NCC(C)N3C2=[OH+])N1C1=CC(O)=C(CO)O1
117 318.1196804121 CC1=NC2=C(N=C3NCC(C)N3C2=[OH+])N1C=C=C(O)C(=O)CO Intermediate Fragment 
118 318.1196804121 CC1=NC2=C(N=C3NCC(C)N3C2=[OH+])N1C(O)=C=C(O)C=CO Intermediate Fragment 
119 300.1091157281 CC1=NC2=C(N=C3NCC(C)N3C2=[OH+])N1C#CC(O)=C=CO
120 320.1353304761 CC1=NC2=C(N=C3NCC(C)N3C2=[OH+])N1C1=CC(O)C(CO)O1
121 210.1349365521 CC1NC2=C(N1)C([OH2+])N1C(=N2)NCC1C
122 290.1247657921 CC1=NC2=C(N=C3NCC(C)N3C2=[OH+])N1C1=CC(O)CO1
123 320.1353304761 CC1=NC=C(N=C2NCC(C)N2C=[OH+])N1C1=CC(O)=C(CO)O1 Intermediate Fragment 
124 292.1404158561 CC1CNC([NH+]=C2C=NC(C)N2C2=CC(O)=C(CO)O2)=N1
125 320.1353304761 CCN(C1=CC(O)=C(C=O)O1)C1=C(N)C(=[OH+])N2C(=N1)NCC2C Intermediate Fragment 
126 320.1353304761 CC1=NC2=C(N=C3NCC(C)N3C2=[OH+])N1C=C=C(O)C(O)CO Intermediate Fragment 
127 228.0879863601 C#CN1C(C)=NC2=C1N=C1N=CC(C)N1C2=[OH+]
128 230.1036364241 C#CN1C(C)=NC2=C1N=C1NCC(C)N1C2=[OH+]
129 232.1192864881 C=CN1C(C)=NC2=C1N=C1NCC(C)N1C2=[OH+]
130 234.1349365521 CCN1C(C)=NC2=C1N=C1NCC(C)N1C2=[OH+]
131 236.1505866161 CCN1C2=C(NC1C)C(=[OH+])N1C(=N2)NCC1C
132 258.0985510441 CC1=NC2=C(N=C3NCC(C)N3C2=[OH+])N1C#CC=O
133 260.1142011081 CC1=NC2=C(N=C3NCC(C)N3C2=[OH+])N1C#CCO
134 302.1247657921 CC1=NC2=C(N=C3NCC(C)N3C2=[OH+])N1C#CC(O)=CCO
135 320.1353304761 CC1=NC2=C(N=C3NCC(C)N3C2=[OH+])N1C(O)=C=C(O)CCO Intermediate Fragment 
136 320.1353304761 CC1=NC2=C(N=C3NCC(C)N3C2=[OH+])N1C(=C=CO)OCCO Intermediate Fragment 
137 276.1091157281 CC1=NC2=C(N=C3NCC(C)N3C2=[OH+])N1C(O)=C=CO
138 320.1353304761 C=C(OC(=CO)CO)N1C(C)=NC2=C1N=C1NCC(C)N1C2=[OH+] Intermediate Fragment 
139 246.0985510441 C=C(O)N1C(C)=NC2=C1N=C1N=CC(C)N1C2=[OH+]
140 322.1509805401 CC1=NC2=C(N=C3NCC(C)N3C2=[OH+])N1C1CC(O)C(CO)O1
141 212.1505866161 CC1NC2N=C3NCC(C)N3C([OH2+])C2N1
142 322.1509805401 CC1=NC2=C(N=C3NCC(C)N3C2=[OH+])N1C=CC(O)C(O)CO Intermediate Fragment 
143 322.1509805401 CC1=NC2=C(N=C3NCC(C)N3C2=[OH+])N1C(O)=CC(O)CCO Intermediate Fragment 
144 324.1666306041 CC1CNC2=NC3=C(NC(C)N3C3CC(O)C(CO)O3)C(=[OH+])N21
145 214.1662366801 CC1NC2NC3NCC(C)N3C([OH2+])C2N1
146 324.1666306041 CC1=NC2=C(N=C3NCC(C)N3C2=[OH+])N1CCC(O)C(O)CO Intermediate Fragment 
147 324.1666306041 CC1=NC2=C(N=C3NCC(C)N3C2=[OH+])N1C(O)CC(O)CCO Intermediate Fragment 
148 358.1509805401 CCCCC1CNC2=NC3=C(N=C(C)N3C3=CC(O)=C(C=O)O3)C(=[OH+])N21
149 244.1192864881 CCCC=C1C=NC2=NC3=C(N=C(C)N3)C(=[OH+])N12
150 330.1560659201 CCCCC1CNC2=NC3=C(N=C(C)N3C3=CC(O)=CO3)C(=[OH+])N21
151 340.1404158561 CCCCC1C=NC2=NC3=C(N=C(C)N3C3=CC=C(C=O)O3)C(=[OH+])N21
152 59.0855267721 CCC[CH4+]
153 358.1509805401 CCCCC1CNC(N=C2C(=C=[OH+])N=C(C)N2C2=CC(O)=C(C=O)O2)=N1 Intermediate Fragment 
154 330.1560659201 C=C1N=CC(=[NH+]C2=NC(CCCC)CN2)N1C1=CC(O)=C(C=O)O1
155 358.1509805401 C=C(O)C(=C=O)OCN1C(C)=NC2=C1N=C1N=CC(CCCC)N1C2=[OH+] Intermediate Fragment 
156 358.1509805401 CCCCC1CNC2=NC3=C(N=C(C)N3C=C=C(O)C(=O)C=O)C(=[OH+])N21 Intermediate Fragment 
157 270.1349365521 C#CN1C(C)=NC2=C1N=C1N=CC(CCCC)N1C2=[OH+]
158 272.1505866161 C#CN1C(C)=NC2=C1N=C1NCC(CCCC)N1C2=[OH+]
159 300.1455012361 CCCCC1CNC2=NC3=C(N=C(C)N3C#CC=O)C(=[OH+])N21
160 358.1509805401 CCCCC1CNC2=NC3=C(N=C(C)N3C(O)=C=C(O)C#CO)C(=[OH+])N21 Intermediate Fragment 
161 288.1455012361 C=C(O)N1C(C)=NC2=C1N=C1N=CC(CCCC)N1C2=[OH+]
162 314.1247657921 CCCCC1C=NC2=NC3=C(N=C(C)N3C(O)=C=C=O)C(=[OH+])N21
163 316.1404158561 CCCCC1CNC2=NC3=C(N=C(C)N3C(O)=C=C=O)C(=[OH+])N21
164 340.1404158561 CCCCC1CNC2=NC3=C(N=C(C)N3C#CC(O)=C=C=O)C(=[OH+])N21
165 358.1509805401 CCCCC1CNC2=NC3=C(N=C(C)N3C(=C=CO)OC#CO)C(=[OH+])N21 Intermediate Fragment 
166 358.1509805401 C=C(OC(=C=O)C=O)N1C(C)=NC2=C1N=C1NCC(CCCC)N1C2=[OH+] Intermediate Fragment 
167 358.1509805401 CCCCCC=NC1=NC([OH2+])=C2N=C(C)N(C3=CC(O)=C(C=O)O3)C2=N1 Intermediate Fragment 
168 346.1145950321 CC1=NC2=C(N=C3NCC(CCO)N3C2=[OH+])N1C1=CC(O)=C(C=O)O1
169 346.1145950321 CC1=NC2=C(N=C3NCC(CCO)N3C2=[OH+])N1C(O)=C=C(O)C#CO Intermediate Fragment 
170 348.1302450961 CC1=NC2=C(N=C3NCC(CCO)N3C2=[OH+])N1C1=CC(O)=C(CO)O1
171 330.1196804121 CC1=NC2=C(N=C3N=CC(CCO)N3C2=[OH+])N1C1=CC(O)=C(C)O1
172 348.1302450961 CC1=NC2=C(N=C3NCC(CCO)N3C2=[OH+])N1C=C=C(O)C(=O)CO Intermediate Fragment 
173 350.1458951601 CC1=NC2=C(N=C3NCC(CCO)N3C2=[OH+])N1C1=CC(O)C(CO)O1
174 360.1302450961 CC1=NC2=C(N=C3NCC(CC(C)O)N3C2=[OH+])N1C1=CC(O)=C(C=O)O1
175 376.1615452241 CCC(O)CC1CNC(=N)N1C(=[OH+])C1=CN(C2=CC(O)=C(C=O)O2)C(C)=N1 Intermediate Fragment 
176 376.1615452241 CCC(O)CC1CNC(=NC2=CN=C(C)N2C2=CC(O)=C(C=O)O2)N1C=[OH+] Intermediate Fragment 
177 199.1077187601 CC1=NC=CN1C1CC(O)C(C[OH2+])O1
178 195.0764186321 CC1=NC=CN1C1=CC(O)=C(C[OH2+])O1
179 348.1666306041 CCC(O)CC1CNC([NH+]=C2C=NC(C)N2C2=CC(O)=C(C=O)O2)=N1
180 348.1666306041 CCC(O)CC1CNC([NH+]=C2C=NC(C)N2C(O)=C=C(O)C#CO)=N1 Intermediate Fragment 
181 346.1509805401 C=C1N=CC(=[NH+]C2=NC(CC(O)CC)CN2)N1C1=CC(O)=C(C=O)O1
182 376.1615452241 CCC(O)CC1CNC(N=C2C(=C=[OH+])N=C(C)N2C2=CC(O)=C(CO)O2)=N1 Intermediate Fragment 
183 376.1615452241 CCC(O)CC1CN=CN1C([OH2+])=C1N=C(C)N(C2=CC(O)=C(C=O)O2)C1=N Intermediate Fragment 
184 376.1615452241 CCC(O)CC1CNC2=NC(N(C(C)=N)C3=CC(O)=C(C=O)O3)=CC(=[OH+])N21 Intermediate Fragment 
185 359.1349961281 C#C[NH+](C1=CC(=O)N2C(=N1)NCC2CC(O)CC)C1=CC(O)=C(C=O)O1
186 376.1615452241 CCC(O)CC1CNC2=NC=C(N=C(C)N=C3C=C(O)C(=CO)O3)C(=[OH+])N21 Intermediate Fragment 
187 245.1033020761 C=C=[NH+]C1=CN=C2N=CC(=CC(O)CC)N2C1=O
188 247.1189521401 C=C=[NH+]C1=CN=C2N=CC(CC(O)CC)N2C1=O
189 376.1615452241 CC=NC1=C(N=C2C=C(O)C(=CO)O2)N=C2NCC(CC(O)CC)N2C1=[OH+] Intermediate Fragment 
190 376.1615452241 C=CN(C1=CC(O)=C(C=O)O1)C1=C(N)C(=[OH+])N2C(=N1)NCC2CC(O)CC Intermediate Fragment 
191 350.1458951601 CCC(O)CC1CNC2=NC(N=C3C=C(O)C(=CO)O3)=C([NH3+])C(=O)N21
192 376.1615452241 C=C(O)C(=C=O)OCN1C(C)=NC2=C1N=C1NCC(CC(O)CC)N1C2=[OH+] Intermediate Fragment 
193 332.1353304761 CCC(O)CC1C=NC2=NC3=C(N=C(C)N3COC#CO)C(=[OH+])N21
194 290.1247657921 CCC(O)C=C1C=NC2=NC3=C(N=C(C)N3CO)C(=[OH+])N12
195 232.0829009801 C=C1C=NC2=NC3=C(N=C(C)N3CO)C(=[OH+])N12
196 288.1091157281 CCC(O)=C=C1C=NC2=NC3=C(N=C(C)N3CO)C(=[OH+])N12
197 286.0934656641 C=CC(O)=C=C1C=NC2=NC3=C(N=C(C)N3CO)C(=[OH+])N12
198 274.1298511721 CCC(O)C=C1C=NC2=NC3=C(N=C(C)N3C)C(=[OH+])N12
199 216.0879863601 C=C1C=NC2=NC3=C(N=C(C)N3C)C(=[OH+])N12
200 272.1142011081 CCC(O)=C=C1C=NC2=NC3=C(N=C(C)N3C)C(=[OH+])N12
201 270.0985510441 C=CC(O)=C=C1C=NC2=NC3=C(N=C(C)N3C)C(=[OH+])N12
202 376.1615452241 CCC(O)CC1CNC2=NC3=C(N=C(C)N3C=C=C(O)C(=O)CO)C(=[OH+])N21 Intermediate Fragment 
203 93.0546205681 OCC([OH2+])CO
204 91.0389705041 OC=C([OH2+])CO
205 288.1455012361 C#CN1C(C)=NC2=C1N=C1NCC(CC(O)CC)N1C2=[OH+]
206 288.1455012361 C#CN1C(N=C2N=CC(CC(O)CC)N2C=[OH+])=CN=C1C Intermediate Fragment 
207 288.1455012361 C#CN1C(C)=NC(=C=[OH+])C1=NC1=NC(CC(O)CC)CN1 Intermediate Fragment 
208 288.1455012361 C#CN(C(C)=N)C1=CC(=[OH+])N2C(=N1)N=CC2CC(O)CC Intermediate Fragment 
209 271.1189521401 C#C[NH+](C#C)C1=CC(=O)N2C(=N1)N=CC2CC(O)CC
210 288.1455012361 C#CN1C(C)=NC2=C([OH2+])N=C(N=CCCC(O)CC)N=C21 Intermediate Fragment 
211 290.1611513001 C=CN1C(C)=NC2=C1N=C1NCC(CC(O)CC)N1C2=[OH+]
212 292.1768013641 CCC(O)CC1CNC2=NC3=C(N=C(C)N3CC)C(=[OH+])N21
213 63.0440558841 OCC[OH2+]
214 59.0127557561 O=C=C[OH2+]
215 314.1247657921 CCC(O)CC1C=NC2=NC3=C(N=C(C)N3C#CC=O)C(=[OH+])N21
216 296.1142011081 CCCC=C1C=NC2=NC3=C(N=C(C)N3C#CC=O)C(=[OH+])N12
217 298.1298511721 CC#CN1C(C)=NC2=C1N=C1N=CC(=CC(O)CC)N1C2=[OH+]
218 262.1298511721 CC1=NC2=C(N=C3NCC(C)N3C2=[OH+])N1C=CCO
219 264.1455012361 CC1=NC2=C(N=C3NCC(C)N3C2=[OH+])N1CCCO
220 298.1298511721 CCCCC1C=NC2=NC3=C(N=C(C)N3C#CC=O)C(=[OH+])N21
221 316.1404158561 CCC(O)CC1C=NC(=NC2=CN=C(C)N2C#CC=O)N1C=[OH+] Intermediate Fragment 
222 288.1455012361 C=C1N=CC(=[NH+]C2=NC(CC(O)CC)CN2)N1C#CC=O
223 316.1404158561 CCC(O)CCC=NC1=NC([OH2+])=C2N=C(C)N(C#CC=O)C2=N1 Intermediate Fragment 
224 318.1560659201 CCC(O)CC1CNC2=NC3=C(N=C(C)N3C#CCO)C(=[OH+])N21
225 320.1717159841 CCC(O)CC1CNC2=NC3=C(N=C(C)N3C=CCO)C(=[OH+])N21
226 358.1509805401 CCC(O)CC1CNC2=NC3=C(N=C(C)N3C#CC(O)=C=CO)C(=[OH+])N21
227 103.0753560121 C=CC(O)CC[OH2+]
228 340.1404158561 CCC(O)CC1CNC2=NC3=C(N=C(C)N3C#CC#CC=O)C(=[OH+])N21
229 304.1404158561 CC1=NC2=C(N=C3NCC(C)N3C2=[OH+])N1C#CC(O)CCO
230 376.1615452241 CCC(O)CC1CNC2=NC3=C(N=C(C)N3C(O)=C=C(O)C=CO)C(=[OH+])N21 Intermediate Fragment 
231 91.0753560121 CC(O)CC[OH2+]
232 89.0597059481 C=C(O)CC[OH2+]
233 71.0491412641 C#CCC[OH2+]
234 292.1404158561 CCC(O)CC1C=NC2=NC3=C(N=C(C)N3CO)C(=[OH+])N21
235 77.0597059481 OCCC[OH2+]
236 59.0491412641 CC=C[OH2+]
237 55.0178411361 [CH2+]C#CO
238 71.0127557561 OC#CC=[OH+]
239 68.9971056921 [O+]#CC#CO
240 300.1091157281 C=C(O)N1C(C)=NC2=C1N=C1N=CC(=C=C(O)CC)N1C2=[OH+]
241 302.1247657921 C=C(O)N1C(C)=NC2=C1N=C1N=CC(=CC(O)CC)N1C2=[OH+]
242 244.0829009801 C=C(O)N1C(C)=NC2=C1N=C1N=CC(=C)N1C2=[OH+]
243 304.1404158561 C=C(O)N1C(C)=NC2=C1N=C1N=CC(CC(O)CC)N1C2=[OH+]
244 286.1298511721 C=C(O)N1C(C)=NC2=C1N=C1N=CC(=CCCC)N1C2=[OH+]
245 306.1560659201 C=C(O)N1C(C)=NC2=C1N=C1NCC(CC(O)CC)N1C2=[OH+]
246 308.1717159841 CCC(O)CC1CNC2=NC3=C(N=C(C)N3C(C)O)C(=[OH+])N21
247 47.0491412641 CC[OH2+]
248 29.0385765801 C=[CH3+]
249 330.1196804121 CCC(O)CC1C=NC2=NC3=C(N=C(C)N3C(O)=C=C=O)C(=[OH+])N21
250 312.1091157281 CCCC=C1C=NC2=NC3=C(N=C(C)N3C(O)=C=C=O)C(=[OH+])N12
251 312.1091157281 CCC(O)C=C1C=NC2=NC3=C(N=C(C)N3C#CC=O)C(=[OH+])N12
252 314.1247657921 C=C=C(O)N1C(C)=NC2=C1N=C1N=CC(=CC(O)CC)N1C2=[OH+]
253 264.1091157281 CC1=NC2=C(N=C3NCCN3C2=[OH+])N1C(O)=CCO
254 274.0934656641 CC1=NC2=C(N=C3NCC(C)N3C2=[OH+])N1C(O)=C=C=O
255 278.1247657921 CC1=NC2=C(N=C3NCC(C)N3C2=[OH+])N1C(O)=CCO
256 280.1404158561 CC1=NC2=C(N=C3NCC(C)N3C2=[OH+])N1C(O)CCO
257 332.1353304761 CCC(O)CC1C=NC(=NC2=CN=C(C)N2C(O)=C=C=O)N1C=[OH+] Intermediate Fragment 
258 332.1353304761 CCC(O)CCC=NC1=NC([OH2+])=C2N=C(C)N(C(O)=C=C=O)C2=N1 Intermediate Fragment 
259 334.1509805401 CCC(O)CC1CNC2=NC3=C(N=C(C)N3C(O)=C=CO)C(=[OH+])N21
260 316.1404158561 C=C=C(O)N1C(C)=NC2=C1N=C1N=CC(CC(O)CC)N1C2=[OH+]
261 374.1458951601 CCC(O)CC1CNC2=NC3=C(N=C(C)N3C(O)=C=C(O)C#CO)C(=[OH+])N21
262 376.1615452241 CCC(O)CC1CNC2=NC3=C(N=C(C)N3C(=C=CO)OC=CO)C(=[OH+])N21 Intermediate Fragment 
263 348.1666306041 C=C(OC=CO)N1C(C)=NC2=C1N=C1NCC(CC(O)CC)N1C2=[OH+]
264 376.1615452241 C=C(OC(C=O)=CO)N1C(C)=NC2=C1N=C1NCC(CC(O)CC)N1C2=[OH+] Intermediate Fragment 
265 376.1615452241 CCC(O)CC(CN)N1C=NC2=C(N=C(C)N2C2=CC(O)=C(C=O)O2)C1=[OH+] Intermediate Fragment 
266 359.1349961281 C=C(CC(O)CC)N1C=NC2=C(N=C(C)N2C2=CC(O)=C(C=O)O2)C1=[OH+]
267 349.1506461921 CCC(O)CCN1C=NC2=C(N=C(C)N2C2=CC(O)=C(CO)O2)C1=[OH+]
268 376.1615452241 CCC(O)CCCNC1=NC([OH2+])=C2N=C(C)N(C3=CC(O)=C(C=O)O3)C2=N1 Intermediate Fragment 
269 114.0913404241 CCC(O)CCC#[NH+]
270 282.1196804121 CC1=NC2=C(O)N=C([NH3+])N=C2N1C1CC(O)C(CO)O1
271 87.0804413921 C=CC([OH2+])CC
272 376.1615452241 CCC(O)CCN1C(=[OH+])C2=C(N=C1NC)N(C1=CC(O)=C(C=O)O1)C(C)=N2 Intermediate Fragment 
273 376.1615452241 CCC(O)CC(C)N1C(=[OH+])C2=C(N=C1N)N(C1=CC(O)=C(C=O)O1)C(C)=N2 Intermediate Fragment 
