#In-silico ESI-MS/MS [M+H]+ Spectra
#PREDICTED BY CFM-ID 4.0.8
#SMILES=[nH]1c(nc2c(c1=O)ncn2[C@H]1C[C@H]([C@H](O1)CO)O)NCC
#InChiKey=VOKQFDULHQUWAV-BWZBUEFSSA-N
energy0
180.08799 100.00 26 66 52 57 36 82 69 72 75 62 (91.255 0.34378 0.26187 0.19253 0.11356 0.073359 0.059398 0.03672 0.02413 0.012454)
energy1
135.03014 5.63 29 (3.3902)
152.05669 23.97 33 (14.426)
164.05669 5.20 35 80 (3.1291 0.00026224)
180.08799 100.00 26 36 52 75 57 69 62 82 66 72 (55.778 2.8158 0.46364 0.26605 0.25011 0.20801 0.15747 0.15145 0.070534 0.031666)
energy2
29.03858 2.53 221 (0.82547)
43.01784 2.39 11 (0.77971)
45.03349 9.62 12 (3.1433)
55.01784 3.80 213 (1.2422)
57.03349 9.32 19 (3.0458)
59.04914 4.79 212 (1.5668)
101.05971 2.70 187 (0.88311)
110.03489 5.16 40 (1.6847)
135.03014 3.11 29 (1.0163)
137.04579 5.75 30 (1.8781)
149.04579 2.18 77 85 (0.64408 0.066887)
150.04104 9.65 32 (3.1519)
152.05669 14.76 33 (4.8224)
153.07709 3.56 79 73 (1.0435 0.12062)
162.07742 2.60 27 (0.84841)
163.06144 3.19 74 37 58 83 (0.85177 0.1259 0.046703 0.019082)
164.05669 3.22 35 80 (0.98704 0.063753)
164.09307 3.96 2 (1.2937)
165.07709 2.52 116 182 (0.42601 0.39836)
178.07234 9.00 154 25 81 51 61 (1.779 0.91804 0.16356 0.059755 0.021019)
180.08799 100.00 75 26 36 57 62 66 52 82 72 69 (12.903 7.8875 4.9705 1.833 1.2764 1.197 1.0494 0.80489 0.48673 0.2684)
182.10364 7.30 86 87 89 90 (0.99986 0.98245 0.20218 0.20136)
192.08799 2.89 142 (0.94441)
194.10364 5.07 141 (1.6583)
206.10364 4.15 158 162 161 160 159 (0.5579 0.31748 0.16445 0.1596 0.15509)
208.08290 6.46 172 140 (1.3686 0.74289)
226.08223 3.48 115 (1.1378)
236.11420 2.07 173 177 181 175 174 176 180 (0.16728 0.14763 0.10298 0.074216 0.072122 0.057451 0.054839)
250.09347 3.76 109 107 222 227 (1.0788 0.14809 0.00099933 0.00010332)
260.11420 4.23 194 193 (0.90167 0.47971)

0 296.1353304761 CC[NH2+]c1nc2c(ncn2C2CC(O)C(CO)O2)c(=O)[nH]1
1 278.1247657921 CC[NH2+]C1=NC=C2N=CN(C3=CC(O)C(CO)O3)C2=N1
2 164.0930717401 CC[NH2+]C1=NC=C2N=CNC2=N1
3 119.0702706321 OC1CCOC1C[OH2+]
4 117.0546205681 OC1C=COC1C[OH2+]
5 85.0284058201 [OH2+]C1=COC=C1
6 87.0440558841 [OH2+]C1C=COC1
7 89.0597059481 [OH2+]C1CCOC1
8 99.0440558841 CC1=C([OH2+])C=CO1
9 99.0440558841 [OH2+]CC1=CC=CO1
10 117.0546205681 C=C(O)C(=C[OH2+])OC Intermediate Fragment 
11 43.0178411361 C#C[OH2+]
12 45.0334912001 C=C[OH2+]
13 117.0546205681 C=COC(=CO)C[OH2+] Intermediate Fragment 
14 89.0597059481 C=C[OH+]CCO
15 73.0284058201 OC#CC[OH2+]
16 75.0440558841 OC=CC[OH2+]
17 91.0389705041 OC=C([OH2+])CO
18 117.0546205681 OC=C=COCC[OH2+] Intermediate Fragment 
19 57.0334912001 C#CC[OH2+]
20 117.0546205681 OC=C=C(O)CC[OH2+] Intermediate Fragment 
21 89.0597059481 C=C(O)CC[OH2+]
22 99.0440558841 C#CC(O)=CC[OH2+]
23 117.0546205681 C=C=C(O)C(O)C[OH2+] Intermediate Fragment 
24 115.0389705041 OC1=C(C[OH2+])OC=C1
25 178.0723362961 CC=[NH+]C1=NC(O)=C2N=CNC2=N1
26 180.0879863601 CC[NH2+]C1=NC(O)=C2N=CNC2=N1
27 162.0774216761 CC=[NH+]C1=NC=C2N=CNC2=N1
28 46.0651256761 CC[NH3+]
29 135.0301371361 [OH+]=C1N=CN=C2N=CN=C12
30 137.0457872001 [OH+]=C1N=CN=C2NCN=C12
31 139.0614372641 [OH+]=C1N=CN=C2NCNC12
32 150.0410361681 [NH3+]C1=NC(=O)C2=NC=NC2=N1
33 152.0566862321 [NH3+]C1=NC(=O)C2=NCNC2=N1
34 154.0723362961 [NH3+]C1=NC(=O)C2NCNC2=N1
35 164.0566862321 C=[NH+]C1=NC(O)=C2N=CNC2=N1
36 180.0879863601 CC[NH2+]C(=N)N=C1NC=NC1=C=O Intermediate Fragment 
37 163.0614372641 C=CN=C=[NH+]C1=C(C=O)N=CN1
38 114.0661882961 [NH2+]=C1NCNC1C=O
39 112.0505382321 [NH2+]=C1NCN=C1C=O
40 110.0348881681 [NH2+]=C1N=CN=C1C=O
41 108.0192381041 N=C1N=CN=C1C#[O+]
42 69.0447245801 CC=NC#[NH+]
43 71.0603746441 CCNC#[NH+]
44 73.0760247081 CCNC=[NH2+]
45 97.0396392001 [OH+]=CC1=CNC=N1
46 95.0239891361 [O+]#CC1=CNC=N1
47 84.0556236121 C=C=NC(N)=[NH2+]
48 86.0712736761 CC=NC(N)=[NH2+]
49 150.0774216761 CC=NC(=[NH2+])N=C1C=NC=N1
50 152.0930717401 CCNC(=[NH2+])N=C1C=NC=N1
51 178.0723362961 CC=NC(=[NH2+])N=C1NC=NC1=C=O
52 180.0879863601 CC[NH2+]C(N=C1C=NC=N1)=NC=O Intermediate Fragment 
53 137.0821727081 CCN=C=[NH+]C1=CN=CN1
54 135.0665226441 C=CN=C=[NH+]C1=CN=CN1
55 133.0508725801 C#CN=C=[NH+]C1=CN=CN1
56 82.0399735481 [NH2+]=C1C=NC=N1
57 180.0879863601 CC=[NH+]C(N)=NC(=O)C1=CNC=N1 Intermediate Fragment 
58 163.0614372641 C=CN=C=[NH+]C(=O)C1=CNC=N1
59 112.0505382321 C=C=NC(=N)[NH2+]C=O
60 82.0399735481 [CH+]=C=NC(=N)N
61 178.0723362961 C=C=NC(N)=[NH+]C(=O)C1=CNC=N1
62 180.0879863601 CC[NH+]=C=NC(O)=C1N=CNC1=N Intermediate Fragment 
63 56.0494756121 C=C[NH+]=C
64 125.0457872001 N=C1N=CN=C1C([NH3+])=O
65 99.0552892641 CCN=C=[NH+]C=O
66 180.0879863601 CC[NH+]=C=NC1=C(C(N)=O)N=CN1 Intermediate Fragment 
67 114.0661882961 [NH3+]C(=O)C1=CNCN1
68 112.0505382321 [NH3+]C(=O)C1=CNC=N1
69 180.0879863601 CC[NH2+]C1=NC(O)=CC(N=C=N)=N1 Intermediate Fragment 
70 138.0661882961 CC=[NH+]C1=NC(O)=CC=N1
71 136.0505382321 C=C=[NH+]C1=NC(O)=CC=N1
72 180.0879863601 CC[NH2+]C1=NC(O)=C(N=C=N)C=N1 Intermediate Fragment 
73 153.0770873281 CC=NC1=NC(O)=C([NH3+])C=N1
74 163.0614372641 C=C=NC1=NC(O)=C([NH+]=C)C=N1
75 180.0879863601 C=NC1=C(O)N=C([NH+]=CC)N=C1N Intermediate Fragment 
76 30.0338255481 C=[NH2+]
77 149.0457872001 [CH+]=C=NC1=NC(O)=CC(N)=N1
78 151.0614372641 C=C=NC1=NC(O)=CC([NH3+])=N1
79 153.0770873281 CC=NC1=NC(O)=CC([NH3+])=N1
80 164.0566862321 [CH+]=C=NC1=NC(O)=C(N)C(N)=N1
81 178.0723362961 C=C=NC1=NC(O)=C([NH+]=C)C(N)=N1
82 180.0879863601 C=NC1=NC([NH+]=CC)=NC(O)=C1N Intermediate Fragment 
83 163.0614372641 C=C=NC1=NC(O)=CC([NH+]=C)=N1
84 151.0614372641 C=C=NC1=NC(O)=C([NH3+])C=N1
85 149.0457872001 [CH+]=C=NC1=NC(O)=C(N)C=N1
86 182.1036364241 CC[NH2+]C1=NC(O)=C2NCNC2=N1
87 182.1036364241 CC[NH2+]C(=N)N=C1NCNC1=C=O Intermediate Fragment 
88 88.0869237401 CCNC(N)=[NH2+]
89 182.1036364241 CC[NH2+]C=NC(O)=C1N=CNC1=N Intermediate Fragment 
90 182.1036364241 C=NC1=C(O)N=C([NH2+]CC)N=C1N Intermediate Fragment 
91 184.1192864881 CC[NH2+]C1=NC(O)C2NCNC2=N1
92 184.1192864881 CC[NH2+]C(=N)N=C1NCNC1=CO Intermediate Fragment 
93 186.1349365521 CC[NH2+]C1=NC(O)C2NCNC2N1
94 264.1091157281 CC[NH2+]C1=NC(O)=C2N=CN(C3=CC(O)CO3)C2=N1
95 266.1247657921 CC[NH2+]C1=NC(O)=C2N=CN(C3CC(O)CO3)C2=N1
96 268.1404158561 CC[NH2+]C1=NC(O)=C2NCN(C3CC(O)CO3)C2=N1
97 278.1247657921 CC[NH2+]C1=NC(O)=C2N=CN(C3=CC(O)C(C)O3)C2=N1
98 278.1247657921 CC[NH2+]C1=NC(O)=C2N=CN(C=C=C(O)C(C)O)C2=N1 Intermediate Fragment 
99 278.1247657921 CC[NH2+]C1=NC(O)=C2N=CN(C3=CCC(CO)O3)C2=N1
100 278.1247657921 CC[NH2+]C1=NC(O)=C2N=CN(C(O)=C=CCCO)C2=N1 Intermediate Fragment 
101 44.0494756121 CC=[NH2+]
102 251.0774812521 OCC1OC(N2C=NC3=C([OH2+])N=CN=C32)=CC1O
103 253.0931313161 OCC1OC(N2C=NC3=C([OH2+])N=CN=C32)CC1O
104 255.1087813801 OCC1OC(N2CNC3=C([OH2+])N=CN=C32)CC1O
105 266.0883802841 [NH3+]C1=NC(O)=C2N=CN(C3=CC(O)C(CO)O3)C2=N1
106 268.1040303481 [NH3+]C1=NC(O)=C2N=CN(C3CC(O)C(CO)O3)C2=N1
107 250.0934656641 CC1OC(N2C=NC3=C(O)N=C([NH3+])N=C32)=CC1O
108 268.1040303481 [NH3+]C1=NC(O)=C2N=CN(C=CC(O)C(O)CO)C2=N1 Intermediate Fragment 
109 250.0934656641 [NH3+]C1=NC(O)=C2N=CN(C#CC(O)CCO)C2=N1
110 268.1040303481 [NH3+]C1=NC(O)=C2N=CN(C(O)=CC(O)CCO)C2=N1 Intermediate Fragment 
111 268.1040303481 [NH3+]C1=NC(O)=C2N=CN(C(=CCO)OCCO)C2=N1 Intermediate Fragment 
112 270.1196804121 [NH3+]C1=NC(O)=C2NCN(C3CC(O)C(CO)O3)C2=N1
113 296.1353304761 CC[NH2+]C(=N)N=C1C(=C=O)N=CN1C1CC(O)C(CO)O1 Intermediate Fragment 
114 279.1087813801 CCNC=[NH+]C1=C(C=O)N=CN1C1=CC(O)=C(CO)O1
115 226.0822322841 [NH2+]=C1C(=C=O)N=CN1C1CC(O)C(CO)O1
116 165.0770873281 CCN=C=[NH+]C1=C(C=O)N=CN1
117 268.1404158561 CCNC(=[NH2+])N=C1C=NCN1C1=CC(O)C(CO)O1
118 296.1353304761 CC[NH2+]C(=NC=O)N=C1C=NCN1C1=CC(O)C(CO)O1 Intermediate Fragment 
119 253.1295168241 CCNC=[NH+]C1=CN=CN1C1=CC(O)C(CO)O1
120 251.1138667601 CCNC=[NH+]C1=CN=CN1C1=CC(O)=C(CO)O1
121 296.1353304761 CC[NH2+]C(N)=NC(=O)C1=CN(C2=CC(O)C(CO)O2)C=N1 Intermediate Fragment 
122 279.1087813801 CCNC=[NH+]C(=O)C1=CN(C2=CC(O)=C(CO)O2)C=N1
123 209.0556831881 OCC1=C(O)C=C(N2C=NC(C=[OH+])=C2)O1
124 213.0869833161 OCC1OC(N2C=NC(C=[OH+])=C2)CC1O
125 296.1353304761 CC[NH2+]C=NC(O)=C1N=CN(C2=CC(O)C(CO)O2)C1=N Intermediate Fragment 
126 241.0931313161 N=C1C(=C([NH3+])O)N=CN1C1=CC(O)C(CO)O1
127 224.0665822201 [NH2+]=C1C(=C=O)N=CN1C1=CC(O)C(CO)O1
128 196.0716676001 [NH2+]=C1C=NCN1C1=CC(O)=C(CO)O1
129 296.1353304761 CC[NH2+]C=NC1=C(C(N)=O)N=CN1C1=CC(O)C(CO)O1 Intermediate Fragment 
130 296.1353304761 CC[NH2+]C1=NC(O)=CC(N(C=N)C2=CC(O)C(CO)O2)=N1 Intermediate Fragment 
131 279.1087813801 CCNC1=NC(O)=CC([NH+](C)C2=CC(O)=C(C=O)O2)=N1
132 140.0818383601 CC[NH2+]C1=NC(O)=CC=N1
133 159.0764186321 [NH+]#CNC1CC(O)C(CO)O1
134 142.0498695361 C=[NH+]C1=CC(O)=C(CO)O1
135 161.0920686961 [NH2+]=CNC1CC(O)C(CO)O1
136 144.0655196001 C=[NH+]C1=CC(O)C(CO)O1
137 296.1353304761 CC[NH2+]C1=NC(O)=C(N=C=NC2CC(O)C(CO)O2)C=N1 Intermediate Fragment 
138 296.1353304761 C=NC1=C(O)N=C([NH2+]CC)N=C1N=C1CC(O)C(CO)O1 Intermediate Fragment 
139 296.1353304761 C=C(O)C(CO)OCN1C=NC2=C(O)N=C([NH2+]CC)N=C21 Intermediate Fragment 
140 208.0829009801 CC=[NH+]C1=NC(O)=C2N=CN(CO)C2=N1
141 194.1036364241 CC[NH2+]C1=NC(O)=C2N=CN(C)C2=N1
142 192.0879863601 CC=[NH+]C1=NC(O)=C2N=CN(C)C2=N1
143 296.1353304761 CC[NH2+]C1=NC(O)=C2N=CN(C=CC(O)C(O)CO)C2=N1 Intermediate Fragment 
144 107.0702706321 CC(O)C([OH2+])CO
145 105.0546205681 C=C(O)C([OH2+])CO
146 190.0723362961 C=C=[NH+]C1=NC(O)=C2N=CN(C)C2=N1
147 196.1192864881 CC[NH2+]C1=NC(O)=C2NCN(C)C2=N1
148 198.1349365521 CC[NH2+]C1=NC(O)C2NCN(C)C2=N1
149 93.0546205681 OCC([OH2+])CO
150 61.0284058201 OCC=[OH+]
151 73.0284058201 CC([OH2+])=C=O
152 89.0233204401 O=CC([OH2+])=CO
153 204.0879863601 C#CN1C=NC2=C(O)N=C([NH2+]CC)N=C21
154 178.0723362961 C=CN1C=NC2=C(O)N=C([NH3+])N=C21
155 204.0879863601 C#CN1C=NC(=C=O)C1=NC(=N)[NH2+]CC Intermediate Fragment 
156 204.0879863601 C#CN1C=NC(=C(O)N=C=[NH+]CC)C1=N Intermediate Fragment 
157 134.0348881681 C#CN1C=NC(=C=O)C1=[NH2+]
158 206.1036364241 C=CN1C=NC2=C(O)N=C([NH2+]CC)N=C21
159 206.1036364241 C=CN1C=NC(=C=O)C1=NC(=N)[NH2+]CC Intermediate Fragment 
160 206.1036364241 C#CN1CN=CC1=NC(=NC=O)[NH2+]CC Intermediate Fragment 
161 206.1036364241 C#CN1C=NC(C(=O)N=C(N)[NH2+]CC)=C1 Intermediate Fragment 
162 206.1036364241 C#CN1C=NC(=C(O)N=C[NH2+]CC)C1=N Intermediate Fragment 
163 208.1192864881 CC[NH2+]C1=NC(O)=C2N=CN(CC)C2=N1
164 190.1087218041 C=CN1C=NC2=CN=C([NH2+]CC)N=C21
165 208.1192864881 CC[NH2+]C(=N)N=C1C(=C=O)N=CN1CC Intermediate Fragment 
166 208.1192864881 C=CN1C=NC(C(=O)N=C(N)[NH2+]CC)=C1 Intermediate Fragment 
167 208.1192864881 C=CN1C=NC(=C(O)N=C[NH2+]CC)C1=N Intermediate Fragment 
168 210.1349365521 CC[NH2+]C1=NC(O)=C2NCN(CC)C2=N1
169 212.1505866161 CC[NH2+]C1=NC(O)C2NCN(CC)C2=N1
170 63.0440558841 OCC[OH2+]
171 234.0985510441 CC[NH2+]C1=NC(O)=C2N=CN(C#CCO)C2=N1
172 208.0829009801 [NH3+]C1=NC(O)=C2N=CN(C=CCO)C2=N1
173 236.1142011081 CC[NH2+]C1=NC(O)=C2N=CN(C=CCO)C2=N1
174 236.1142011081 CC[NH2+]C(=N)N=C1C(=C=O)N=CN1C=CCO Intermediate Fragment 
175 236.1142011081 CC[NH2+]C(=NC=O)N=C1C=NCN1C#CCO Intermediate Fragment 
176 236.1142011081 CC[NH2+]C(N)=NC(=O)C1=CN(C#CCO)C=N1 Intermediate Fragment 
177 236.1142011081 CC[NH2+]C=NC(O)=C1N=CN(C#CCO)C1=N Intermediate Fragment 
178 181.0720019481 N=C1C(=C([NH3+])O)N=CN1C#CCO
179 164.0454528521 [NH2+]=C1C(=C=O)N=CN1C#CCO
180 236.1142011081 CC[NH2+]C1=NC(O)=CC(N(C#CCO)C=N)=N1 Intermediate Fragment 
181 236.1142011081 CC[NH2+]C1=NC(O)=C(N=C=NC=CCO)C=N1 Intermediate Fragment 
182 165.0770873281 C=[NH+]C1=C(O)N=C(N=CC)N=C1
183 238.1298511721 CC[NH2+]C1=NC(O)=C2N=CN(CCCO)C2=N1
184 240.1455012361 CC[NH2+]C1=NC(O)=C2NCN(CCCO)C2=N1
185 278.1247657921 CC[NH2+]C1=NC(O)=C2N=CN(C#CC(O)CCO)C2=N1
186 103.0753560121 C=CC(O)CC[OH2+]
187 101.0597059481 C#CC(O)CC[OH2+]
188 202.0723362961 C#CN1C=NC2=C(O)N=C([NH+]=CC)N=C21
189 232.0829009801 CC[NH2+]C1=NC(O)=C2N=CN(C#CC=O)C2=N1
190 246.0985510441 C=C(O)C#CN1C=NC2=C(O)N=C([NH2+]CC)N=C21
191 248.1142011081 CC[NH2+]C1=NC(O)=C2N=CN(C#CC(C)O)C2=N1
192 250.1298511721 CC[NH2+]C1=NC(O)=C2N=CN(C=CC(C)O)C2=N1
193 260.1142011081 CC=C(O)C#CN1C=NC2=C(O)N=C([NH2+]CC)N=C21
194 260.1142011081 CC[NH2+]C1=NC(O)=C2N=CN(C#CC=CCO)C2=N1
195 252.1091157281 [NH3+]C1=NC(O)=C2N=CN(C=CC(O)CCO)C2=N1
196 278.1247657921 CC[NH2+]C(=N)N=C1C(=C=O)N=CN1C#CC(O)CCO Intermediate Fragment 
197 278.1247657921 CC[NH2+]C=NC(O)=C1N=CN(C#CC(O)=CCO)C1=N Intermediate Fragment 
198 225.0982166961 N=C1C(=C([NH3+])O)N=CN1C#CC(O)CCO
199 208.0716676001 [NH2+]=C1C(=C=O)N=CN1C#CC(O)CCO
200 278.1247657921 CC[NH2+]C1=NC(O)=CC(N(C#CC(O)=CCO)C=N)=N1 Intermediate Fragment 
201 296.1353304761 CC[NH2+]C1=NC(O)=C2N=CN(C(O)=CC(O)CCO)C2=N1 Intermediate Fragment 
202 91.0753560121 CC(O)CC[OH2+]
203 73.0647913281 C=C([OH2+])CC
204 71.0491412641 C=CC(=C)[OH2+]
205 71.0491412641 C#CCC[OH2+]
206 87.0440558841 C=C(O)C=C[OH2+]
207 206.0672509161 C=C=[NH+]C1=NC(O)=C2N=CN(CO)C2=N1
208 180.0516008521 [NH3+]C1=NC(O)=C2N=CN(C=O)C2=N1
209 210.0985510441 CC[NH2+]C1=NC(O)=C2N=CN(CO)C2=N1
210 212.1142011081 CC[NH2+]C1=NC(O)=C2NCN(CO)C2=N1
211 77.0597059481 OCCC[OH2+]
212 59.0491412641 CC=C[OH2+]
213 55.0178411361 [CH2+]C#CO
214 71.0127557561 OC#CC=[OH+]
215 220.0829009801 C=C(O)N1C=NC2=C(O)N=C([NH+]=CC)N=C21
216 222.0985510441 C=C(O)N1C=NC2=C(O)N=C([NH2+]CC)N=C21
217 224.1142011081 CC[NH2+]C1=NC(O)=C2N=CN(C(C)O)C2=N1
218 226.1298511721 CC[NH2+]C1=NC(O)=C2NCN(C(C)O)C2=N1
219 228.1455012361 CC[NH2+]C1=NC(O)C2NCN(C(C)O)C2=N1
220 47.0491412641 CC[OH2+]
221 29.0385765801 C=[CH3+]
222 250.0934656641 CC[NH2+]C1=NC(O)=C2N=CN(C(O)=C=CO)C2=N1
223 252.1091157281 CC[NH2+]C1=NC(O)=C2N=CN(C(O)=CCO)C2=N1
224 254.1247657921 CC[NH2+]C1=NC(O)=C2N=CN(C(O)CCO)C2=N1
225 294.1196804121 CC[NH2+]C1=NC(O)=C2N=CN(C(O)=C=C(O)CCO)C2=N1
226 296.1353304761 CC[NH2+]C1=NC(O)=C2N=CN(C(=CCO)OCCO)C2=N1 Intermediate Fragment 
227 250.0934656641 CC[NH2+]C1=NC(O)=C2N=CN(COC#CO)C2=N1
228 252.1091157281 CC[NH2+]C1=NC(O)=C2N=CN(COC=CO)C2=N1
229 254.1247657921 CC[NH2+]C1=NC(O)=C2N=CN(COCCO)C2=N1
230 266.1247657921 C=C(OCCO)N1C=NC2=C(O)N=C([NH2+]CC)N=C21
231 268.1404158561 CC[NH2+]C1=NC(O)=C2N=CN(C(C)OCCO)C2=N1
232 296.1353304761 C=C(OC(CO)CO)N1C=NC2=C(O)N=C([NH2+]CC)N=C21 Intermediate Fragment 
