#In-silico ESI-MS/MS [M+H]+ Spectra
#PREDICTED BY CFM-ID 4.0.8
#SMILES=n12c(nc3c(c1=O)ncn3[C@@H]1O[C@H](CO)[C@@H](C1)O)NCCC2O
#InChiKey=INAGNQRTDPXONR-AIPQFCGWSA-N
energy0
208.08290 100.00 15 45 23 18 32 42 58 20 34 37 59 56 52 30 139 (83.5 3.2856 1.7451 0.094068 0.069008 0.028703 0.016305 0.014226 0.014098 0.0094205 0.0083585 0.0082852 0.0075561 0.0035624 7.3538e-06)
energy1
190.07234 82.77 17 16 (39.759 0.30261)
208.08290 100.00 15 23 45 20 58 56 37 32 42 30 52 59 34 18 139 (44.194 2.5576 0.55827 0.24784 0.23774 0.23169 0.10854 0.083928 0.058561 0.040337 0.0257 0.024048 0.018012 0.015878 2.4763e-05)
energy2
45.03349 8.79 159 (1.7419)
55.01784 5.91 173 (1.1707)
57.03349 32.85 9 (6.5091)
59.04914 8.24 175 (1.6322)
71.04914 4.45 185 186 (0.61047 0.27065)
150.04104 18.65 50 (3.695)
166.06110 5.47 119 33 (0.79038 0.29325)
178.07234 6.78 57 144 29 (0.82393 0.51977 0.00081094)
190.07234 58.64 17 16 (11.56 0.060875)
192.08799 10.90 63 (2.1602)
194.06725 7.45 151 (1.4766)
194.10364 7.91 65 (1.5677)
196.11929 8.49 68 (1.6834)
208.08290 100.00 45 15 37 52 139 23 58 20 42 30 34 56 18 32 59 (6.2867 5.5356 2.9774 1.6862 0.82499 0.48887 0.48215 0.33657 0.31349 0.28811 0.19314 0.14616 0.093518 0.08763 0.076981)
218.10364 4.75 88 (0.94206)
232.08290 7.86 132 149 (1.1103 0.44767)
234.09855 11.42 131 90 (1.2075 1.0554)
238.12985 5.39 167 142 (0.66819 0.40004)
246.09855 7.45 87 (1.4755)
248.07782 4.83 147 208 (0.73336 0.22296)
248.11420 6.02 137 86 (0.79197 0.40027)
250.09347 6.22 198 200 199 205 150 148 (0.34245 0.32235 0.30022 0.19224 0.061461 0.014845)
254.12477 14.53 154 (2.8794)
266.08838 29.83 207 209 211 210 (4.0414 0.79298 0.57039 0.50592)
268.14042 5.67 135 (1.1236)
288.10912 18.99 85 81 82 133 127 (1.1323 1.1229 0.75208 0.56377 0.19293)

0 324.1302450961 OCC1OC(n2cnc3c(=[OH+])n4c(nc32)NCCC4O)CC1O
1 306.1196804121 OC1CC(N2C=NC3=C2N=C2NCCC(O)N2C3)OC1=C=[OH+]
2 119.0702706321 OC1CCOC1C[OH2+]
3 119.0702706321 O=CCC(O)CC[OH2+] Intermediate Fragment 
4 117.0546205681 OC1CCOC1=C[OH2+]
5 99.0440558841 C=C1OCC=C1[OH2+]
6 99.0440558841 [OH+]=C=C1CCCO1
7 117.0546205681 CCC(O)C(=O)C=[OH+] Intermediate Fragment 
8 99.0440558841 CC=C(O)C#C[OH2+]
9 57.0334912001 CC#C[OH2+]
10 117.0546205681 O=CCC(O)C=C[OH2+] Intermediate Fragment 
11 117.0546205681 OCCCOC#C[OH2+] Intermediate Fragment 
12 117.0546205681 CCOC(=C=[OH+])CO Intermediate Fragment 
13 115.0389705041 OC1CCOC1=C=[OH+]
14 206.0672509161 OC1CC=NC2=NC3=C(N=CN3)C(=[OH+])N21
15 208.0829009801 OC1CCNC2=NC3=C(N=CN3)C(=[OH+])N21
16 190.0723362961 [OH2+]C1=CC=NC2=NC3=C(CN12)N=CN3
17 190.0723362961 [OH+]=C1C2=C(N=C3N=CCCN13)NC=N2
18 208.0829009801 N=C1N=CCC(O)N1C(=[OH+])C1=CNC=N1 Intermediate Fragment 
19 95.0239891361 [O+]#CC1=CNC=N1
20 208.0829009801 OC1CC=NC(=NC2=CN=CN2)N1C=[OH+] Intermediate Fragment 
21 82.0399735481 [NH2+]=C1C=NC=N1
22 180.0879863601 OC1CCNC([NH+]=C2C=NC=N2)=N1
23 208.0829009801 OC1CCNC(N=C2NC=NC2=C=[OH+])=N1 Intermediate Fragment 
24 112.0505382321 [NH2+]=C1NCN=C1C=O
25 110.0348881681 [NH2+]=C1N=CN=C1C=O
26 108.0192381041 N=C1N=CN=C1C#[O+]
27 99.0552892641 [OH2+]C1CC=NC=N1
28 101.0709393281 [OH2+]C1CCNC=N1
29 178.0723362961 OC1CC=NC([NH+]=C2C=NC=N2)=N1
30 208.0829009801 N=C1NC=NC1=C([OH2+])N1C=NC=CC1O Intermediate Fragment 
31 191.0563518841 O=C1C=CN=CN1C(=[OH+])C1=CNC=N1
32 208.0829009801 N=C=NC1=CC(=[OH+])N2C(=N1)NCCC2O Intermediate Fragment 
33 166.0611029161 OC1CC=NC2=NC=CC(=[OH+])N21
34 208.0829009801 N=C=NC1=CN=C2NCCC(O)N2C1=[OH+] Intermediate Fragment 
35 164.0454528521 OC1=CC=NC2=NC=CC(=[OH+])N12
36 181.0720019481 [NH2+]=C1C=NC2=NCCC(O)N2C1=O
37 208.0829009801 C=NC1=C(N)N=C2N=CCC(O)N2C1=[OH+] Intermediate Fragment 
38 179.0563518841 [NH3+]C1=CC(=O)N2C(O)=CC=NC2=N1
39 181.0720019481 [NH3+]C1=CC(=O)N2C(=N1)N=CCC2O
40 191.0563518841 C=[NH+]C1=CN=C2N=CC=C(O)N2C1=O
41 206.0672509161 C=[NH+]C1=C(N)N=C2N=CC=C(O)N2C1=O
42 208.0829009801 C=NC1=C(N)C(=[OH+])N2C(=N1)N=CCC2O Intermediate Fragment 
43 191.0563518841 C=[NH+]C1=CC(=O)N2C(O)=CC=NC2=N1
44 177.0407018201 [NH2+]=C1C=NC2=NC=CC(=O)N2C1=O
45 208.0829009801 C=CC(O)N1C(=[OH+])C2=C(N=C1N)NC=N2 Intermediate Fragment 
46 180.0516008521 [NH3+]C1=NC2=C(N=CN2)C(=O)N1C=O
47 156.0879863601 [NH3+]C1=NC(O)C2NCNC2=N1
48 154.0723362961 [NH3+]C1=NC(=O)C2NCNC2=N1
49 152.0566862321 [NH3+]C1=NC(=O)C2=NCNC2=N1
50 150.0410361681 [NH3+]C1=NC(=O)C2=NC=NC2=N1
51 206.0672509161 C#CC(O)N1C(=O)C2=C(N=C1[NH3+])NC=N2
52 208.0829009801 C=NC1=NC2=C(N=CN2)C(=[OH+])N1C(C)O Intermediate Fragment 
53 166.0723362961 C[NH2+]C1=NC(O)=C2N=CNC2=N1
54 164.0566862321 C=[NH+]C1=NC(O)=C2N=CNC2=N1
55 162.0410361681 C#[N+]C1=NC(O)=C2N=CNC2=N1
56 208.0829009801 CC=NC1=NC2=C(N=CN2)C(=[OH+])N1CO Intermediate Fragment 
57 178.0723362961 CC=[NH+]C1=NC(O)=C2N=CNC2=N1
58 208.0829009801 OCCC=NC1=NC([OH2+])=C2N=CNC2=N1 Intermediate Fragment 
59 208.0829009801 N=CCC(O)N1C=NC2=C(N=CN2)C1=[OH+] Intermediate Fragment 
60 191.0563518841 C#CC(O)N1C=NC2=C(N=CN2)C1=[OH+]
61 135.0301371361 [OH+]=C1N=CN=C2N=CN=C12
62 210.0985510441 OC1CCNC2=NC3=C(NCN3)C(=[OH+])N21
63 192.0879863601 [OH+]=C1C2=C(N=C3NCCCN13)NC=N2
64 212.1142011081 OC1CCNC2=NC3=C(NCN3)C([OH2+])N21
65 194.1036364241 [OH+]=C1C2=C(N=C3NCCCN13)NCN2
66 212.1142011081 CCC(O)N1C(=[OH+])C2=C(N=C1N)NCN2 Intermediate Fragment 
67 214.1298511721 OC1CCNC2=NC3NCNC3C([OH2+])N21
68 196.1192864881 [OH2+]C1C2=C(N=C3NCCCN31)NCN2
69 292.1040303481 OC1=COC(N2C=NC3=C2N=C2NCCC(O)N2C3=[OH+])C1
70 294.1196804121 OC1COC(N2C=NC3=C2N=C2NCCC(O)N2C3=[OH+])C1
71 276.1091157281 OC1=COC(N2C=NC3=C2N=C2NCCCN2C3=[OH+])C1
72 294.1196804121 CCC(O)N1C(=[OH+])C2=C(N=C1N)N(C1CC(O)=CO1)C=N2 Intermediate Fragment 
73 296.1353304761 OC1COC(N2CNC3=C2N=C2NCCC(O)N2C3=[OH+])C1
74 306.1196804121 C=C1OC(N2C=NC3=C2N=C2NCCC(O)N2C3=[OH+])CC1O
75 306.1196804121 CC(=O)C(O)=CCN1C=NC2=C1N=C1NCCC(O)N1C2=[OH+] Intermediate Fragment 
76 306.1196804121 C=C(C=O)OC(C)N1C=NC2=C1N=C1NCCC(O)N1C2=[OH+] Intermediate Fragment 
77 306.1196804121 C=C1OC(N2C=NC3=C2N=C(N)N(C(O)CC)C3=[OH+])C=C1O Intermediate Fragment 
78 306.1196804121 OC=C1OC(N2C=NC3=C2N=C2NCCCN2C3=[OH+])CC1O
79 188.0566862321 [OH+]=C1C2=C(N=C3N=CC=CN13)NC=N2
80 278.1247657921 OC1COC(N2C=NC3=C2N=C2NCCCN2C3=[OH+])C1
81 288.1091157281 C=C1OC(N2C=NC3=C2N=C2NCCCN2C3=[OH+])C=C1O
82 288.1091157281 O=C=C1CCC(N2C=NC3=C2N=C2NCCCN2C3=[OH+])O1
83 306.1196804121 N=CN(C1=CC(=[OH+])N2CCCNC2=N1)C1CC(O)C(=C=O)O1 Intermediate Fragment 
84 306.1196804121 O=CC(=O)C(O)CCN1C=NC2=C1N=C1NCCCN1C2=[OH+] Intermediate Fragment 
85 288.1091157281 OC#CC(O)=CCN1C=NC2=C1N=C1NCCCN1C2=[OH+]
86 248.1142011081 OC=CCN1C=NC2=C1N=C1NCCCN1C2=[OH+]
87 246.0985510441 OC#CCN1C=NC2=C1N=C1NCCCN1C2=[OH+]
88 218.1036364241 CCN1C=NC2=C1N=C1N=CCCN1C2=[OH+]
89 306.1196804121 CC(OC(=C=O)CO)N1C=NC2=C1N=C1NCCCN1C2=[OH+] Intermediate Fragment 
90 234.0985510441 CC(=O)N1C=NC2=C1N=C1NCCCN1C2=[OH+]
91 306.1196804121 OC#COC(CCO)N1C=NC2=C1N=C1NCCCN1C2=[OH+] Intermediate Fragment 
92 306.1196804121 O=C(CC(O)C=CO)N1C=NC2=C1N=C1NCCCN1C2=[OH+] Intermediate Fragment 
93 75.0440558841 OCC=C[OH2+]
94 306.1196804121 CCNC1=NC2=C(N=CN2C2CC(O)C(=C=O)O2)C(=[OH+])N1C Intermediate Fragment 
95 306.1196804121 CCCNC1=NC([OH2+])=C2N=CN(C3CC(O)C(=C=O)O3)C2=N1 Intermediate Fragment 
96 324.1302450961 N=C1NCCC(O)N1C(=[OH+])C1=CN(C2CC(O)C(=CO)O2)C=N1 Intermediate Fragment 
97 183.0764186321 OC1CC(N2C=CN=C2)OC1=C[OH2+]
98 209.0556831881 O=C=C1OC(N2C=NC(C=[OH+])=C2)CC1O
99 211.0713332521 OC=C1OC(N2C=NC(C=[OH+])=C2)CC1O
100 213.0869833161 OCC1OC(N2C=NC(C=[OH+])=C2)CC1O
101 324.1302450961 OC=C1OC(N2C=NC=C2N=C2NCCC(O)N2C=[OH+])CC1O Intermediate Fragment 
102 296.1353304761 OC=C1OC(N2CN=CC2=[NH+]C2=NC(O)CCN2)CC1O
103 296.1353304761 O=C(CC(O)C=CO)N1CN=CC1=[NH+]C1=NC(O)CCN1 Intermediate Fragment 
104 294.1196804121 O=C=C1OC(N2CN=CC2=[NH+]C2=NC(O)CCN2)CC1O
105 324.1302450961 OCC1OC(N2C=NC(=C=[OH+])C2=NC2=NC(O)CCN2)CC1O Intermediate Fragment 
106 226.0822322841 [NH2+]=C1C(=C=O)N=CN1C1CC(O)C(CO)O1
107 83.0603746441 C1=NC=[NH+]CC1
108 114.0661882961 [NH3+]C1=NC(O)CC=N1
109 324.1302450961 N=C1C(=C([OH2+])N2CNCCC2O)N=CN1C1CC(O)C(=C=O)O1 Intermediate Fragment 
110 198.0873176641 [NH2+]=C1C=NCN1C1CC(O)C(=CO)O1
111 198.0873176641 [NH2+]=C1C=NCN1C(=O)CC(O)C=CO Intermediate Fragment 
112 224.0665822201 [NH2+]=C1C(=C=O)N=CN1C1CC(O)C(=CO)O1
113 324.1302450961 N=CN(C1=CC(=[OH+])N2C(=N1)NCCC2O)C1CC(O)C(=CO)O1 Intermediate Fragment 
114 307.1036960001 C[NH+](C1=CC(=O)N2C(=N1)NCCC2O)C1C=C(O)C(=C=O)O1
115 297.1193460641 O=C1C=C([NH+]=C2CC(O)C(CO)O2)N=C2NCCC(O)N12
116 168.0767529801 OC1CCNC2=NC=CC(=[OH+])N21
117 150.0661882961 [OH+]=C1C=CN=C2N=CCCN12
118 168.0767529801 C=CC(O)N1C(=[OH+])C=CN=C1N Intermediate Fragment 
119 166.0611029161 C#CC(O)N1C(=O)C=CN=C1[NH3+]
120 159.0764186321 [NH+]#CNC1CC(O)C(CO)O1
121 324.1302450961 OCC1OC(N=C=NC2=CN=C3NCCC(O)N3C2=[OH+])CC1O Intermediate Fragment 
122 324.1302450961 C=NC1=C(N=C2CC(O)C(CO)O2)N=C2NCCC(O)N2C1=[OH+] Intermediate Fragment 
123 199.1189521401 C[NH2+]C1=CN=C2NCCC(O)N2C1O
124 324.1302450961 O=C(CO)C(O)CCN1C=NC2=C1N=C1NCCC(O)N1C2=[OH+] Intermediate Fragment 
125 306.1196804121 OC#CC(O)CCN1C=NC2=C1N=C1NCCC(O)N1C2=[OH+]
126 278.1247657921 C=C(O)CCN1C=NC2=C1N=C1NCCC(O)N1C2=[OH+]
127 288.1091157281 C#CC(O)=CCN1C=NC2=C1N=C1NCCC(O)N1C2=[OH+]
128 264.1091157281 OC=CCN1C=NC2=C1N=C1NCCC(O)N1C2=[OH+]
129 262.0934656641 OC#CCN1C=NC2=C1N=C1NCCC(O)N1C2=[OH+]
130 236.1142011081 CCN1C=NC2=C1N=C1NCCC(O)N1C2=[OH+]
131 234.0985510441 CCN1C=NC2=C1N=C1N=CCC(O)N1C2=[OH+]
132 232.0829009801 CCN1C=NC2=C1N=C1N=CC=C(O)N1C2=[OH+]
133 288.1091157281 OC#CC=CCN1C=NC2=C1N=C1NCCC(O)N1C2=[OH+]
134 306.1196804121 OC#CC(O)CCN1C=NC(=C=[OH+])C1=NC1=NC(O)CCN1 Intermediate Fragment 
135 268.1404158561 OCCCN1CNC2=C1N=C1NCCC(O)N1C2=[OH+]
136 266.1247657921 OCCCN1C=NC2=C1N=C1NCCC(O)N1C2=[OH+]
137 248.1142011081 C=CCN1C=NC2=C1N=C1NCCC(O)N1C2=[OH+]
138 264.1091157281 CCC(O)N1C(=[OH+])C2=C(N=C1N)N(CC#CO)C=N2 Intermediate Fragment 
139 208.0829009801 [NH3+]C1=NC(O)=C2N=CN(CC=CO)C2=N1
140 63.0440558841 OCC[OH2+]
141 240.1455012361 CCN1CNC2=C1N=C1NCCC(O)N1C2[OH2+]
142 238.1298511721 CCN1CNC2=C1N=C1NCCC(O)N1C2=[OH+]
143 236.1142011081 C=CC(O)N1C(=[OH+])C2=C(N=C1N)N(CC)C=N2 Intermediate Fragment 
144 178.0723362961 C=CN1C=NC2=C(O)N=C([NH3+])N=C21
145 324.1302450961 CC(O)C(=CO)OCN1C=NC2=C1N=C1NCCC(O)N1C2=[OH+] Intermediate Fragment 
146 324.1302450961 CC(OC(=CO)CO)N1C=NC2=C1N=C1NCCC(O)N1C2=[OH+] Intermediate Fragment 
147 248.0778156001 CC(=O)N1C=NC2=C1N=C1N=CCC(O)N1C2=[OH+]
148 250.0934656641 CC(=O)N1C=NC2=C1N=C1NCCC(O)N1C2=[OH+]
149 232.0829009801 CC(=O)N1C=NC2=C1N=C1N=CCCN1C2=[OH+]
150 250.0934656641 C=CC(O)N1C(=[OH+])C2=C(N=C1N)N(C(C)=O)C=N2 Intermediate Fragment 
151 194.0672509161 CC(=O)N1C=NC2=C(O)N=C([NH3+])N=C21
152 252.1091157281 CC(O)N1C=NC2=C1N=C1NCCC(O)N1C2=[OH+]
153 252.1091157281 CCC(O)N1C(=[OH+])C2=C(N=C1N)N(C(C)=O)C=N2 Intermediate Fragment 
154 254.1247657921 CC(O)N1CNC2=C1N=C1NCCC(O)N1C2=[OH+]
155 294.1196804121 CC(OC=CO)N1C=NC2=C1N=C1NCCC(O)N1C2=[OH+]
156 324.1302450961 OC=COC(CCO)N1C=NC2=C1N=C1NCCC(O)N1C2=[OH+] Intermediate Fragment 
157 47.0491412641 CC[OH2+]
158 29.0385765801 C=[CH3+]
159 45.0334912001 C=C[OH2+]
160 278.0883802841 O=C(C=CO)N1C=NC2=C1N=C1NCCC(O)N1C2=[OH+]
161 280.1040303481 O=C(CCO)N1C=NC2=C1N=C1NCCC(O)N1C2=[OH+]
162 282.1196804121 OCCC(O)N1C=NC2=C1N=C1NCCC(O)N1C2=[OH+]
163 280.1040303481 OC=COCN1C=NC2=C1N=C1NCCC(O)N1C2=[OH+]
164 278.0883802841 OC#COCN1C=NC2=C1N=C1NCCC(O)N1C2=[OH+]
165 324.1302450961 O=C(CC(O)CCO)N1C=NC2=C1N=C1NCCC(O)N1C2=[OH+] Intermediate Fragment 
166 256.1404158561 CC(O)N1CNC2=C1N=C1NCCC(O)N1C2[OH2+]
167 238.1298511721 CC(O)N1CNC2=C1N=C1NCCCN1C2=[OH+]
168 256.1404158561 CCC(O)N1C(=[OH+])C2=C(N=C1N)N(C(C)O)CN2 Intermediate Fragment 
169 68.9971056921 [O+]#CC#CO
170 71.0127557561 O=CC#C[OH2+]
171 73.0284058201 OCC#C[OH2+]
172 43.0178411361 C#C[OH2+]
173 55.0178411361 C#CC=[OH+]
174 77.0597059481 OCCC[OH2+]
175 59.0491412641 C=CC[OH2+]
176 240.1091157281 OCN1CNC2=C1N=C1NCCC(O)N1C2=[OH+]
177 238.0934656641 OCN1C=NC2=C1N=C1NCCC(O)N1C2=[OH+]
178 236.0778156001 O=CN1C=NC2=C1N=C1NCCC(O)N1C2=[OH+]
179 218.0672509161 O=CN1C=NC2=C1N=C1N=CCCN1C2=[OH+]
180 236.0778156001 C=CC(O)N1C(=[OH+])C2=C(N=C1N)N(C=O)C=N2 Intermediate Fragment 
181 180.0516008521 [NH3+]C1=NC(O)=C2N=CN(C=O)C2=N1
182 234.0621655361 O=CN1C=NC2=C1N=C1N=CCC(O)N1C2=[OH+]
183 87.0440558841 CC(O)C#C[OH2+]
184 89.0597059481 CC(O)C=C[OH2+]
185 71.0491412641 C#CC(C)[OH2+]
186 71.0491412641 CCC#C[OH2+]
187 91.0753560121 CC(O)CC[OH2+]
188 73.0647913281 C=CC(C)[OH2+]
189 73.0647913281 CCC=C[OH2+]
190 322.1145950321 O=C(CC(O)C=CO)N1C=NC2=C1N=C1NCCC(O)N1C2=[OH+]
191 324.1302450961 CCC(O)N1C(=[OH+])C2=C(N=C1N)N(C1CC(O)C(=CO)O1)C=N2 Intermediate Fragment 
192 298.1145950321 [NH3+]C1=NC2=C(N=CN2C2CC(O)C(CO)O2)C(=O)N1CO
193 296.0989449681 [NH3+]C1=NC2=C(N=CN2C2CC(O)C(=CO)O2)C(=O)N1CO
194 278.0883802841 CN1C(=O)C2=C(N=C1[NH3+])N(C1CC(O)C(=C=O)O1)C=N2
195 272.1353304761 [NH3+]C1=NC(O)C2NCN(C3CC(O)C(CO)O3)C2=N1
196 270.1196804121 [NH3+]C1=NC(O)=C2NCN(C3CC(O)C(CO)O3)C2=N1
197 268.1040303481 [NH3+]C1=NC(O)=C2N=CN(C3CC(O)C(CO)O3)C2=N1
198 250.0934656641 [NH3+]C1=NC=C2N=CN(C3CC(O)C(=CO)O3)C2=N1
199 250.0934656641 C=C1OC(N2C=NC3=C(O)N=C([NH3+])N=C32)CC1O
200 250.0934656641 [NH3+]C1=NC(O)=C2N=CN(C3CCC(=CO)O3)C2=N1
201 251.0774812521 OC=C1OC(N2C=NC3=C([OH2+])N=CN=C32)CC1O
202 268.1040303481 [NH3+]C1=NC(O)=C2N=CN(CCC(O)C(=O)CO)C2=N1 Intermediate Fragment 
203 268.1040303481 CC(OC(=CO)CO)N1C=NC2=C(O)N=C([NH3+])N=C21 Intermediate Fragment 
204 268.1040303481 [NH3+]C1=NC(O)=C2N=CN(C(=O)CC(O)CCO)C2=N1 Intermediate Fragment 
205 250.0934656641 [NH3+]C1=NC(O)=C2N=CN(CCC(O)C#CO)C2=N1
206 222.0621655361 [NH3+]C1=NC(O)=C2N=CN(C(=O)C=CO)C2=N1
207 266.0883802841 [NH3+]C1=NC(O)=C2N=CN(C(=O)CC(O)C=CO)C2=N1
208 248.0778156001 C=C1OC(N2C=NC3=C(O)N=C([NH3+])N=C32)C=C1O
209 266.0883802841 [NH3+]C1=NC(O)=C2N=CN(CCC(O)C(=O)C=O)C2=N1 Intermediate Fragment 
210 266.0883802841 CC(OC(=C=O)CO)N1C=NC2=C(O)N=C([NH3+])N=C21 Intermediate Fragment 
211 266.0883802841 [NH3+]C1=NC(O)=C2N=CN(C(CCO)OC#CO)C2=N1 Intermediate Fragment 
212 224.0778156001 [NH3+]C1=NC(O)=C2N=CN(C(=O)CCO)C2=N1
213 264.0727302201 [NH3+]C1=NC(O)=C2N=CN(C3CC(O)C(=C=O)O3)C2=N1
214 324.1302450961 CNC1=NC2=C(N=CN2C2CC(O)C(=CO)O2)C(=[OH+])N1C(C)O Intermediate Fragment 
215 282.1196804121 C[NH2+]C1=NC(O)=C2N=CN(C3CC(O)C(CO)O3)C2=N1
216 282.1196804121 C[NH2+]C1=NC(O)=C2N=CN(C(=O)CC(O)CCO)C2=N1 Intermediate Fragment 
217 280.1040303481 C[NH2+]C1=NC(O)=C2N=CN(C3CC(O)C(=CO)O3)C2=N1
218 280.1040303481 C[NH2+]C1=NC(O)=C2N=CN(C(=O)CC(O)C=CO)C2=N1 Intermediate Fragment 
219 324.1302450961 CCNC1=NC2=C(N=CN2C2CC(O)C(=CO)O2)C(=[OH+])N1CO Intermediate Fragment 
220 296.1353304761 CC[NH2+]C1=NC(O)=C2N=CN(C3CC(O)C(CO)O3)C2=N1
221 294.1196804121 CC[NH2+]C1=NC(O)=C2N=CN(C3CC(O)C(=CO)O3)C2=N1
222 324.1302450961 OC=C1OC(N2C=NC3=C([OH2+])N=C(NCCCO)N=C32)CC1O Intermediate Fragment 
223 76.0756903601 [NH3+]CCCO
224 324.1302450961 NCCC(O)N1C=NC2=C(N=CN2C2CC(O)C(=CO)O2)C1=[OH+] Intermediate Fragment 
225 307.1036960001 CCC(O)N1C=NC2=C(N=CN2C2CC(O)C(=C=O)O2)C1=[OH+]
226 193.0720019481 C=CC(O)N1C=NC2=C(N=CN2)C1=[OH+]
227 253.0931313161 OCC1OC(N2C=NC3=C([OH2+])N=CN=C32)CC1O
228 253.0931313161 O=C(CC(O)CCO)N1C=NC2=C([OH2+])N=CN=C21 Intermediate Fragment 
