#In-silico ESI-MS/MS [M+H]+ Spectra
#PREDICTED BY CFM-ID 4.0.8
#SMILES=O1[C@H](CO)[C@@H](C[C@@H]1N1C(C(=O)NC1=O)O)O
#InChiKey=SFNMXFXPCVSUPQ-YTPWUJHKSA-N
energy0
99.01890 25.30 37 36 201 (8.6001 0.63149 0.0065055)
99.04406 8.89 73 9 81 (1.5952 1.3145 0.33809)
117.02947 65.45 2 49 38 47 154 (16.092 4.4064 2.5884 0.81406 0.0002276)
117.05462 13.93 71 74 82 89 84 88 (3.2228 0.76125 0.5219 0.34033 0.18538 0.054628)
215.06625 9.49 17 100 5 101 171 19 14 28 26 24 20 25 18 13 (1.5889 0.88181 0.69068 0.18087 0.066319 0.025581 0.009319 0.0068107 0.006575 0.003747 0.002206 0.0010401 0.00089265 0.0007077)
233.07681 100.00 0 208 214 102 271 275 199 173 269 273 175 (35.324 0.50388 0.24824 0.14127 0.11639 0.074437 0.063962 0.025056 0.0070998 0.0053628 0.0052949)
energy1
43.01784 21.64 77 (2.4198)
44.01309 19.83 43 (2.2171)
45.03349 56.63 64 (6.3326)
57.03349 34.41 59 (3.8482)
59.04914 8.17 70 (0.91418)
69.03349 8.87 164 165 (0.62332 0.36903)
72.00800 13.02 48 50 (1.233 0.22322)
73.02841 10.15 75 178 (1.0763 0.059273)
74.02365 13.30 44 135 (1.3604 0.12696)
85.02841 9.71 55 163 (0.93367 0.15196)
87.04406 23.22 61 65 85 (1.9421 0.61891 0.035945)
97.02841 17.85 8 69 62 (1.1104 0.52593 0.3604)
99.01890 53.90 37 36 201 (5.965 0.057437 0.0057457)
99.04406 100.00 81 9 73 (6.2642 4.1905 0.72851)
100.00292 8.29 45 (0.92745)
101.03455 7.44 33 122 (0.79742 0.034533)
101.05971 45.33 10 98 96 (3.5299 0.77809 0.76084)
114.05495 7.46 244 245 248 (0.6275 0.15422 0.052046)
116.07060 12.82 22 240 238 (1.2444 0.094716 0.09461)
117.02947 68.26 2 49 38 47 154 (3.7663 2.0185 1.4141 0.43237 0.0019239)
117.05462 29.56 71 89 74 82 84 88 (1.1503 1.1282 0.68026 0.26081 0.064382 0.022379)
127.01382 9.53 150 202 200 (0.65403 0.21319 0.19846)
129.02947 14.07 147 204 206 (0.80252 0.43893 0.33255)
145.02438 24.89 106 153 156 151 155 (1.5718 0.58803 0.28863 0.22774 0.10773)
189.05060 15.97 15 109 108 (1.5705 0.1241 0.091533)
215.06625 37.60 5 171 20 26 24 17 18 14 100 19 28 13 25 101 (2.8874 0.29719 0.26376 0.22061 0.16042 0.090333 0.078691 0.056271 0.047915 0.030237 0.029897 0.028499 0.008569 0.0051695)
233.07681 49.99 0 102 214 208 273 175 275 269 199 173 271 (3.4625 1.6879 0.19451 0.094643 0.051365 0.03722 0.021162 0.016337 0.01033 0.0099384 0.0041909)
energy2
43.01784 12.17 77 (1.8721)
44.01309 22.73 43 (3.4976)
45.03349 27.57 64 (4.2424)
46.02874 9.88 42 (1.5209)
47.04914 10.04 78 (1.5452)
55.01784 9.50 91 (1.4609)
57.03349 39.11 59 (6.0171)
58.02874 6.34 205 125 (0.61567 0.35957)
59.04914 6.47 70 (0.99596)
69.99235 10.35 142 (1.592)
71.04914 12.89 166 167 (1.3742 0.60928)
72.00800 28.65 48 50 (2.4678 1.9407)
73.02841 25.96 178 75 (2.1685 1.8251)
74.02365 10.06 135 44 (1.0692 0.47845)
86.02365 12.75 123 266 (1.6175 0.34503)
87.04406 16.69 65 61 85 (2.1818 0.34993 0.036115)
88.03930 6.67 116 250 (0.98422 0.042577)
89.05971 5.55 80 72 86 (0.70385 0.1106 0.040232)
99.01890 11.65 37 36 201 (1.6286 0.12155 0.041606)
99.04406 52.01 9 73 81 (6.0003 1.2918 0.71015)
101.03455 6.13 122 33 (0.52653 0.41636)
101.05971 12.60 10 96 98 (1.0293 0.88323 0.025742)
102.01857 6.22 35 (0.95644)
114.05495 6.14 248 244 245 (0.551 0.24235 0.15127)
115.01382 8.11 52 46 53 160 (0.74688 0.31484 0.1856 9.7716e-05)
117.02947 100.00 49 38 2 47 154 (9.5246 3.8867 1.5037 0.46811 0.002974)
131.04512 6.20 146 (0.9546)
143.04512 17.03 192 117 118 194 119 196 195 (1.1005 0.44656 0.39044 0.28268 0.19092 0.18864 0.020338)
144.06552 20.65 220 (3.1775)

0 233.0768125561 O=C1NC(=O)N(C2CC(O)C(C[OH2+])O2)C1O
1 201.0505978081 OC1=COC(N2C(O)=C([OH2+])NC2O)=C1
2 117.0294684401 OC1=NC(O)NC1=[OH+]
3 203.0662478721 OC1=COC(N2C(O)NC([OH2+])C2O)=C1
4 205.0818979361 OC1=COC(N2C(O)NC([OH2+])C2O)C1
5 215.0662478721 C=C1OC(N2C(O)=C([OH2+])NC2O)C=C1O
6 119.0451185041 OC1=NC(O)NC1[OH2+]
7 95.0127557561 [CH+]=C1OC=CC1=O
8 97.0284058201 C=C1OC=CC1=[OH+]
9 99.0440558841 C=C1OC=CC1[OH2+]
10 101.0597059481 C=C1OCCC1[OH2+]
11 197.0556831881 C=C1OC(N2C=C([OH2+])N=C2O)C=C1O
12 197.0556831881 C=C1C=CC(N2C(O)=NC([OH2+])=C2O)O1
13 215.0662478721 C#CC(O)=C=C(O)N1C(O)NC([OH2+])C1O Intermediate Fragment 
14 215.0662478721 C#COC(=C=CO)N1C(O)NC([OH2+])C1O Intermediate Fragment 
15 189.0505978081 OC#CC([OH2+])N1C(O)=C(O)NC1O
16 173.0556831881 OC#CCN1C(O)=C([OH2+])NC1O
17 215.0662478721 C=C(CO)OC(=C)N1C(O)=NC([OH2+])=C1O Intermediate Fragment 
18 215.0662478721 C=C(O)C(=C)OCN1C(O)=NC([OH2+])=C1O Intermediate Fragment 
19 215.0662478721 CC(=O)C(O)=C=CN1C(O)=C([OH2+])NC1O Intermediate Fragment 
20 215.0662478721 C=C1OC(=NC(O)NC([OH2+])=CO)C=C1O Intermediate Fragment 
21 142.0498695361 C=C1OC(=[NH+]CO)C=C1O
22 116.0706049801 C=C1OC([NH3+])CC1O
23 104.0342194721 O=C(CO)[NH+]=CO
24 215.0662478721 C=C1OC(=NC(O)=C([OH2+])NCO)C=C1O Intermediate Fragment 
25 215.0662478721 C=C1OC(N(C=O)C(O)=C(N)[OH2+])C=C1O Intermediate Fragment 
26 215.0662478721 C=C1OC(N(C(O)=C=[OH+])C(N)O)C=C1O Intermediate Fragment 
27 159.0764186321 C=C1OC([NH2+]C(N)O)C=C1O
28 215.0662478721 C=C1OC(N(CO)C(O)N=C=[OH+])C=C1O Intermediate Fragment 
29 121.0607685681 OC1NC(O)C([OH2+])N1
30 103.0502038841 OC1N=CC([OH2+])N1
31 121.0607685681 NC(O)NC([OH2+])=CO Intermediate Fragment 
32 121.0607685681 NC([OH2+])C(O)=NCO Intermediate Fragment 
33 101.0345538201 OC1N=CC(=[OH+])N1
34 119.0451185041 NC(O)=NC([OH2+])=CO Intermediate Fragment 
35 102.0185694081 O=C=[NH+]C(O)=CO
36 99.0189037561 OC1=NC=NC1=[OH+]
37 99.0189037561 OC1=NC(=[OH+])C=N1
38 117.0294684401 NC(O)=NC([OH2+])=C=O Intermediate Fragment 
39 87.0189037561 [NH3+]C(=O)N=C=O
40 61.0396392001 N=C([NH3+])O
41 56.9971056921 O=C=C=[OH+]
42 46.0287401681 [NH3+]C=O
43 44.0130901041 [NH2+]=C=O
44 74.0236547881 [NH3+]C(=O)C=O
45 100.0029193441 O=C=[NH+]C(O)=C=O
46 115.0138183761 NC(O)=NC(=O)C#[O+]
47 117.0294684401 OC=NC(O)N=C=[OH+] Intermediate Fragment 
48 72.0080047241 O=C=[NH+]C=O
49 117.0294684401 NC(=[OH+])C(O)=NC=O Intermediate Fragment 
50 72.0080047241 NC(=O)C#[O+]
51 89.0345538201 NC(=O)C(=[NH2+])O
52 115.0138183761 O=C(N=C=[OH+])N=CO Intermediate Fragment 
53 115.0138183761 N=C(O)C(=[OH+])N=C=O Intermediate Fragment 
54 113.0233204401 OC1=CCOC1=C=[OH+]
55 85.0284058201 [OH2+]C1=COC=C1
56 95.0127557561 [O+]#CC1=CC=CO1
57 113.0233204401 OC=C=C(O)C#C[OH2+] Intermediate Fragment 
58 113.0233204401 C=C=C(O)C(=O)C=[OH+] Intermediate Fragment 
59 57.0334912001 C=C=C[OH2+]
60 115.0389705041 OC1CCOC1=C=[OH+]
61 87.0440558841 [OH2+]C1=COCC1
62 97.0284058201 [OH+]=C=C1C=CCO1
63 115.0389705041 OCC=C(O)C#C[OH2+] Intermediate Fragment 
64 45.0334912001 C=C[OH2+]
65 87.0440558841 CC(O)C#C[OH2+]
66 115.0389705041 OC=CCOC#C[OH2+] Intermediate Fragment 
67 115.0389705041 C=COC(=C=[OH+])CO Intermediate Fragment 
68 115.0389705041 CC=C(O)C(=O)C=[OH+] Intermediate Fragment 
69 97.0284058201 C=C=C(O)C#C[OH2+]
70 59.0491412641 CC=C[OH2+]
71 117.0546205681 OC1CCOC1=C[OH2+]
72 89.0597059481 [OH2+]C1CCOC1
73 99.0440558841 [OH+]=C=C1CCCO1
74 117.0546205681 OCCC(O)C#C[OH2+] Intermediate Fragment 
75 73.0284058201 OC#CC[OH2+]
76 71.0127557561 OC#CC=[OH+]
77 43.0178411361 C#C[OH2+]
78 47.0491412641 CC[OH2+]
79 75.0440558841 OCC=C[OH2+]
80 89.0597059481 CC(O)C=C[OH2+]
81 99.0440558841 CC=C(O)C#C[OH2+]
82 117.0546205681 OCCCOC#C[OH2+] Intermediate Fragment 
83 61.0284058201 OCC=[OH+]
84 117.0546205681 CCOC(=C=[OH+])CO Intermediate Fragment 
85 87.0440558841 CC[OH+]C#CO
86 89.0597059481 CC[OH+]C=CO
87 91.0389705041 OCC(=[OH+])CO
88 117.0546205681 COC(=C=[OH+])C(C)O Intermediate Fragment 
89 117.0546205681 CCC(O)C(=O)C=[OH+] Intermediate Fragment 
90 61.0647913281 CCC[OH2+]
91 55.0178411361 [CH2+]C#CO
92 59.0127557561 OC=C=[OH+]
93 31.0542266441 C[CH4+]
94 29.0385765801 C=[CH3+]
95 119.0702706321 OC1CCOC1C[OH2+]
96 101.0597059481 [OH2+]C=C1CCCO1
97 119.0702706321 OCCC(O)C=C[OH2+] Intermediate Fragment 
98 101.0597059481 CCC(O)C#C[OH2+]
99 119.0702706321 OCCCOC=C[OH2+] Intermediate Fragment 
100 215.0662478721 OC1=CC(N2CC(O)NC2O)OC1=C=[OH+]
101 215.0662478721 O=C(C=[OH+])C(O)=C=CN1CC(O)NC1O Intermediate Fragment 
102 233.0768125561 OC(C#C[OH2+])=CC(O)N1C(O)NC(O)C1O Intermediate Fragment 
103 191.0662478721 OC#CC([OH2+])N1C(O)NC(O)C1O
104 161.0556831881 C=C([OH2+])N1C(O)=C(O)NC1O
105 147.0400331241 OC1=NC(O)=C(O)N1C[OH2+]
106 145.0243830601 OC1=NC(O)=C(O)N1C=[OH+]
107 171.0400331241 C#CC([OH2+])N1C(O)=NC(O)=C1O
108 189.0505978081 OC#CC([OH2+])=NC(O)NC(O)=CO Intermediate Fragment 
109 189.0505978081 OC#CC([OH2+])=NC(O)=C(O)NCO Intermediate Fragment 
110 187.0349477441 OC#CC([OH2+])N1C(O)=NC(O)=C1O
111 143.0087329961 O=C1N=C(O)N(C=[OH+])C1=O
112 165.0869833161 CC([OH2+])N1C(O)NC(O)C1O
113 165.0869833161 C=C([OH2+])NC(O)C(O)NCO Intermediate Fragment 
114 163.0713332521 C=C([OH2+])N1C(O)NC(O)C1O
115 163.0713332521 C=C([OH2+])N=C(O)C(O)NCO Intermediate Fragment 
116 88.0393048521 C=C(O)[NH+]=CO
117 143.0451185041 C=C([OH2+])N1C(O)=CN=C1O
118 143.0451185041 C=C([OH2+])N1C=C(O)N=C1O
119 143.0451185041 C#CN1C(O)=C([OH2+])NC1O
120 161.0556831881 C=C([OH2+])NC(O)=NC(O)=CO Intermediate Fragment 
121 103.0502038841 C=C(O)[NH2+]C(=N)O
122 101.0345538201 [CH+]=C(O)NC(=N)O
123 86.0236547881 C=C(O)[NH+]=C=O
124 84.0080047241 [CH+]=C(O)N=C=O
125 58.0287401681 [CH+]=C(N)O
126 161.0556831881 C=C([OH2+])N(CO)C(O)N=C=O Intermediate Fragment 
127 116.0342194721 C=C(O)[NH+](C=O)C=O
128 114.0185694081 C=C(O)[N+](=C=O)C=O
129 90.0549549161 C=C(O)[NH2+]CO
130 161.0556831881 C=C([OH2+])N(C(O)=C=O)C(N)O Intermediate Fragment 
131 144.0291340921 C=C(O)[NH+](C=O)C(O)=C=O
132 161.0556831881 C=C([OH2+])N(C=O)C(O)=C(N)O Intermediate Fragment 
133 161.0556831881 C=C([OH2+])N=C(O)C(=O)NCO Intermediate Fragment 
134 76.0393048521 O=C[NH2+]CO
135 74.0236547881 O=C=[NH+]CO
136 116.0342194721 C=C(O)[NH+]=C(O)C=O
137 133.0607685681 C=C(O)[NH+]=C(O)C(N)O
138 159.0400331241 C=C([OH2+])N1C(O)=NC(O)=C1O
139 141.0294684401 C#CN1C(O)=NC([OH2+])=C1O
140 159.0400331241 C=C([OH2+])NC(O)=NC(O)=C=O Intermediate Fragment 
141 159.0400331241 C=C([OH2+])N(CO)C(=O)N=C=O Intermediate Fragment 
142 69.9923546601 O=C=[N+]=C=O
143 159.0400331241 C=C([OH2+])N=C(O)C(=O)N=CO Intermediate Fragment 
144 157.0243830601 [CH+]=C(O)N1C(O)=NC(O)=C1O
145 149.0556831881 OC1=C(O)N(C[OH2+])C(O)N1
146 131.0451185041 CN1C(O)=NC([OH2+])=C1O
147 129.0294684401 [CH2+]N1C(O)=NC(O)=C1O
148 147.0400331241 OC=C(O)N=C(O)N=C[OH2+] Intermediate Fragment 
149 147.0400331241 O=C=NC(=O)N(CO)C[OH2+] Intermediate Fragment 
150 127.0138183761 [CH2+]N1C(=O)C(=O)N=C1O
151 145.0243830601 O=C=C(O)N=C(O)N=C[OH2+] Intermediate Fragment 
152 89.0345538201 N=C(O)[NH+]=CO
153 145.0243830601 O=C=NC(=O)N(C=O)C[OH2+] Intermediate Fragment 
154 117.0294684401 N=C(O)[NH+](C=O)C=O
155 145.0243830601 NC(O)=C(O)N(C#[O+])C=O Intermediate Fragment 
156 145.0243830601 O=C=NC(O)=C(O)N=C[OH2+] Intermediate Fragment 
157 143.0087329961 O=C=C(O)N=C(O)N=C=[OH+] Intermediate Fragment 
158 143.0087329961 O=C=NC(=O)N(C=O)C=[OH+] Intermediate Fragment 
159 143.0087329961 N=C(O)N(C#[O+])C(O)=C=O Intermediate Fragment 
160 115.0138183761 N=C(O)[N+](=C=O)C=O
161 143.0087329961 NC(=O)C(=O)N(C#[O+])C=O Intermediate Fragment 
162 143.0087329961 O=C=NC(O)=C(O)N=C=[OH+] Intermediate Fragment 
163 85.0284058201 C=C(O)C#C[OH2+]
164 69.0334912001 C#CC(=C)[OH2+]
165 69.0334912001 C=CC#C[OH2+]
166 71.0491412641 C#CC(C)[OH2+]
167 71.0491412641 CCC#C[OH2+]
168 91.0753560121 CC(O)CC[OH2+]
169 73.0647913281 C=CC(C)[OH2+]
170 73.0647913281 CCC=C[OH2+]
171 215.0662478721 OC(=C=CN1C(O)NC(O)C1O)C#C[OH2+]
172 231.0611624921 OC#CC(O)=C=C([OH2+])N1C(O)NC(O)C1O
173 233.0768125561 OC=CC(OC#C[OH2+])N1C(O)NC(O)C1O Intermediate Fragment 
174 173.0556831881 OC#CC=NC(O)NC([OH2+])=CO Intermediate Fragment 
175 233.0768125561 C=C(OC(=C=[OH+])CO)N1C(O)NC(O)C1O Intermediate Fragment 
176 93.0546205681 OCC([OH2+])CO
177 75.0440558841 CC(=[OH+])CO
178 73.0284058201 CC(=[OH+])C=O
179 141.0294684401 C#CNC(O)=NC([OH2+])=C=O Intermediate Fragment 
180 113.0345538201 C#C[NH2+]C(O)N=C=O
181 85.0396392001 C#C[NH2+]C(=N)O
182 70.0287401681 C#C[NH2+]C=O
183 68.0130901041 C#C[NH+]=C=O
184 42.0338255481 C#C[NH3+]
185 141.0294684401 C#CN(CO)C(=O)N=C=[OH+] Intermediate Fragment 
186 111.0189037561 C#C[NH2+]C(=O)N=C=O
187 98.0236547881 C#C[NH+](C=O)C=O
188 141.0294684401 C#CN(C(=N)O)C(O)=C=[OH+] Intermediate Fragment 
189 113.0345538201 C#C[NH+](C=O)C(=N)O
190 141.0294684401 C#CN(C#[O+])C(O)=C(N)O Intermediate Fragment 
191 141.0294684401 C#CN=C(O)C(=[OH+])N=CO Intermediate Fragment 
192 143.0451185041 C#CNC(O)=NC([OH2+])=CO Intermediate Fragment 
193 87.0552892641 C#C[NH2+]C(N)O
194 143.0451185041 C#CN(CO)C(O)N=C=[OH+] Intermediate Fragment 
195 143.0451185041 C#CN(C(O)=C=[OH+])C(N)O Intermediate Fragment 
196 143.0451185041 C#CN(C=O)C(O)=C(N)[OH2+] Intermediate Fragment 
197 145.0607685681 C#CN1C(O)NC([OH2+])C1O
198 145.0607685681 C#CNC(O)NC([OH2+])=CO Intermediate Fragment 
199 233.0768125561 C=C(O)C(=C=[OH+])OCN1C(O)NC(O)C1O Intermediate Fragment 
200 127.0138183761 CN(C#[O+])C(=O)N=C=O Intermediate Fragment 
201 99.0189037561 C=[NH+]C(=O)N=C=O
202 127.0138183761 [CH+]=NC(O)=C(O)N=C=O Intermediate Fragment 
203 56.0130901041 C=[N+]=C=O
204 129.0294684401 CN(C=O)C(=O)N=C=[OH+] Intermediate Fragment 
205 58.0287401681 C=[NH+]C=O
206 129.0294684401 C=NC(O)=C([OH2+])N=C=O Intermediate Fragment 
207 135.0764186321 CN1C(O)NC([OH2+])C1O
208 233.0768125561 O=C(C=[OH+])C(O)=CCN1C(O)NC(O)C1O Intermediate Fragment 
209 175.0713332521 OC#CCN1C(O)NC([OH2+])C1O
210 171.0400331241 OC#CCN1C(O)=NC([OH2+])=C1O
211 147.0764186321 C=CN1C(O)NC([OH2+])C1O
212 103.0389705041 CC(O)C(=[OH+])C=O
213 105.0546205681 CC(O)C(=[OH+])CO
214 233.0768125561 OCC(O)NC(O)NC1C=C(O)C(=C=[OH+])O1 Intermediate Fragment 
215 177.0869833161 NC(O)[NH2+]C1CC(O)C(=CO)O1
216 175.0713332521 NC(O)[NH2+]C1CC(O)C(=C=O)O1
217 175.0713332521 NC(O)[NH2+]C(O)C=C(O)C#CO Intermediate Fragment 
218 173.0556831881 NC(O)[NH2+]C1C=C(O)C(=C=O)O1
219 162.0760842841 OC=C1OC([NH2+]CO)CC1O
220 144.0655196001 C=C1OC([NH2+]CO)C=C1O
221 132.0655196001 [NH3+]C1CC(O)C(=CO)O1
222 162.0760842841 OC#CC(O)CC(O)[NH2+]CO Intermediate Fragment 
223 160.0604342201 O=C=C1OC([NH2+]CO)CC1O
224 142.0498695361 O=C=C1C=CC([NH2+]CO)O1
225 160.0604342201 OC#CC(O)=CC(O)[NH2+]CO Intermediate Fragment 
226 160.0604342201 OC#COC(C=CO)[NH2+]CO Intermediate Fragment 
227 160.0604342201 C=C(O)C(=C=O)OC[NH2+]CO Intermediate Fragment 
228 160.0604342201 O=CC(=O)C(O)=CC[NH2+]CO Intermediate Fragment 
229 158.0447841561 O=C=C1OC([NH2+]CO)C=C1O
230 140.0342194721 C=C1OC(=[NH+]C=O)C=C1O
231 158.0447841561 OC#CC(O)=C=C(O)[NH2+]CO Intermediate Fragment 
232 158.0447841561 C=C(O)C(=C=O)OC=[NH+]CO Intermediate Fragment 
233 158.0447841561 O=CC(=O)C(O)=C=C[NH2+]CO Intermediate Fragment 
234 156.0291340921 O=C=C1OC(=[NH+]CO)C=C1O
235 156.0291340921 C=C(O)C(=C=O)OC=[NH+]C=O Intermediate Fragment 
236 156.0291340921 O=CC(=O)C(O)=C=C=[NH+]CO Intermediate Fragment 
237 134.0811696641 [NH3+]C1CC(O)C(CO)O1
238 116.0706049801 [NH3+]C1CCC(=CO)O1
239 134.0811696641 [NH3+]C(O)CC(O)C=CO Intermediate Fragment 
240 116.0706049801 [NH3+]CCC(O)C#CO
241 134.0811696641 [NH3+]C(CCO)OC=CO Intermediate Fragment 
242 134.0811696641 CC([NH3+])OC(=CO)CO Intermediate Fragment 
243 134.0811696641 CC(O)C(=CO)OC[NH3+] Intermediate Fragment 
244 114.0549549161 C=C1OC([NH3+])C=C1O
245 114.0549549161 [NH3+]C1CCC(=C=O)O1
246 132.0655196001 [NH3+]C(O)CC(O)C#CO Intermediate Fragment 
247 60.0443902321 C=C([NH3+])O
248 114.0549549161 [NH3+]CC=C(O)C#CO
249 132.0655196001 [NH3+]C(CCO)OC#CO Intermediate Fragment 
250 88.0393048521 [NH3+]C(O)C#CO
251 70.0287401681 [NH2+]=CC#CO
252 72.0443902321 [NH3+]CC#CO
253 132.0655196001 CC([NH3+])OC(=C=O)CO Intermediate Fragment 
254 132.0655196001 CC(O)C(=C=O)OC[NH3+] Intermediate Fragment 
255 132.0655196001 [NH3+]CCC(O)C(=O)C=O Intermediate Fragment 
256 44.0494756121 C=C[NH3+]
257 130.0498695361 [NH3+]C1CC(O)C(=C=O)O1
258 112.0393048521 [NH3+]C1C=CC(=C=O)O1
259 130.0498695361 [NH3+]C(O)C=C(O)C#CO Intermediate Fragment 
260 130.0498695361 [NH3+]C(C=CO)OC#CO Intermediate Fragment 
261 130.0498695361 C=C(O)C(=C=O)OC[NH3+] Intermediate Fragment 
262 130.0498695361 [NH3+]CC=C(O)C(=O)C=O Intermediate Fragment 
263 128.0342194721 [NH3+]C1C=C(O)C(=C=O)O1
264 128.0342194721 [NH3+]C=C=C(O)C(=O)C=O Intermediate Fragment 
265 84.0080047241 C#[N+]C(O)=C=O
266 86.0236547881 C=[NH+]C(O)=C=O
267 108.0655196001 OC[NH2+]C(O)CO
268 231.0611624921 O=C=C1OC(=[NH+]C(O)NC(O)CO)C=C1O
269 233.0768125561 OCNC(O)C(O)NC1C=C(O)C(=C=[OH+])O1 Intermediate Fragment 
270 106.0498695361 OC=C(O)[NH2+]CO
271 233.0768125561 NC(O)C(O)N(CO)C1C=C(O)C(=C=[OH+])O1 Intermediate Fragment 
272 216.0502634601 O=C=C1OC([NH+](CO)C(O)=CO)C=C1O
273 233.0768125561 NC(O)N(C(O)CO)C1C=C(O)C(=C=[OH+])O1 Intermediate Fragment 
274 205.0818979361 NC(O)[NH+](CO)C1CC(O)C(=C=O)O1
275 233.0768125561 OCNC(O)N(CO)C1C=C(O)C(=C=[OH+])O1 Intermediate Fragment 
276 188.0553488401 O=C=C1OC([NH+](CO)CO)C=C1O
