#In-silico ESI-MS/MS [M+H]+ Spectra
#PREDICTED BY CFM-ID 4.0.8
#SMILES=[C@H]1(C[C@@H](O[C@@H]1CO)n1cc(c(=O)n(c1=O)CCCCO)C)O
#InChiKey=AUOPEJCGHGMXTA-IJLUTSLNSA-N
energy0
57.03349 7.43 116 (1.8645)
99.04406 15.30 104 6 114 (1.5073 1.1865 1.1438)
117.05462 14.96 102 112 105 124 119 111 (1.978 1.314 0.16494 0.15988 0.10654 0.030657)
125.03455 16.18 26 (4.0605)
127.05020 26.30 27 (6.5977)
139.05020 42.88 31 (10.757)
141.06585 17.46 20 79 (4.3512 0.030057)
181.09715 22.19 38 22 21 (5.3708 0.11801 0.079544)
199.10772 100.00 4 55 73 40 92 90 88 (22.032 2.3216 0.22682 0.2221 0.19875 0.069475 0.018166)
297.14450 17.71 158 2 165 166 188 157 167 (3.7453 0.39231 0.12861 0.099846 0.049909 0.017466 0.01004)
315.15506 42.77 0 181 205 229 222 225 175 226 168 290 293 224 (10.228 0.24189 0.12089 0.082241 0.033324 0.0089967 0.0064302 0.0060096 0.0019109 0.0012737 0.00051783 0.00038717)
energy1
55.05423 4.76 133 (1.3381)
99.04406 9.84 6 114 104 (1.2425 0.98851 0.53625)
125.03455 8.59 26 (2.4159)
127.05020 25.43 27 (7.1537)
139.05020 100.00 31 (28.13)
141.06585 25.52 20 79 (7.1517 0.027497)
143.08150 7.32 19 80 (1.6764 0.38361)
153.06585 4.36 33 (1.2262)
155.08150 20.67 34 (5.8159)
167.08150 11.09 35 52 81 (3.0913 0.019504 0.009011)
169.09715 4.64 36 53 82 (1.1977 0.056358 0.050333)
171.11280 10.49 54 83 37 (1.9436 0.72788 0.27822)
181.09715 20.11 38 22 21 (5.2857 0.26741 0.10308)
183.07642 4.72 39 148 (1.326 0.00041807)
199.10772 23.43 4 55 73 40 90 88 92 (5.2825 0.49898 0.26433 0.18205 0.1434 0.11611 0.1047)
227.10263 4.60 179 (1.2928)
energy2
43.01784 30.79 120 (1.9788)
45.03349 64.98 109 (4.1755)
55.01784 25.74 210 (1.6539)
55.05423 69.37 133 (4.4581)
57.03349 59.13 116 (3.7996)
57.06988 25.81 132 (1.6583)
59.04914 37.61 115 (2.4168)
70.06513 24.00 260 (1.5421)
71.04914 39.42 215 23 76 (0.92771 0.89686 0.70869)
73.06479 19.66 12 217 75 (1.0194 0.2116 0.032723)
86.06004 14.93 66 86 (0.91932 0.040048)
99.04406 53.11 6 104 114 (1.6388 1.6385 0.13566)
101.05971 22.41 126 127 129 (0.69963 0.69896 0.041309)
116.07060 16.40 46 70 (1.0356 0.018509)
117.05462 27.32 119 102 105 112 124 111 (0.83409 0.34748 0.29678 0.12977 0.077853 0.069443)
125.03455 27.66 26 (1.7774)
137.03455 14.33 93 (0.92117)
139.05020 79.09 31 (5.0829)
141.06585 63.02 20 79 (4.0466 0.0030461)
143.08150 53.71 19 80 (3.4079 0.043975)
145.09715 24.71 13 91 (1.5765 0.011571)
147.11280 24.45 14 (1.5715)
167.08150 21.36 35 52 81 (1.2953 0.071893 0.0055257)
169.06077 13.27 137 (0.85302)
181.09715 19.17 38 21 22 (1.1041 0.11012 0.017827)
183.07642 26.95 39 148 (1.1627 0.56909)
199.10772 100.00 55 4 40 73 88 90 92 (2.4126 1.2115 1.0841 1.0567 0.41731 0.12518 0.11907)
227.10263 83.98 179 (5.3966)
227.13902 60.48 170 203 (3.619 0.26791)
237.08698 22.57 145 8 161 (1.0478 0.31176 0.091103)

0 315.1550628761 Cc1cn(C2CC(O)C(C[OH2+])O2)c(=O)n(CCCCO)c1=O
1 283.1288481281 CC1=CN(C2C=C(O)CO2)C(=O)N(CCCCO)C1=[OH+]
2 297.1444981921 C=C1OC(N2C=C(C)C(=[OH+])N(CCCCO)C2O)C=C1O
3 201.1233688241 CC1=C([OH2+])N(CCCCO)C(O)N=C1
4 199.1077187601 CC1=C([OH2+])N(CCCCO)C(=O)N=C1
5 197.0920686961 CC1=C([OH2+])N(C=CCCO)C(=O)N=C1
6 99.0440558841 C=C1OC=CC1[OH2+]
7 225.0869833161 C=C1OC(N2C=C(C)C(=[OH+])NC2O)C=C1O
8 237.0869833161 C=C1OC(N2C=C(C)C(=[OH+])N(C)C2=O)C=C1O
9 239.1026333801 C=C1OC(N2C=C(C)C(=[OH+])N(C)C2O)C=C1O
10 279.1339335081 C=C1C=CC(N2C=C(C)C(=[OH+])N(CCCCO)C2=O)O1
11 205.1546689521 CC1CNC(O)N(CCCCO)C1[OH2+]
12 73.0647913281 C=CCC[OH2+]
13 145.0971540761 CC1C=NC(O)N(C)C1[OH2+]
14 147.1128041401 CC1CNC(O)N(C)C1[OH2+]
15 205.1546689521 CC(C=NC(O)NCCCCO)C[OH2+] Intermediate Fragment 
16 88.0756903601 [NH2+]=CCCCO
17 90.0913404241 [NH3+]CCCCO
18 203.1390188881 CC1C=NC(O)N(CCCCO)C1[OH2+]
19 143.0815040121 CC1=C([OH2+])N(C)C(O)N=C1
20 141.0658539481 CC1=C([OH2+])N(C)C(=O)N=C1
21 181.0971540761 CC1=CN(C=CCCO)C(=[OH+])N=C1
22 181.0971540761 CC1=C([OH2+])N(C#CCCO)CN=C1
23 71.0491412641 C#CCC[OH2+]
24 69.0334912001 C#CC=C[OH2+]
25 67.0178411361 C#CC#C[OH2+]
26 125.0345538201 [CH2+]C1=C(O)N=C(O)N=C1
27 127.0502038841 CC1=C([OH2+])N=C(O)N=C1
28 129.0658539481 CC1=C([OH2+])NC(O)N=C1
29 131.0815040121 CC1C=NC(O)NC1[OH2+]
30 133.0971540761 CC1CNC(O)NC1[OH2+]
31 139.0502038841 [CH2+]N1C(=O)N=CC(C)=C1O
32 47.0491412641 CC[OH2+]
33 153.0658539481 C=CN1C(=O)N=CC(C)=C1[OH2+]
34 155.0815040121 CCN1C(=O)N=CC(C)=C1[OH2+]
35 167.0815040121 CC=CN1C(=O)N=CC(C)=C1[OH2+]
36 169.0971540761 CCCN1C(=O)N=CC(C)=C1[OH2+]
37 171.1128041401 CCCN1C([OH2+])=C(C)C=NC1O
38 181.0971540761 CCC=CN1C(=O)N=CC(C)=C1[OH2+]
39 183.0764186321 O=C1N=CC=C([OH2+])N1C=CCCO
40 199.1077187601 CC(=C=N)C(=[OH+])N(C=O)CCCCO Intermediate Fragment 
41 182.0811696641 C=C(C)C(=O)[NH+](C#CCCO)C=O
42 172.0968197281 CC=C(O)[NH+](C=O)C=CCCO
43 168.0655196001 CC=C(O)[NH+](C#CC=CO)C=O
44 56.0494756121 CCC#[NH+]
45 118.0862550441 OC=[NH+]CCCCO
46 116.0706049801 O=C=[NH+]CCCCO
47 114.0549549161 O=C=[NH+]C=CCCO
48 112.0393048521 O=C=[NH+]C#CCCO
49 110.0236547881 O=C=[NH+]C#CC=CO
50 82.0287401681 CC(=C=O)C#[NH+]
51 84.0443902321 CC(C#[NH+])=CO
52 167.0815040121 CC(C#[NH+])=C(O)N=C=CCCO
53 169.0971540761 CC(C#[NH+])=C(O)N=CCCCO
54 171.1128041401 CC(C#[NH+])=C(O)NCCCCO
55 199.1077187601 CC(=C=NC=O)C(=[OH+])NCCCCO Intermediate Fragment 
56 156.1019051081 C=C(C)C(=O)[NH+]=CCCCO
57 154.0862550441 C=C(C)C(=O)[NH+]=C=CCCO
58 152.0706049801 C=C(C)C(=O)[NH+]=C=C=CCO
59 144.1019051081 CC=C(O)[NH+]=CCCCO
60 142.0862550441 CC=C(O)[NH+]=C=CCCO
61 140.0706049801 CC=C(O)[NH+]=C=C=CCO
62 138.0549549161 CC=C(O)[NH+]=C=C=C=CO
63 120.1019051081 OCCCC[NH2+]CO
64 82.0287401681 C=C=C=[NH+]C=O
65 84.0443902321 CC=C=[NH+]C=O
66 86.0600402961 [NH+]#CCCCO
67 110.0236547881 CC(=C=NC=O)C#[O+]
68 112.0393048521 CC(=C=[NH+]C=O)C=O
69 114.0549549161 CC(=C=[NH+]CO)C=O
70 116.0706049801 CC(=C=[NH+]CO)CO
71 118.0862550441 CC(C=[NH+]CO)CO
72 197.0920686961 CC(=C=[NH+]C=O)C(=O)N=CCCCO
73 199.1077187601 CC(=C=NC(O)=NCCCCO)C=[OH+] Intermediate Fragment 
74 75.0804413921 CC(C)C[OH2+]
75 73.0647913281 C=C(C)C[OH2+]
76 71.0491412641 C=C(C)C=[OH+]
77 69.0334912001 C=C(C)C#[O+]
78 131.0815040121 [NH3+]C(O)=NC=CCCO
79 141.0658539481 C=[NH+]C(O)=NC#CCCO
80 143.0815040121 C=[NH+]C(O)=NC=CCCO
81 167.0815040121 CC=C=[NH+]C(O)=NC#CCCO
82 169.0971540761 CC=C=[NH+]C(O)=NC=CCCO
83 171.1128041401 CC=C=[NH+]C(O)=NCCCCO
84 90.0913404241 CC(C[NH3+])CO
85 88.0756903601 CC(C=[NH2+])CO
86 86.0600402961 CC(C#[NH+])CO
87 197.0920686961 CC(=C=[NH+]C(O)=NC=CCCO)C=O
88 199.1077187601 CC=C=NC(=O)N(C=[OH+])CCCCO Intermediate Fragment 
89 144.0655196001 O=C[NH+](C=O)C=CCCO
90 199.1077187601 C=NC(=O)N(C=CCCO)C([OH2+])=CC Intermediate Fragment 
91 145.0971540761 C=[NH+]C(O)=NCCCCO
92 199.1077187601 C=C(C)C(=[OH+])N(C=CCCO)C(N)=O Intermediate Fragment 
93 137.0345538201 C=C1C=NC(=O)N([CH2+])C1=O
94 197.0920686961 CC(=C=N)C(=[OH+])N(C=O)C=CCCO Intermediate Fragment 
95 111.0076703761 O=C1C=COC1=C=[OH+]
96 113.0233204401 OC1C=COC1=C=[OH+]
97 85.0284058201 [OH+]=C1C=COC1
98 115.0389705041 OC1C=COC1=C[OH2+]
99 87.0440558841 [OH2+]C1C=COC1
100 115.0389705041 C=C=C(O)C(=O)C[OH2+] Intermediate Fragment 
101 115.0389705041 O=C=C=C(O)CC[OH2+] Intermediate Fragment 
102 117.0546205681 OC1C=COC1C[OH2+]
103 89.0597059481 [OH2+]C1CCOC1
104 99.0440558841 [OH2+]C=C1C=CCO1
105 117.0546205681 C=COC(=C[OH2+])CO Intermediate Fragment 
106 91.0389705041 OCC(=[OH+])CO
107 75.0440558841 OCC=C[OH2+]
108 73.0284058201 OCC#C[OH2+]
109 45.0334912001 C=C[OH2+]
110 89.0597059481 C=C[OH+]CCO
111 117.0546205681 C=C(O)C(=C[OH2+])OC Intermediate Fragment 
112 117.0546205681 C=C=C(O)C(O)C[OH2+] Intermediate Fragment 
113 29.0385765801 C=[CH3+]
114 99.0440558841 C=C=C(O)C=C[OH2+]
115 59.0491412641 CC=C[OH2+]
116 57.0334912001 CC#C[OH2+]
117 59.0127557561 OC=C=[OH+]
118 61.0284058201 OCC=[OH+]
119 117.0546205681 OC=C=C(O)CC[OH2+] Intermediate Fragment 
120 43.0178411361 C#C[OH2+]
121 87.0440558841 C=C(O)C=C[OH2+]
122 89.0597059481 C=C(O)CC[OH2+]
123 71.0127557561 OC#CC=[OH+]
124 117.0546205681 OC=C=COCC[OH2+] Intermediate Fragment 
125 119.0702706321 OC1CCOC1C[OH2+]
126 101.0597059481 CC1OCC=C1[OH2+]
127 101.0597059481 [OH2+]CC1C=CCO1
128 119.0702706321 OCC=C(O)CC[OH2+] Intermediate Fragment 
129 101.0597059481 C=C=C(O)CC[OH2+]
130 75.0804413921 CCCC[OH2+]
131 43.0542266441 CC=[CH3+]
132 57.0698767081 CCC=[CH3+]
133 55.0542266441 [CH2+]#CCC
134 241.0818979361 CC1=CN(C2C=C(O)C(=C=[OH+])O2)C(O)NC1O
135 243.0975480001 CC1CN(C2C=C(O)C(=C=[OH+])O2)C(O)NC1O
136 243.0975480001 CC1CN(C(O)=C=C(O)C#C[OH2+])C(O)NC1O Intermediate Fragment 
137 169.0607685681 C=C([OH2+])N1C=C(C)C(=O)N=C1O
138 245.1131980641 CC1CN(C2C=C(O)C(=C[OH2+])O2)C(O)NC1O
139 247.1288481281 CC1CN(C2C=C(O)C(C[OH2+])O2)C(O)NC1O
140 247.1288481281 CC1CN(C=C=C(O)C(O)C[OH2+])C(O)NC1O Intermediate Fragment 
141 249.1444981921 CC1CN(C2CC(O)C(C[OH2+])O2)C(O)NC1O
142 249.1444981921 CC1CN(CC=C(O)C(O)C[OH2+])C(O)NC1O Intermediate Fragment 
143 255.0975480001 CC1=CN(C2C=C(O)C(=C=[OH+])O2)C(O)N(C)C1O
144 255.0975480001 CC1=CN(C=C=C(O)C(=O)C=[OH+])C(O)N(C)C1O Intermediate Fragment 
145 237.0869833161 CC1=CN(C=C=C(O)C#C[OH2+])C(O)N(C)C1=O
146 257.1131980641 CC1CN(C2C=C(O)C(=C=[OH+])O2)C(O)N(C)C1O
147 257.1131980641 CC1CN(C(O)=C=C(O)C#C[OH2+])C(O)N(C)C1O Intermediate Fragment 
148 183.0764186321 C=C([OH2+])N1C=C(C)C(=O)N(C)C1=O
149 259.1288481281 CC1CN(C2C=C(O)C(=C[OH2+])O2)C(O)N(C)C1O
150 241.1182834441 C=C1OC(N2C=C(C)C([OH2+])N(C)C2O)C=C1O
151 261.1444981921 CC1CN(C2C=C(O)C(C[OH2+])O2)C(O)N(C)C1O
152 261.1444981921 CC1CN(C=C=C(O)C(O)C[OH2+])C(O)N(C)C1O Intermediate Fragment 
153 261.1444981921 CC1CN(C(O)=C=C(O)CC[OH2+])C(O)N(C)C1O Intermediate Fragment 
154 263.1601482561 CC1CN(C2CC(O)C(C[OH2+])O2)C(O)N(C)C1O
155 263.1601482561 CC1CN(CC=C(O)C(O)C[OH2+])C(O)N(C)C1O Intermediate Fragment 
156 283.1288481281 CCCN1C(O)C(C)=CN(C2C=C(O)C(=C=[OH+])O2)C1O
157 297.1444981921 CCCCN1C(O)C(C)=CN(C2C=C(O)C(=C=[OH+])O2)C1O
158 297.1444981921 CC1=CN(C2C=CC(=C=[OH+])O2)C(O)N(CCCCO)C1O
159 267.1339335081 CC1=CN(C2C=CCO2)C(=O)N(CCCCO)C1=[OH+]
160 225.0869833161 CC1=CN(C2C=CC(=C=[OH+])O2)C(O)NC1O
161 237.0869833161 CC1=CN(C2C=CC(=C=[OH+])O2)C(O)N(C)C1=O
162 239.1026333801 CC1=CN(C2C=CC(=C=[OH+])O2)C(O)N(C)C1O
163 243.1339335081 CC1CN(C2C=CC(=C[OH2+])O2)C(O)N(C)C1O
164 245.1495835721 CC1CN(C2C=CC(C[OH2+])O2)C(O)N(C)C1O
165 297.1444981921 CC1=CN(C=C=CC(=O)C=[OH+])C(O)N(CCCCO)C1O Intermediate Fragment 
166 297.1444981921 CC(=CN(CO)C1C=CC(=C=[OH+])O1)C(=O)NCCCCO Intermediate Fragment 
167 297.1444981921 CC(=CN=C1C=CC(=C=[OH+])O1)C(O)N(CO)CCCCO Intermediate Fragment 
168 315.1550628761 C=C(OC(=C=[OH+])CO)N1C=C(C)C(O)N(CCCCO)C1O Intermediate Fragment 
169 225.1233688241 C#CN1C=C(C)C(=[OH+])N(CCCCO)C1O
170 227.1390188881 C#CN1C=C(C)C([OH2+])N(CCCCO)C1O
171 241.1182834441 C=C([OH2+])N1C=C(C)C(=O)N(CCCCO)C1=O
172 241.1182834441 C=C([OH2+])N(C=O)C=C(C)C(=O)N=CCCCO Intermediate Fragment 
173 243.1339335081 C=C([OH2+])N1C=C(C)C(=O)N(CCCCO)C1O
174 243.1339335081 C=C([OH2+])N(C=O)C=C(C)C(=O)NCCCCO Intermediate Fragment 
175 315.1550628761 C=C(O)C(=C=[OH+])OCN1C=C(C)C(O)N(CCCCO)C1O Intermediate Fragment 
176 209.0920686961 CC1=CN(C)C(=O)N(C#CCCO)C1=[OH+]
177 211.1077187601 CC1=CN(C)C(=O)N(C=CCCO)C1=[OH+]
178 213.1233688241 CC1=CN(C)C(=O)N(CCCCO)C1=[OH+]
179 227.1026333801 CC1=CN(C=[OH+])C(=O)N(CCCCO)C1=O
180 229.1182834441 CC1=CN(C=[OH+])C(O)N(CCCCO)C1=O
181 315.1550628761 CC1CN(C=C=C(O)C(=O)C=[OH+])C(O)N(CCCCO)C1O Intermediate Fragment 
182 231.1703190161 C=CN1CC(C)C([OH2+])N(CCCCO)C1O
183 229.1546689521 C#CN1CC(C)C([OH2+])N(CCCCO)C1O
184 223.1077187601 C#CN1C=C(C)C(=[OH+])N(CCCCO)C1=O
185 89.0233204401 O=CC(=[OH+])CO
186 93.0546205681 OCC([OH2+])CO
187 75.0440558841 CC(=[OH+])CO
188 297.1444981921 CC1=CN(C=C=C(O)C#C[OH2+])C(O)N(CCCCO)C1O
189 77.0597059481 OCCC[OH2+]
190 279.1339335081 C#CC(O)=C=CN1C=C(C)C(=[OH+])N(CCCCO)C1O
191 279.1339335081 CC1=CN(CC#CC#C[OH2+])C(O)N(CCCCO)C1=O
192 255.1339335081 CC1=CN(CC#CO)C(O)N(CCCCO)C1=[OH+]
193 253.1182834441 CC1=CN(CC#CO)C(=O)N(CCCCO)C1=[OH+]
194 251.1026333801 CC1=CN(CC#CO)C(=O)N(C=CCCO)C1=[OH+]
195 259.1652336361 CC1CN(CC#CO)C(O)N(CCCCO)C1[OH2+]
196 257.1495835721 CC1=CN(CC#CO)C(O)N(CCCCO)C1[OH2+]
197 239.1390188881 C#CCN1C=C(C)C(=[OH+])N(CCCCO)C1O
198 195.0764186321 CC1=CN(CC#CO)C(=O)N(C)C1=[OH+]
199 197.0920686961 CC1=CN(CC#CO)C(O)N(C)C1=[OH+]
200 237.1233688241 C#CCN1C=C(C)C(=[OH+])N(CCCCO)C1=O
201 255.1339335081 CC(=CN=CC#CO)C(=[OH+])N(CO)CCCCO Intermediate Fragment 
202 255.1339335081 CC(=CN(C=O)CC#CO)C(=[OH+])NCCCCO Intermediate Fragment 
203 227.1390188881 CC(=C[NH+]=CC#CO)C(O)NCCCCO
204 63.0440558841 OCC[OH2+]
205 315.1550628761 CC1CN(C(O)=C=C(O)C#C[OH2+])C(O)N(CCCCO)C1O Intermediate Fragment 
206 247.1652336361 C=C([OH2+])N1CC(C)C(O)N(CCCCO)C1O
207 245.1495835721 C=C([OH2+])N1C=C(C)C(O)N(CCCCO)C1O
208 239.1026333801 C=C([OH2+])N1C=C(C)C(=O)N(C=CCCO)C1=O
209 68.9971056921 [O+]#CC#CO
210 55.0178411361 C#CC=[OH+]
211 231.1339335081 CC1=CN(C=[OH+])C(O)N(CCCCO)C1O
212 225.0869833161 CC1=CN(C=[OH+])C(=O)N(C=CCCO)C1=O
213 207.0764186321 CC1=CN(C)C(=O)N(C#CC=CO)C1=[OH+]
214 167.0451185041 CC1=CN(C#[O+])C(=O)N(C)C1=O
215 71.0491412641 C=CC(=C)[OH2+]
216 91.0753560121 CC(O)CC[OH2+]
217 73.0647913281 C=C([OH2+])CC
218 273.1444981921 CC1CN(C(=[OH+])C#CO)C(O)N(CCCCO)C1O
219 271.1288481281 CC1=CN(C(=[OH+])C#CO)C(O)N(CCCCO)C1O
220 271.1288481281 CC(=CN(CO)C(=[OH+])C#CO)C(=O)NCCCCO Intermediate Fragment 
221 269.1131980641 CC1=CN(C(=[OH+])C#CO)C(O)N(CCCCO)C1=O
222 315.1550628761 CC1CN(C(=C=CO)OC#C[OH2+])C(O)N(CCCCO)C1O Intermediate Fragment 
223 285.1444981921 C=C([OH+]C#CO)N1C=C(C)C(O)N(CCCCO)C1O
224 315.1550628761 CC=C(O)N(CCCCO)C(O)N(C)C1C=C(O)C(=C=[OH+])O1 Intermediate Fragment 
225 315.1550628761 CC=CN(C1C=C(O)C(=C=[OH+])O1)C(O)N(CO)CCCCO Intermediate Fragment 
226 315.1550628761 CC(=CN(C(O)NCCCCO)C1C=C(O)C(=C=[OH+])O1)CO Intermediate Fragment 
227 287.1601482561 CCC[NH+](C(O)NCCCCO)C1C=C(O)C(=C=O)O1
228 202.1073844121 CC(CO)C[NH2+]C1C=C(O)C(=CO)O1
229 315.1550628761 CC(=CN(CO)C1C=C(O)C(=C=[OH+])O1)C(O)NCCCCO Intermediate Fragment 
230 162.1488553001 CC(C)C(O)[NH2+]CCCCO
231 160.1332052361 C=C(C)C(O)[NH2+]CCCCO
232 158.1175551721 C=C(C)C(=O)[NH2+]CCCCO
233 98.0600402961 C=[NH+]C(=O)C(=C)C
234 96.0443902321 C#[N+]C(=O)C(=C)C
235 41.0385765801 [CH2+]#CC
236 136.0756903601 C=C(C)C(=O)[NH+]=C=C=CC
237 158.0447841561 O=C=C1OC([NH2+]CO)C=C1O
238 160.0604342201 OC=C1OC([NH2+]CO)C=C1O
239 132.0655196001 [NH3+]C1C=C(O)C(CO)O1
240 130.0498695361 [NH3+]C1C=C(O)C(=CO)O1
241 128.0342194721 [NH3+]C1C=C(O)C(=C=O)O1
242 160.0604342201 C=C(O)C(=C=O)OC[NH2+]CO Intermediate Fragment 
243 160.0604342201 O=C(CO)C(O)=C=C[NH2+]CO Intermediate Fragment 
244 160.0604342201 OC=CC(O)=C=C(O)[NH2+]CO Intermediate Fragment 
245 162.0760842841 OC[NH2+]C1C=C(O)C(CO)O1
246 146.1175551721 CC=C(O)[NH2+]CCCCO
247 172.0604342201 C[NH+](CO)C1C=C(O)C(=C=O)O1
248 174.0760842841 C[NH+](CO)C1C=C(O)C(=CO)O1
249 146.0811696641 C[NH2+]C1C=C(O)C(CO)O1
250 196.0604342201 CC#C[NH+](CO)C1C=C(O)C(=C=O)O1
251 198.0760842841 CC=C[NH+](CO)C1C=C(O)C(=C=O)O1
252 200.0917343481 CCC[NH+](CO)C1C=C(O)C(=C=O)O1
253 172.0968197281 CCC[NH2+]C1C=C(O)C(=CO)O1
254 200.0917343481 CCC[NH+](C=C=C(O)C(=O)C=O)CO Intermediate Fragment 
255 200.0917343481 CCC[NH+](CO)C(O)=C=C(O)C#CO Intermediate Fragment 
256 202.1073844121 CCC[NH+](CO)C1C=C(O)C(=CO)O1
257 202.1073844121 CCC[NH+](CO)C(O)=C=C(O)C=CO Intermediate Fragment 
258 204.1230344761 CCC[NH+](CO)C1C=C(O)C(CO)O1
259 206.1386845401 CCC[NH+](CO)C1CC(O)C(CO)O1
260 70.0651256761 CCCC#[NH+]
261 226.0709989041 CC(C=O)=C[NH+](CO)C1C=C(O)C(=C=O)O1
262 228.0866489681 CC(=C[NH+](CO)C1C=C(O)C(=C=O)O1)CO
263 287.1601482561 CC(C[NH2+]C1C=C(O)C(=C=O)O1)C(O)NCCCCO
264 257.1495835721 CC(=C[NH+]=C1C=C(O)CO1)C(O)NCCCCO
265 269.1495835721 C=C1OC(=[NH+]C=C(C)C(O)NCCCCO)C=C1O
266 144.0655196001 C[NH2+]C1C=C(O)C(=CO)O1
267 168.0655196001 CCC[NH+]=C1C=C(O)C(=C=O)O1
268 170.0811696641 CCC[NH2+]C1C=C(O)C(=C=O)O1
269 174.1124697921 CCC[NH2+]C1C=C(O)C(CO)O1
270 198.0760842841 CC(CO)C[NH+]=C1C=C(O)C(=C=O)O1
271 269.1495835721 CC(C[NH+]=C1C=CC(=C=O)O1)C(O)NCCCCO
272 287.1601482561 C=C([NH+]=CC(C)C(O)NCCCCO)OC(=C=O)CO Intermediate Fragment 
273 197.1284542041 C#C[NH+]=C=C(C)C(O)NCCCCO
274 213.1233688241 C=C(O)[NH+]=C=C(C)C(=O)NCCCCO
275 287.1601482561 C=C(O)C(=C=O)OC=[NH+]CC(C)C(O)NCCCCO Intermediate Fragment 
276 287.1601482561 CC(C[NH2+]C=C=C(O)C(=O)C=O)C(O)NCCCCO Intermediate Fragment 
277 269.1495835721 CC(C[NH+]=C=C=C(O)C#CO)C(O)NCCCCO
278 287.1601482561 CC(C[NH2+]C(O)=C=C(O)C#CO)C(O)NCCCCO Intermediate Fragment 
279 215.1390188881 C=C(O)[NH+]=C=C(C)C(O)NCCCCO
280 201.1233688241 CC(=C[NH+]=C=O)C(O)NCCCCO
281 243.1339335081 CC(C=[NH+]C(=O)C#CO)C(O)NCCCCO
282 241.1182834441 CC(=C=[NH+]C(=O)C#CO)C(O)NCCCCO
283 287.1601482561 CC(C[NH2+]C(=C=CO)OC#CO)C(O)NCCCCO Intermediate Fragment 
284 285.1444981921 CC(C[NH+]=C1C=C(O)C(=C=O)O1)C(O)NCCCCO
285 267.1339335081 CCCCNC(O)C(C)=C[NH+]=C1C=C(O)C(=C=O)O1
286 285.1444981921 CC(C[NH+]=C=C=C(O)C(=O)C=O)C(O)NCCCCO Intermediate Fragment 
287 285.1444981921 CC(C=[NH+]C(O)=C=C(O)C#CO)C(O)NCCCCO Intermediate Fragment 
288 285.1444981921 CC(C=[NH+]C(=C=CO)OC#CO)C(O)NCCCCO Intermediate Fragment 
289 283.1288481281 CC(=C[NH+]=C1C=C(O)C(=C=O)O1)C(O)NCCCCO
290 315.1550628761 CC(CN=C1C=C(O)C(=C=[OH+])O1)C(O)N(CO)CCCCO Intermediate Fragment 
291 190.1437699201 C=C(C)C(O)[NH+](CO)CCCCO
292 184.0968197281 C=C(C)C(=O)[NH+](C=O)C=CCCO
293 315.1550628761 CC(C)C(O)N(CCCCO)C(O)N=C1C=C(O)C(=C=[OH+])O1 Intermediate Fragment 
294 313.1394128121 CC1=CN(C2C=C(O)C(=C=[OH+])O2)C(O)N(CCCCO)C1O
