#In-silico ESI-MS/MS [M+H]+ Spectra
#PREDICTED BY CFM-ID 4.0.8
#SMILES=[C@H]1(C[C@@H](O[C@@H]1CO)n1ccc([n+](c1=O)c1c2ccccc2c2c3c1ccc1cccc(c31)cc2)N)O
#InChiKey=HIOGAMSNYGYFSI-VDKIKQQVSA-O
energy0
362.12879 100.00 2 39 47 63 72 76 77 70 75 74 55 62 60 (44.853 0.34364 0.067152 0.052146 0.0013052 0.00081523 0.00037759 0.00027792 0.00022315 0.00021411 9.6571e-05 2.4993e-05 5.1667e-06)
364.14444 31.66 4 28 26 40 54 49 56 51 50 48 57 53 61 58 59 (13.635 0.48456 0.085617 0.0809 0.014688 0.011468 0.0093261 0.0063782 0.0051313 0.0046048 0.0033254 0.0026092 0.0025714 0.0019042 0.00053157)
478.17613 50.31 0 189 150 177 186 172 181 138 147 212 179 211 213 180 (18.6 1.7664 1.1082 0.64681 0.41858 0.090697 0.090396 0.051388 0.016682 0.0054789 0.0040668 0.00213 0.00097646 0.00015355)
energy1
112.05054 5.08 22 (2.5498)
253.10118 5.25 8 120 117 127 125 115 112 119 (2.6095 0.016477 0.0023659 0.0023092 0.0013452 0.0013449 0.0012051 0.0011105)
294.09134 3.57 46 (1.7946)
335.11789 3.93 43 64 (1.7411 0.23339)
362.12879 100.00 2 47 39 63 70 77 55 76 75 72 62 74 60 (47.295 1.7158 0.86543 0.23792 0.038873 0.031887 0.022049 0.0090512 0.0054569 0.0029832 0.0021027 0.0016802 0.0005103)
364.14444 35.78 4 40 28 26 54 49 48 56 61 57 58 51 53 59 50 (15.179 0.91302 0.82549 0.27752 0.22258 0.15124 0.1485 0.0842 0.050968 0.049945 0.019027 0.01582 0.014453 0.012369 0.0055391)
388.14444 3.68 11 (1.8489)
460.16557 3.41 6 158 10 13 18 16 17 (0.86433 0.40925 0.16512 0.12792 0.053398 0.049662 0.043439)
energy2
45.03349 9.51 92 (2.3967)
99.04406 10.14 87 7 97 (1.2229 1.2014 0.13221)
112.05054 21.14 22 (5.3286)
251.08553 24.12 124 118 129 116 126 114 (2.9477 0.8572 0.76367 0.52939 0.50628 0.47669)
253.10118 100.00 8 120 112 117 127 125 115 119 (18.2 3.4188 0.85842 0.78909 0.75116 0.48682 0.45349 0.25125)
257.13248 7.63 20 (1.9227)
259.14813 4.99 109 111 110 (0.99076 0.15983 0.10762)
268.11208 15.19 36 (3.8305)
294.09134 6.10 46 (1.5387)
295.12297 6.66 34 (1.6781)
307.12297 5.01 33 (1.2639)
317.10732 4.39 31 (1.1068)
319.12297 5.32 30 (1.3405)
334.13387 21.89 38 (5.5181)
335.11789 5.53 43 64 (1.3852 0.0087219)
336.14952 4.82 37 (1.2149)
346.13387 5.81 24 (1.4653)
362.12879 29.59 39 2 47 60 70 62 63 55 77 72 75 76 74 (2.7035 2.1282 1.3001 0.43815 0.29042 0.22766 0.14356 0.071087 0.057159 0.032156 0.023692 0.021554 0.021012)
364.14444 13.77 28 4 40 49 59 61 26 51 48 50 53 56 57 58 54 (1.0686 0.97626 0.61357 0.16637 0.15134 0.078635 0.066411 0.064087 0.061303 0.05264 0.047035 0.034017 0.033676 0.029546 0.026787)
392.17574 8.47 140 (2.134)
394.19139 7.80 141 (1.9653)

0 478.1761326681 NC1=[N+](C2=C3C=CC4=CC=CC5=C4C3=C(C=C5)C3=CC=CC=C32)C(=O)N(C2CC(O)C(CO)O2)C=C1
1 446.1499179201 [NH2+]=C1C=CN(C2C=C(O)CO2)C(=O)N1C1=C2C=CC3=CC=CC4=C3C2=C(C=C4)C2=CC=CC=C21
2 362.1287885521 [NH3+]C1=CC=NC(=O)N1C1=C2C=CC3=CC=CC4=C3C2=C(C=C4)C2=CC=CC=C21
3 448.1655679841 [NH3+]C1C=CN(C2C=C(O)CO2)C(=O)N1C1=C2C=CC3=CC=CC4=C3C2=C(C=C4)C2=CC=CC=C21
4 364.1444386161 [NH3+]C1=CC=NC(=O)N1C1=C2C=CC3=CC=CC4=C3C2=C(CC4)C2=CC=CC=C21
5 450.1812180481 [NH3+]C1C=CN(C2C=C(O)CO2)C(=O)N1C1=C2C=CC3=CC=CC4=C3C2=C(CC4)C2=CC=CC=C21
6 460.1655679841 C=C1OC(N2C=CC([NH3+])N(C3=C4C=CC5=CC=CC6=C5C4=C(C=C6)C4=CC=CC=C43)C2=O)C=C1O
7 99.0440558841 C=C1OC=CC1[OH2+]
8 253.1011768361 C1=CC2=[CH2+]C3=C4C(=C2C=C1)C=CC1=C4C(=CC=C1)C=C3
9 442.1550033001 C=C1C=CC(N2C=CC(=[NH2+])N(C3=C4C=CC5=CC=CC6=C5C4=C(C=C6)C4=CC=CC=C43)C2=O)O1
10 460.1655679841 C=C(CO)OC(=C)N1C=CC(=[NH2+])N(C2=C3C=CC4=CC=CC5=C4C3=C(C=C5)C3=CC=CC=C32)C1=O Intermediate Fragment 
11 388.1444386161 C#CN1C=CC([NH3+])N(C2=C3C=CC4=CC=CC5=C4C3=C(C=C5)C3=CC=CC=C32)C1=O
12 406.1550033001 C=C(O)N1C=CC([NH3+])N(C2=C3C=CC4=CC=CC5=C4C3=C(C=C5)C3=CC=CC=C32)C1=O
13 460.1655679841 C#COC(=C=CO)N1C=CC([NH3+])N(C2=C3C=CC4=CC=CC5=C4C3=C(CC5)C3=CC=CC=C32)C1=O Intermediate Fragment 
14 432.1706533641 C#COC(=C)N1C=CC([NH3+])N(C2=C3C=CC4=CC=CC5=C4C3=C(CC5)C3=CC=CC=C32)C1=O
15 418.1550033001 [NH3+]C1C=CN(CC#CO)C(=O)N1C1=C2C=CC3=CC=CC4=C3C2=C(C=C4)C2=CC=CC=C21
16 460.1655679841 C=C1OC(N(C=C=C[NH3+])C(O)=NC2=C3C=CC4=CC=CC5=C4C3=C(C=C5)C3=CC=CC=C32)C=C1O Intermediate Fragment 
17 460.1655679841 C=C1OC(N(C=O)C=C=C([NH3+])N=C2C3=CC=CC=C3C3=C4C2=CC=C2C=CC=C(C=C3)C24)C=C1O Intermediate Fragment 
18 460.1655679841 C=C1OC(=NC=C=C([NH3+])N(C=O)C2=C3C=CC4=CC=CC5=C4C3=C(CC5)C3=CC=CC=C32)C=C1O Intermediate Fragment 
19 368.1757387441 [NH3+]C1=CC=NC(=O)N1C1=C2C=CC3=CCCC4CCC(=C2C34)C2=CC=CC=C21
20 257.1324769641 C1=CC2=[CH2+]C3=C4C(=C2C=C1)CCC1C=CC=C(C=C3)C41
21 255.1168269001 C1=CC2=[CH2+]C3=C4C(=C2C=C1)CCC1=C4C(=CC=C1)C=C3
22 112.0505382321 [NH3+]C1=CC=NC(O)=N1
23 366.1600886801 [NH3+]C1=CC=NC(=O)N1C1=C2C=CC3=CC=CC4CCC(=C2C34)C2=CC=CC=C21
24 346.1338739321 [NH2+]=C1C=CN=CN1C1=C2C=CC3=CC=CC4=C3C2=C(C=C4)C2=CC=CC=C21
25 347.1178895201 [OH+]=C1N=CC=CN1C1=C2C=CC3=CC=CC4=C3C2=C(C=C4)C2=CC=CC=C21
26 364.1444386161 N=C=C=C([NH3+])N(C=O)C1=C2C=CC=CC2=C2CCC3=C4C(=CC=C3)C=CC1=C24 Intermediate Fragment 
27 296.1069904881 O=C=[NH+]C1=C2C=CC=CC2=C2CCC3=C4C(=CC=C3)C=CC1=C24
28 364.1444386161 [NH3+]C(=C=C=NC=O)N=C1C2=CC=CC=C2C2=C3C1=CC=C1C=CC=C(CC2)C13 Intermediate Fragment 
29 321.1386249641 C#CC(N)=[NH+]C1=C2C=CC=CC2=C2CCC3=C4C(=CC=C3)C=CC1=C24
30 319.1229749001 C#CC(N)=[NH+]C1=C2C=CC=CC2=C2C=CC3=C4C(=CC=C3)C=CC1=C24
31 317.1073248361 [C+]#CC(N)=NC1=C2C=CC=CC2=C2C=CC3=C4C(=CC=C3)C=CC1=C24
32 309.1386249641 C=C(N)[NH+]=C1C2=CC=CC=C2C2=C3C1=CC=C1C=CC=C(C=C2)C13
33 307.1229749001 [CH+]=C(N)N=C1C2=CC=CC=C2C2=C3C1=CC=C1C=CC=C(C=C2)C13
34 295.1229749001 NC=[NH+]C1=C2C=CC=CC2=C2C=CC3=C4C(=CC=C3)C=CC1=C24
35 293.1073248361 N=C=[NH+]C1=C2C=CC=CC2=C2C=CC3=C4C(=CC=C3)C=CC1=C24
36 268.1120758681 [NH2+]=C1C2=CC=CC=C2C2=C3C1=CC=C1C=CC=C(C=C2)C13
37 336.1495239961 [NH+]#CC=C(N)N=C1C2=CC=CC=C2C2=C3C1=CC=C1C=CC=C(CC2)C13
38 334.1338739321 [NH+]#CC=C(N)N=C1C2=CC=CC=C2C2=C3C1=CC=C1C=CC=C(C=C2)C13
39 362.1287885521 NC(=C=C=[NH+]C=O)N=C1C2=CC=CC=C2C2=C3C1=CC=C1C=CC=C(C=C2)C13
40 364.1444386161 [NH3+]C=C=C=NC(O)=NC1=C2C=CC=CC2=C2CCC3=C4C(=CC=C3)C=CC1=C24 Intermediate Fragment 
41 321.1022394561 C#[N+]C(O)=NC1=C2C=CC=CC2=C2C=CC3=C4C(=CC=C3)C=CC1=C24
42 323.1178895201 C=[NH+]C(O)=NC1=C2C=CC=CC2=C2C=CC3=C4C(=CC=C3)C=CC1=C24
43 335.1178895201 C=C=[NH+]C(O)=NC1=C2C=CC=CC2=C2C=CC3=C4C(=CC=C3)C=CC1=C24
44 270.1277259321 [NH2+]=C1C2=CC=CC=C2C2=C3C1=CC=C1C=CC=C(CC2)C13
45 272.1433759961 [NH2+]=C1C2=CC=CC=C2C2=C3C1=CC=C1C=CCC(CC2)C13
46 294.0913404241 O=C=[NH+]C1=C2C=CC=CC2=C2C=CC3=C4C(=CC=C3)C=CC1=C24
47 362.1287885521 NC=C=C=[NH+]C(O)=NC1=C2C=CC=CC2=C2C=CC3=C4C(=CC=C3)C=CC1=C24
48 364.1444386161 C=C=NC(=O)N(C[NH3+])C1=C2C=CC=CC2=C2C=CC3=C4C(=CC=C3)C=CC1=C24 Intermediate Fragment 
49 364.1444386161 C=NC(=O)N(C(=C)[NH3+])C1=C2C=CC=CC2=C2C=CC3=C4C(=CC=C3)C=CC1=C24 Intermediate Fragment 
50 364.1444386161 C=C=C([NH3+])N(C(N)=O)C1=C2C=CC=CC2=C2C=CC3=C4C(=CC=C3)C=CC1=C24 Intermediate Fragment 
51 364.1444386161 C=C=C=C1C(C)=C(N2C(=O)N=CC=C2[NH3+])C2=CC=C3C=CC=C4C=CC1=C2C43 Intermediate Fragment 
52 338.1287885521 C=C1C(=C)C(N2C(=O)N=CC=C2[NH3+])=C2C=CC3=CC=CC4=C3C2=C1C=C4
53 364.1444386161 C=C=C=CC1=C(N2C(=O)N=CC=C2[NH3+])C2=C3C(=C1)CCC1=C3C(=CC=C1)C=C2 Intermediate Fragment 
54 364.1444386161 C=C=C1C=CC=C2C=CC3=C(C=C(N4C(=O)N=CC=C4[NH3+])C4=CC=CC=C43)C12 Intermediate Fragment 
55 362.1287885521 C#CC1=CC=CC2=C1C1=C(C=C2)C2=CC=CC=C2C(N2C(=O)N=CC=C2[NH3+])=C1
56 364.1444386161 C=C=C=C1C=CC2=C(N3C(=O)N=CC=C3[NH3+])C3=CC=CC=C3C3=C2C1=CCC3 Intermediate Fragment 
57 364.1444386161 C=C=C=C1C=CC2=C3C(=C(N4C(=O)N=CC=C4[NH3+])C4=CC=CC=C42)C=CCC13 Intermediate Fragment 
58 364.1444386161 C=CC1=C2C(=CC=C1)C=CC1=C(N3C(=O)N=CC=C3[NH3+])C3=CC=CC=C3C=C12 Intermediate Fragment 
59 364.1444386161 [NH3+]C1=CC=NC(=O)N1C=C1C=CC=CC1=C1C=CC2=C3C(=CC=C2)C=CC=C13 Intermediate Fragment 
60 362.1287885521 NC1=CC=NC(=O)N1[C+]=C1C=CC=CC1=C1C=CC2=C3C(=CC=C2)C=CC=C13
61 364.1444386161 [NH3+]C1=CC=NC(=O)N1C=C1C=CC2=CC=CC3=C2C1=C(C1=CC=CC=C1)C=C3 Intermediate Fragment 
62 362.1287885521 NC1=CC=NC(=O)N1[C+]=C1C=CC2=CC=CC3=C2C1=C(C1=CC=CC=C1)C=C3
63 362.1287885521 N=C=C=C([NH3+])N(C=O)C1=C2C=CC=CC2=C2C=CC3=C4C(=CC=C3)C=CC1=C24 Intermediate Fragment 
64 335.1178895201 C=C(N)[N+](=C=O)C1=C2C=CC=CC2=C2C=CC3=C4C(=CC=C3)C=CC1=C24
65 69.0447245801 [NH+]#CC=CN
66 95.0239891361 N=C=C=C=[NH+]C=O
67 332.1182238681 N#C[C+]=C(N)N=C1C2=CC=CC=C2C2=C3C1=CC=C1C=CC=C(C=C2)C13
68 360.1131384881 NC(=C=C=NC#[O+])N=C1C2=CC=CC=C2C2=C3C1=CC=C1C=CC=C(C=C2)C13
69 333.1022394561 [CH+]=C=NC(O)=NC1=C2C=CC=CC2=C2C=CC3=C4C(=CC=C3)C=CC1=C24
70 362.1287885521 C=C=NC(=O)N(C=[NH2+])C1=C2C=CC=CC2=C2C=CC3=C4C(=CC=C3)C=CC1=C24 Intermediate Fragment 
71 321.1022394561 N#C[NH+](C=O)C1=C2C=CC=CC2=C2C=CC3=C4C(=CC=C3)C=CC1=C24
72 362.1287885521 C=C=C=C1C(=C)C(N2C(=O)N=CC=C2[NH3+])=C2C=CC3=CC=CC4=C3C2=C1C=C4 Intermediate Fragment 
73 336.1131384881 [CH+]=C1C(=C)C2=C3C(=C1N1C(=O)N=CC=C1N)C=CC1=CC=CC(=C13)C=C2
74 362.1287885521 C=C=C1C(=C=C)C(N2C(=O)N=CC=C2[NH3+])=C2C=CC3=CC=CC4=C3C2=C1C=C4 Intermediate Fragment 
75 362.1287885521 C=C=C=CC1=C(N2C(=O)N=CC=C2[NH3+])C2=C3C(=C1)C=CC1=C3C(=CC=C1)C=C2 Intermediate Fragment 
76 362.1287885521 C=C=C=C1C=CC2=C(N3C(=O)N=CC=C3[NH3+])C3=CC=CC=C3C3=C2C1=CC=C3 Intermediate Fragment 
77 362.1287885521 C=C=C=C1C=CC2=C3C1=CC=CC3=C(N1C(=O)N=CC=C1[NH3+])C1=CC=CC=C12 Intermediate Fragment 
78 336.1131384881 [CH+]=C1C=CC2=C3C1=CC=CC3=C(N1C(=O)N=CC=C1N)C1=CC=CC=C12
79 111.0076703761 O=C1C=COC1=C=[OH+]
80 113.0233204401 OC1C=COC1=C=[OH+]
81 115.0389705041 OC1C=COC1=C[OH2+]
82 87.0440558841 [OH2+]C1C=COC1
83 115.0389705041 O=C=C=C(O)CC[OH2+] Intermediate Fragment 
84 117.0546205681 OC1C=COC1C[OH2+]
85 85.0284058201 [OH+]=C1C=COC1
86 89.0597059481 [OH2+]C1CCOC1
87 99.0440558841 [OH2+]C=C1C=CCO1
88 117.0546205681 C=COC(=C[OH2+])CO Intermediate Fragment 
89 91.0389705041 OCC(=[OH+])CO
90 75.0440558841 OCC=C[OH2+]
91 73.0284058201 OCC#C[OH2+]
92 45.0334912001 C=C[OH2+]
93 89.0597059481 C=C[OH+]CCO
94 117.0546205681 C=C(O)C(=C[OH2+])OC Intermediate Fragment 
95 117.0546205681 C=C=C(O)C(O)C[OH2+] Intermediate Fragment 
96 29.0385765801 C=[CH3+]
97 99.0440558841 C=C=C(O)C=C[OH2+]
98 59.0491412641 CC=C[OH2+]
99 57.0334912001 CC#C[OH2+]
100 59.0127557561 OC=C=[OH+]
101 61.0284058201 OCC=[OH+]
102 117.0546205681 OC=C=C(O)CC[OH2+] Intermediate Fragment 
103 43.0178411361 C#C[OH2+]
104 87.0440558841 C=C(O)C=C[OH2+]
105 89.0597059481 C=C(O)CC[OH2+]
106 71.0127557561 OC#CC=[OH+]
107 47.0491412641 CC[OH2+]
108 117.0546205681 OC=C=COCC[OH2+] Intermediate Fragment 
109 259.1481270281 C1=CC2=[CH2+]C3=C4C(=C2C=C1)CCC1CCC=C(C=C3)C41
110 259.1481270281 C1=CCC(=[CH2+]C2=CC=C3C=CC=C4CCC=C2C34)C=C1 Intermediate Fragment 
111 259.1481270281 CCC1C=CC=C2C=CC3=C(C=C4C=CC=CC4=[CH2+]3)C21 Intermediate Fragment 
112 253.1011768361 C=C=C=C1C(=C)[CH2+]=C2C=CC3=CC=CC4=C3C2=C1C=C4 Intermediate Fragment 
113 227.0855267721 [CH+]=C1C=C2C=CC3=CC=CC4=C3C2=C(C=C4)C1=C
114 251.0855267721 C#CC=C1C(=[CH+])C=C2C=CC3=CC=CC4=C3C2=C1C=C4
115 253.1011768361 C=C=C1[CH2+]=C2C=CC3=CC=CC4=C3C2=C(C=C4)C1=C=C Intermediate Fragment 
116 251.0855267721 C#CC1=C2C=CC3=C4C(=CC=C3)C=CC(=C24)C=C1[CH+]#C
117 253.1011768361 C=C=C=C1[CH2+]=C2C=CC3=CC=CC4=C3C2=C(C=C4)C1=C Intermediate Fragment 
118 251.0855267721 [CH+]=C=C=C1C=C2C=CC3=CC=CC4=C3C2=C(C=C4)C1=C
119 253.1011768361 C=C=C=CC1=[CH2+]C2=C3C(=C1)C=CC1=C3C(=CC=C1)C=C2 Intermediate Fragment 
120 253.1011768361 C=C=C=C=C1C=[CH2+]C2=CC=C3C=CC=C4C=CC1=C2C43 Intermediate Fragment 
121 227.0855267721 [CH2+]#CC1=C2C=CC3=C4C(=CC=C3)C=CC(=C24)C=C1
122 225.0698767081 [C+]#CC1=C2C=CC3=C4C(=CC=C3)C=CC(=C24)C=C1
123 203.0855267721 C1=CC2=C3C(=C1)C=CC1=C3C(=CC=[CH2+]1)C=C2
124 251.0855267721 [CH2+]#CC#CC1=C2C=CC3=C4C(=CC=C3)C=CC(=C24)C=C1
125 253.1011768361 C=C=C=C1C=CC2=C3C1=CC=CC3=C1C=CC=CC1=[CH2+]2 Intermediate Fragment 
126 251.0855267721 [CH+]=C=C=C1C=CC2=C3C1=CC=CC3=C1C=CC=CC1=C2
127 253.1011768361 C=C=C=C1C=CC2=C3C=CC=CC3=[CH2+]C3=C2C1=CC=C3 Intermediate Fragment 
128 227.0855267721 [CH+]=C1C=CC2=C3C=CC=CC3=CC3=C2C1=CC=C3
129 251.0855267721 [C+]#CC=C1C=CC2=C3C=CC=CC3=CC3=C2C1=CC=C3
130 220.0352820921 [NH3+]C1=NC(=O)N(C2=CC(=O)C(=C=O)O2)C=C1
131 222.0509321561 [NH3+]C1=NC(=O)N(C2=CC(O)C(=C=O)O2)C=C1
132 224.0665822201 [NH3+]C1=NC(O)N(C2=CC(O)C(=C=O)O2)C=C1
133 224.0665822201 [NH3+]C1=NC(O)N(C=C=C(O)C(=O)C=O)C=C1 Intermediate Fragment 
134 168.0767529801 [NH3+]C1=NC(O)N(C=C=CO)C=C1
135 226.0822322841 [NH3+]C1C=CN(C2=CC(O)C(=C=O)O2)C(O)N1
136 226.0822322841 [NH3+]C1C=CN(C=C=C(O)C(=O)C=O)C(O)N1 Intermediate Fragment 
137 461.1495835721 O=C1N(C2=C3C=CC4=CC=CC5=C4C3=C(CC5)C3=CC=CC=C32)CC=CN1C1C=C(O)C(=C=[OH+])O1
138 478.1761326681 C=C(OC(=C=O)CO)N1C=CC([NH3+])N(C2=C3C=CC4=CC=CC5=C4C3=C(CC5)C3=CC=CC=C32)C1=O Intermediate Fragment 
139 390.1600886801 C#CN1C=CC([NH3+])N(C2=C3C=CC4=CC=CC5=C4C3=C(CC5)C3=CC=CC=C32)C1=O
140 392.1757387441 C#CN1C=CC([NH3+])N(C2=C3C=CC4=CC=CC5CCC(=C3C45)C3=CC=CC=C32)C1=O
141 394.1913888081 C#CN1C=CC([NH3+])N(C2=C3C=CC4=CCCC5CCC(=C3C45)C3=CC=CC=C32)C1=O
142 402.1237031721 [CH+]=C(O)N1C=CC(=N)N(C2=C3C=CC4=CC=CC5=C4C3=C(C=C5)C3=CC=CC=C32)C1=O
143 404.1393532361 C=C(O)N1C=CC(=[NH2+])N(C2=C3C=CC4=CC=CC5=C4C3=C(C=C5)C3=CC=CC=C32)C1=O
144 406.1550033001 C=C(O)N(C=O)C=C=C([NH3+])N=C1C2=CC=CC=C2C2=C3C1=CC=C1C=CC=C(C=C2)C13 Intermediate Fragment 
145 378.1600886801 C=C(O)[NH+]=C=C=C(N)N=C1C2=CC=CC=C2C2=C3C1=CC=C1C=CC=C(CC2)C13
146 408.1706533641 C=C(O)N1C=CC([NH3+])N(C2=C3C=CC4=CC=CC5=C4C3=C(CC5)C3=CC=CC=C32)C1=O
147 478.1761326681 C=C(O)C(=C=O)OCN1C=CC([NH3+])N(C2=C3C=CC4=CC=CC5=C4C3=C(CC5)C3=CC=CC=C32)C1=O Intermediate Fragment 
148 374.1287885521 [CH2+]N1C=CC(=N)N(C2=C3C=CC4=CC=CC5=C4C3=C(C=C5)C3=CC=CC=C32)C1=O
149 392.1393532361 [NH3+]C1C=CN(C=O)C(=O)N1C1=C2C=CC3=CC=CC4=C3C2=C(C=C4)C2=CC=CC=C21
150 478.1761326681 [NH3+]C1C=CN(C=C=C(O)C(=O)C=O)C(=O)N1C1=C2C=CC3=CC=CC4CCC(=C2C34)C2=CC=CC=C21 Intermediate Fragment 
151 386.1287885521 C#CN1C=CC(=[NH2+])N(C2=C3C=CC4=CC=CC5=C4C3=C(C=C5)C3=CC=CC=C32)C1=O
152 89.0233204401 O=CC(=[OH+])CO
153 93.0546205681 OCC([OH2+])CO
154 75.0440558841 CC(=[OH+])CO
155 380.1757387441 CN1C=CC([NH3+])N(C2=C3C=CC4=CC=CC5=C4C3=C(CC5)C3=CC=CC=C32)C1=O
156 378.1600886801 CN1C=CC([NH3+])N(C2=C3C=CC4=CC=CC5=C4C3=C(C=C5)C3=CC=CC=C32)C1=O
157 376.1444386161 CN1C=CC(=[NH2+])N(C2=C3C=CC4=CC=CC5=C4C3=C(C=C5)C3=CC=CC=C32)C1=O
158 460.1655679841 [NH3+]C1C=CN(C=C=C(O)C#CO)C(=O)N1C1=C2C=CC3=CC=CC4=C3C2=C(CC4)C2=CC=CC=C21
159 432.1706533641 CC(O)=C=CN1C=CC([NH3+])N(C2=C3C=CC4=CC=CC5=C4C3=C(C=C5)C3=CC=CC=C32)C1=O
160 442.1550033001 C#CC(O)=C=CN1C=CC([NH3+])N(C2=C3C=CC4=CC=CC5=C4C3=C(C=C5)C3=CC=CC=C32)C1=O
161 442.1550033001 [NH3+]C1C=CN(CC#CC#CO)C(=O)N1C1=C2C=CC3=CC=CC4=C3C2=C(C=C4)C2=CC=CC=C21
162 422.1863034281 [NH3+]C1C=CN(CC#CO)C(=O)N1C1=C2C=CC3=CC=CC4CCC(=C2C34)C2=CC=CC=C21
163 420.1706533641 [NH3+]C1C=CN(CC#CO)C(=O)N1C1=C2C=CC3=CC=CC4=C3C2=C(CC4)C2=CC=CC=C21
164 402.1600886801 C#CCN1C=CC([NH3+])N(C2=C3C=CC4=CC=CC5=C4C3=C(C=C5)C3=CC=CC=C32)C1=O
165 420.1706533641 [NH3+]C(=C=CN(C=O)CC#CO)N=C1C2=CC=CC=C2C2=C3C1=CC=C1C=CC=C(CC2)C13 Intermediate Fragment 
166 400.1444386161 C#CCN1C=CC(=[NH2+])N(C2=C3C=CC4=CC=CC5=C4C3=C(C=C5)C3=CC=CC=C32)C1=O
167 418.1550033001 [NH3+]C(=C=CN=CC#CO)N(C=O)C1=C2C=CC=CC2=C2CCC3=C4C(=CC=C3)C=CC1=C24 Intermediate Fragment 
168 418.1550033001 [NH3+]C(=C=CN(C=O)CC#CO)N=C1C2=CC=CC=C2C2=C3C1=CC=C1C=CC=C(C=C2)C13 Intermediate Fragment 
169 416.1393532361 [NH2+]=C1C=CN(CC#CO)C(=O)N1C1=C2C=CC3=CC=CC4=C3C2=C(C=C4)C2=CC=CC=C21
170 41.0021910721 [C+]#CO
171 63.0440558841 OCC[OH2+]
172 478.1761326681 [NH3+]C1C=CN(C(O)=C=C(O)C#CO)C(=O)N1C1=C2C=CC3=CC=CC4CCC(=C2C34)C2=CC=CC=C21 Intermediate Fragment 
173 390.1237031721 [NH2+]=C1C=CN(C=O)C(=O)N1C1=C2C=CC3=CC=CC4=C3C2=C(C=C4)C2=CC=CC=C21
174 436.1655679841 [NH3+]C1C=CN(C(=O)C#CO)C(=O)N1C1=C2C=CC3=CC=CC4CCC(=C2C34)C2=CC=CC=C21
175 418.1550033001 C#CC(=O)N1C=CC([NH3+])N(C2=C3C=CC4=CC=CC5=C4C3=C(CC5)C3=CC=CC=C32)C1=O
176 434.1499179201 [NH3+]C1C=CN(C(=O)C#CO)C(=O)N1C1=C2C=CC3=CC=CC4=C3C2=C(CC4)C2=CC=CC=C21
177 478.1761326681 [NH3+]C1C=CN(C(=C=CO)OC#CO)C(=O)N1C1=C2C=CC3=CC=CC4CCC(=C2C34)C2=CC=CC=C21 Intermediate Fragment 
178 450.1812180481 C=C(OC#CO)N1C=CC([NH3+])N(C2=C3C=CC4=CC=CC5CCC(=C3C45)C3=CC=CC=C32)C1=O
179 478.1761326681 C=C([NH3+])N(C(=O)N(C)C1C=C(O)C(=C=O)O1)C1=C2C=CC3=CC=CC4=C3C2=C(CC4)C2=CC=CC=C21 Intermediate Fragment 
180 478.1761326681 C=CN(C(=O)N(C[NH3+])C1=C2C=CC3=CC=CC4=C3C2=C(CC4)C2=CC=CC=C21)C1C=C(O)C(=C=O)O1 Intermediate Fragment 
181 478.1761326681 [NH3+]C=C=CN(C(O)=NC1=C2C=CC3=CC=CC4CCC(=C2C34)C2=CC=CC=C21)C1C=C(O)C(=C=O)O1 Intermediate Fragment 
182 435.1339335081 C[NH+](C(O)=NC1=C2C=CC3=CC=CC4=C3C2=C(C=C4)C2=CC=CC=C21)C1C=C(O)C(=C=O)O1
183 437.1495835721 C[NH+](C(O)=NC1=C2C=CC3=CC=CC4=C3C2=C(CC4)C2=CC=CC=C21)C1C=C(O)C(=C=O)O1
184 451.1652336361 C#C[NH+](C(O)=NC1=C2C=CC3=CCCC4CCC(=C2C34)C2=CC=CC=C21)C1C=C(O)C(=C=O)O1
185 451.1652336361 C#C[NH+](C=C=C(O)C(=O)C=O)C(O)=NC1=C2C=CC=CC2=C2CCC3CCC=C4C=CC1=C2C43 Intermediate Fragment 
186 478.1761326681 [NH3+]C(=C=CN(C=O)C1C=C(O)C(=C=O)O1)N=C1C2=CC=CC=C2C2=C3C1=CC=C1C=CCC(CC2)C13 Intermediate Fragment 
187 186.0760842841 CC[NH+](CO)C1C=C(O)C(=C=O)O1
188 450.1812180481 NC(C#C[NH+]=C1C=C(O)C(=C=O)O1)=NC1=C2C=CC3CCCC4CCC(=C2C34)C2=CC=CC=C21
189 478.1761326681 [NH3+]C(=C=CN=C1C=C(O)C(=C=O)O1)N(C=O)C1=C2C=CC3=CCCC4CCC(=C2C34)C2=CC=CC=C21 Intermediate Fragment 
190 353.1648397121 C#CC(N)[NH+](C=O)C1=C2C=CC=CC2=C2CCC3C=CC=C4C=CC1=C2C43
191 351.1491896481 C#CC(N)[NH+](C=O)C1=C2C=CC=CC2=C2CCC3=C4C(=CC=C3)C=CC1=C24
192 349.1335395841 C#CC(N)[NH+](C=O)C1=C2C=CC=CC2=C2C=CC3=C4C(=CC=C3)C=CC1=C24
193 347.1178895201 C#CC(=N)[NH+](C=O)C1=C2C=CC=CC2=C2C=CC3=C4C(=CC=C3)C=CC1=C24
194 132.0655196001 [NH3+]C1C=C(O)C(CO)O1
195 114.0549549161 C=C1OC([NH3+])C=C1O
196 132.0655196001 C=C(O)C(=CO)OC[NH3+] Intermediate Fragment 
197 132.0655196001 [NH3+]C(O)=C=C(O)CCO Intermediate Fragment 
198 134.0811696641 [NH3+]C1CC(O)C(CO)O1
199 337.1335395841 C=C(N)[NH+](C=O)C1=C2C=CC=CC2=C2C=CC3=C4C(=CC=C3)C=CC1=C24
200 142.0498695361 C[NH2+]C1C=C(O)C(=C=O)O1
201 114.0549549161 C=[NH+]C1=CC(O)CO1
202 144.0655196001 C[NH2+]C1C=C(O)C(=CO)O1
203 144.0655196001 C[NH2+]C=C=C(O)C(=O)CO Intermediate Fragment 
204 327.1491896481 NC[NH+](C=O)C1=C2C=CC=CC2=C2CCC3=C4C(=CC=C3)C=CC1=C24
205 325.1335395841 NC[NH+](C=O)C1=C2C=CC=CC2=C2C=CC3=C4C(=CC=C3)C=CC1=C24
206 323.1178895201 N=C[NH+](C=O)C1=C2C=CC=CC2=C2C=CC3=C4C(=CC=C3)C=CC1=C24
207 158.0811696641 CC[NH2+]C1C=C(O)C(=CO)O1
208 158.0811696641 CC[NH2+]C(O)=C=C(O)C=CO Intermediate Fragment 
209 185.0920686961 NCCC[NH2+]C1C=C(O)C(=C=O)O1
210 448.1655679841 NC(C#C[NH+]=C1C=C(O)C(=C=O)O1)=NC1=C2C=CC3=CCCC4CCC(=C2C34)C2=CC=CC=C21
211 478.1761326681 C=C=C=C1C(C)=C(N2C(=O)N(C3C=C(O)C(=C=O)O3)C=CC2[NH3+])C2=CC=C3C=CC=C4CCC1=C2C34 Intermediate Fragment 
212 478.1761326681 C=C=C=C1C=CC2=C(N3C(=O)N(C4C=C(O)C(=C=O)O4)C=CC3[NH3+])C3=CC=CC=C3C3=C2C1CCC3 Intermediate Fragment 
213 478.1761326681 [NH3+]C1C=CN(C2C=C(O)C(=C=O)O2)C(=O)N1C=C1C=CC=CC1=C1CCC2=C3C(=CC=C2)C=CC=C13 Intermediate Fragment 
