#In-silico ESI-MS/MS [M+H]+ Spectra
#PREDICTED BY CFM-ID 4.0.8
#SMILES=O1C(CO)C(CC1n1ccc2n(c1=O)c(cn2)CC(=O)CCCCC)O
#InChiKey=MVZSJYKSHQNNDA-UHFFFAOYSA-N
energy0
146.03489 9.57 35 (4.0206)
148.05054 15.50 25 (6.5092)
150.06619 8.37 24 (3.5133)
248.13935 100.00 2 58 68 56 72 69 66 67 63 74 (41.01 0.45797 0.22413 0.17357 0.054821 0.041647 0.019702 0.0081748 0.0033036 0.0030313)
364.18670 60.66 0 156 181 192 207 186 225 191 224 236 226 205 241 206 (24.599 0.34955 0.20131 0.15049 0.095811 0.026568 0.0217 0.015472 0.0081075 0.0040552 0.0037006 0.00041386 0.00018417 1.995e-05)
energy1
99.04406 10.87 87 7 83 (1.0891 0.61076 0.099546)
136.05054 16.56 31 (2.7418)
146.03489 10.02 35 (1.6587)
148.05054 35.65 25 (5.9025)
150.06619 42.40 24 (7.0207)
192.07675 8.34 47 (1.3805)
204.07675 7.85 50 (1.2997)
206.09240 41.72 51 (6.9066)
218.09240 14.39 53 (2.3827)
220.10805 8.81 54 (1.4585)
220.14444 11.10 57 (1.837)
230.12879 64.15 38 27 (10.545 0.075041)
232.14444 16.23 26 (2.6876)
246.12370 6.12 75 (1.0132)
248.13935 100.00 2 58 56 68 69 63 72 74 67 66 (15.167 0.70658 0.20349 0.18837 0.12374 0.046437 0.042117 0.035593 0.024373 0.01843)
274.15500 19.65 164 163 (2.7712 0.4827)
290.14992 6.55 165 (1.084)
292.16557 6.09 162 217 (0.98654 0.022301)
302.14992 8.67 160 184 (0.9765 0.4588)
304.16557 12.89 179 158 (1.5132 0.62096)
328.16557 11.77 13 16 (1.2753 0.6737)
336.19178 7.25 213 222 216 182 219 220 221 4 (0.53583 0.17194 0.1393 0.12412 0.11687 0.074386 0.033018 0.005498)
346.17613 13.23 5 178 132 137 18 19 136 139 135 17 20 (0.79303 0.48316 0.45086 0.085603 0.083462 0.075661 0.070341 0.048818 0.04763 0.027064 0.024161)
364.18670 8.22 0 156 186 192 207 181 191 226 224 225 236 205 241 206 (0.6748 0.3758 0.10248 0.10068 0.065793 0.025495 0.0068926 0.0038066 0.0023197 0.0018136 0.00086134 0.00017757 4.6556e-05 6.9266e-06)
energy2
43.01784 45.75 101 (2.3058)
43.05423 36.35 105 (1.8323)
45.03349 92.42 85 (4.6583)
55.05423 37.36 103 (1.883)
57.03349 45.34 92 (2.2854)
59.04914 22.09 91 104 (1.0951 0.018499)
69.06988 22.21 100 (1.1192)
71.04914 35.75 106 177 (1.5124 0.28928)
81.06988 20.50 126 (1.0331)
93.06988 93.39 113 (4.707)
95.08553 82.54 112 (4.1601)
97.10118 41.83 99 (2.1081)
111.08044 69.32 28 (3.494)
113.09609 51.66 9 (2.6039)
136.05054 34.97 31 (1.7624)
146.03489 51.53 35 (2.5972)
148.05054 88.20 25 (4.4455)
150.06619 64.49 24 (3.2506)
176.04545 59.52 41 (2.9998)
178.06110 58.82 42 (2.9645)
180.07675 23.93 43 (1.2063)
190.06110 23.01 46 (1.16)
204.07675 28.80 50 (1.4517)
218.09240 44.41 53 (2.2385)
230.12879 100.00 38 27 (4.445 0.59516)
232.10805 19.01 55 (0.95832)
248.13935 99.16 2 69 58 72 68 74 56 66 63 67 (2.2734 0.47598 0.42493 0.37502 0.32811 0.29261 0.25513 0.22171 0.17598 0.17502)
278.18630 18.16 189 (0.91548)
280.20195 23.56 190 (1.1875)
306.18122 17.77 185 (0.89541)

0 364.1866973521 CCCCCC(=O)Cc1cnc2ccn(C3CC(O)C(C[OH2+])O3)c(=O)n12
1 332.1604826041 CCCCCC(O)=CC1=CNC2C=CN(C3=CC(O)=CO3)C(=[OH+])N12
2 248.1393532361 CCCCCC(O)=CC1=CNC2=CC=NC(=[OH+])N12
3 334.1761326681 CCCCCC(O)CC1=CNC2C=CN(C3=CC(O)=CO3)C(=[OH+])N12
4 336.1917827321 CCCCCC(O)CC1CNC2C=CN(C3=CC(O)=CO3)C(=[OH+])N12
5 346.1761326681 C=C1OC(N2C=CC3NC=C(C=C(O)CCCCC)N3C2=[OH+])C=C1O
6 250.1550033001 CCCCCC(O)CC1=CNC2=CC=NC(=[OH+])N12
7 99.0440558841 C=C1OC=CC1[OH2+]
8 115.1117415201 C=C([OH2+])CCCCC
9 113.0960914561 C=C([OH2+])C=CCCC
10 234.0873176641 C=C1OC(N2C=CC3NC=CN3C2=[OH+])C=C1O
11 248.1029677281 C=C1OC(N2C=CC3NC=C(C)N3C2=[OH+])C=C1O
12 250.1186177921 C=C1OC(N2C=CC3NCC(C)N3C2=[OH+])C=C1O
13 328.1655679841 C=C1OC(N2C=CC3NC=C(C#CCCCCC)N3C2=[OH+])C=C1O
14 276.0978823481 C=C1OC(N2C=CC3NC=C(C=CO)N3C2=[OH+])C=C1O
15 318.1448325401 C=C1OC(N2C=CC3NC=C(C=C(O)CCC)N3C2=[OH+])C=C1O
16 328.1655679841 C=C1C=CC(N2C=CC3NC=C(C=C(O)C=CCCC)N3C2=[OH+])O1
17 346.1761326681 C#COC(=C=CO)N1C=CC2NC=C(CC(O)CCCCC)N2C1=[OH+] Intermediate Fragment 
18 346.1761326681 C=C(CO)OC(=C)N1C=CC2NC=C(C=C(O)C=CCCC)N2C1=[OH+] Intermediate Fragment 
19 346.1761326681 C=C1OC(N(C=[OH+])C=C=C2N=CC(CC(O)CCCCC)=N2)C=C1O Intermediate Fragment 
20 346.1761326681 C=C1OC(=NC=C=C2NC=C(CC(O)CCCCC)N2C=[OH+])C=C1O Intermediate Fragment 
21 254.1863034281 CCCCCC(O)CC1CNC2=CC=NC([OH2+])N21
22 117.1273915841 CCCCCC(C)[OH2+]
23 252.1706533641 CCCCCC(O)CC1CNC2=CC=NC(=[OH+])N21
24 150.0661882961 CC1=CNC2=CC=NC(=[OH+])N12
25 148.0505382321 [CH2+]C1=CNC2=CC=NC(=O)N12
26 232.1444386161 CCCCCC=CC1=CNC2=CC=NC(=[OH+])N12
27 230.1287885521 CCCC#CC([OH2+])=CC1=CNC2=CC=NCN12
28 111.0804413921 C=C([OH2+])C#CCCC
29 109.0647913281 C=C([OH2+])C#CC=CC
30 107.0491412641 C=C([OH2+])C#CC#CC
31 136.0505382321 [OH+]=C1N=CC=C2NC=CN12
32 140.0818383601 [OH2+]C1N=CC=C2NCCN21
33 101.0960914561 CCCCCC=[OH+]
34 99.0804413921 CCCCC=C=[OH+]
35 146.0348881681 [CH+]=C1C=NC2=CC=NC(=O)N12
36 152.0818383601 CC1CNC2=CC=NC(=[OH+])N21
37 154.0974884241 CC1CNC2=CC=NC([OH2+])N21
38 230.1287885521 CCCCCC#CC1=CNC2=CC=NC(=[OH+])N12
39 73.1011768361 CCCC[CH4+]
40 71.0855267721 CCCC=[CH3+]
41 176.0454528521 OC#CC1=CNC2=CC=NC(=[OH+])N12
42 178.0611029161 OC=CC1=CNC2=CC=NC(=[OH+])N12
43 180.0767529801 OCCC1=CNC2=CC=NC(=[OH+])N12
44 182.0924030441 OCCC1CNC2=CC=NC(=[OH+])N21
45 184.1080531081 OCCC1CNC2=CC=NC([OH2+])N21
46 190.0611029161 CC(O)=[C+]C1=CNC2=CC=NC(=O)N12
47 192.0767529801 CC(O)=CC1=CNC2=CC=NC(=[OH+])N12
48 194.0924030441 CC(O)CC1=CNC2=CC=NC(=[OH+])N12
49 196.1080531081 CC(O)CC1CNC2=CC=NC(=[OH+])N21
50 204.0767529801 C=CC(O)=CC1=CNC2=CC=NC(=[OH+])N12
51 206.0924030441 CCC(O)=CC1=CNC2=CC=NC(=[OH+])N12
52 208.1080531081 CCC(O)CC1=CNC2=CC=NC(=[OH+])N12
53 218.0924030441 CC=CC(O)=CC1=CNC2=CC=NC(=[OH+])N12
54 220.1080531081 CCCC(O)=CC1=CNC2=CC=NC(=[OH+])N12
55 232.1080531081 CCC=CC(O)=CC1=CNC2=CC=NC(=[OH+])N12
56 248.1393532361 CCCCCC(O)=CC1=CNC(=C=C=N)N1C=[OH+] Intermediate Fragment 
57 220.1444386161 CCCCCC(O)CC1=NC(=CC#[NH+])N=C1
58 248.1393532361 CCCCCC(O)CC1=NC(=C=C=NC=[OH+])N=C1 Intermediate Fragment 
59 205.1335395841 C#CC1=NC(C=C([OH2+])CCCCC)=CN1
60 203.1178895201 C#CC1=NC(C=C([OH2+])C=CCCC)=CN1
61 201.1022394561 C#CC1=NC(C=C([OH2+])C#CCCC)=CN1
62 193.1335395841 C=C1N=CC(C=C([OH2+])CCCCC)=N1
63 248.1393532361 C=C=NC(=[OH+])N1CNC=C1C=C(O)C=CCCC Intermediate Fragment 
64 179.1178895201 CCCC=CC([OH2+])=CC1=CNC=N1
65 207.1128041401 CCCC#CC(O)=CC1=CNCN1C=[OH+]
66 248.1393532361 C=NC(=[OH+])N1C(=C)NC=C1C=C(O)C=CCCC Intermediate Fragment 
67 248.1393532361 C=C=C1NC=C(C=C(O)C=CCCC)N1C(N)=[OH+] Intermediate Fragment 
68 248.1393532361 CCCCCC(O)C=C=C=NC1=CC=NC([OH2+])=N1 Intermediate Fragment 
69 248.1393532361 CCCCCC(O)=CC(=C=N)N1C=CC=NC1=[OH+] Intermediate Fragment 
70 97.0396392001 [OH2+]C1=NC=CC=N1
71 221.1284542041 CCCCCC(O)C#CN1C=CC=NC1=[OH+]
72 248.1393532361 C=C(C=C(O)C=CCCC)N1C(=[OH+])N=CC=C1N Intermediate Fragment 
73 231.1128041401 C=C(C=C(O)C#CCCC)N1C=CC=NC1=[OH+]
74 248.1393532361 C=NC1=CC=NC(=[OH+])N1C#CC(O)CCCCC Intermediate Fragment 
75 246.1237031721 CCCC=CC(O)=CC1=CNC2=CC=NC(=[OH+])N12
76 228.1131384881 CCCC=CC#CC1=CNC2=CC=NC(=[OH+])N12
77 111.0076703761 O=C1C=COC1=C=[OH+]
78 115.0389705041 OC1CCOC1=C=[OH+]
79 87.0440558841 [OH2+]C1=COCC1
80 115.0389705041 CC=C(O)C(=O)C=[OH+] Intermediate Fragment 
81 117.0546205681 OC1CCOC1=C[OH2+]
82 89.0597059481 [OH2+]C1CCOC1
83 99.0440558841 [OH+]=C=C1CCCO1
84 117.0546205681 OCCC(O)C#C[OH2+] Intermediate Fragment 
85 45.0334912001 C=C[OH2+]
86 89.0597059481 CC(O)C=C[OH2+]
87 99.0440558841 CC=C(O)C#C[OH2+]
88 117.0546205681 OCCCOC#C[OH2+] Intermediate Fragment 
89 117.0546205681 CCOC(=C=[OH+])CO Intermediate Fragment 
90 117.0546205681 CCC(O)C(=O)C=[OH+] Intermediate Fragment 
91 59.0491412641 CC=C[OH2+]
92 57.0334912001 CC#C[OH2+]
93 61.0284058201 OCC=[OH+]
94 119.0702706321 OC1CCOC1C[OH2+]
95 101.0597059481 C=C1OCCC1[OH2+]
96 101.0597059481 [OH2+]C=C1CCCO1
97 119.0702706321 OCCC(O)C=C[OH2+] Intermediate Fragment 
98 99.1168269001 CCCCCC=[CH3+]
99 97.1011768361 [CH2+]#CCCCCC
100 69.0698767081 [CH2+]#CCCC
101 43.0178411361 C#C[OH2+]
102 57.0698767081 CCC=[CH3+]
103 55.0542266441 [CH2+]#CCC
104 59.0491412641 C=C(C)[OH2+]
105 43.0542266441 CC=[CH3+]
106 71.0491412641 C=CC(=C)[OH2+]
107 73.0647913281 C=C([OH2+])CC
108 75.0804413921 CCC(C)[OH2+]
109 85.0647913281 C=C([OH2+])C=CC
110 87.0804413921 C=C([OH2+])CCC
111 99.0804413921 C=C([OH2+])C=CCC
112 95.0855267721 [CH2+]#CC=CCCC
113 93.0698767081 [CH2+]#CC#CCCC
114 248.0665822201 O=C1N2C=CNC2C=CN1C1C=C(O)C(=C=[OH+])O1
115 250.0822322841 O=C1N(C2C=C(O)C(=C=[OH+])O2)C=CC2NCCN12
116 250.0822322841 O=C(C=[OH+])C(O)=C=CN1C=CC2NCCN2C1=O Intermediate Fragment 
117 252.0978823481 OC1=CC(N2C=CC3NCCN3C2O)OC1=C=[OH+]
118 234.0873176641 O=C1N(C2C=CC(=C=[OH+])O2)C=CC2NCCN12
119 252.0978823481 OC(=C=C(O)N1C=CC2NCCN2C1O)C#C[OH2+] Intermediate Fragment 
120 252.0978823481 O=C(C=[OH+])C(O)=C=CN1C=CC2NCCN2C1O Intermediate Fragment 
121 254.1135324121 OC1=CC(N2CCC3NCCN3C2O)OC1=C=[OH+]
122 256.1291824761 OC1CC(N2CCC3NCCN3C2O)OC1=C=[OH+]
123 258.1448325401 OC1CC(N2CCC3NCCN3C2O)OC1=C[OH2+]
124 103.1117415201 CCCCCC[OH2+]
125 83.0855267721 [CH2+]#CCCCC
126 81.0698767081 [CH2+]#CC=CCC
127 97.0647913281 CCCC=C=C=[OH+]
128 262.0822322841 CC1=CNC2C=CN(C3C=C(O)C(=C=[OH+])O3)C(=O)N12
129 264.0978823481 CC1CNC2C=CN(C3C=C(O)C(=C=[OH+])O3)C(=O)N12
130 266.1135324121 CC1CNC2C=CN(C3C=C(O)C(=C=[OH+])O3)C(O)N12
131 266.1135324121 CC1CNC2C=CN(C(O)=C=C(O)C#C[OH2+])C(O)N12 Intermediate Fragment 
132 346.1761326681 CCCCCCCC1=CNC2C=CN(C3C=C(O)C(=C=[OH+])O3)C(=O)N12
133 236.1757387441 CCCCCCCC1CNC2=CC=NC(=[OH+])N21
134 101.1324769641 CCCCCC[CH4+]
135 346.1761326681 CCCCCCCC1=CNC2C=CN(C(=C=CO)OC#C[OH2+])C(=O)N12 Intermediate Fragment 
136 346.1761326681 C=C(OC(=C=[OH+])CO)N1C=CC2NC=C(C=CCCCCC)N2C1=O Intermediate Fragment 
137 346.1761326681 CCCCCCCC1=CNC2C=CN(C=C=C(O)C(=O)C=[OH+])C(=O)N12 Intermediate Fragment 
138 260.1757387441 C#CN1C=CC2NC=C(CCCCCCC)N2C1=[OH+]
139 346.1761326681 CCCCCCCC1=NC(=C=CN(C=O)C2C=C(O)C(=C=[OH+])O2)NC1 Intermediate Fragment 
140 41.0385765801 [CH2+]#CC
141 292.0927969681 O=C1N(C2C=C(O)C(=C=[OH+])O2)C=CC2NC=C(CCO)N12
142 292.0927969681 O=C(C=[OH+])C(O)=C=CN1C=CC2NC=C(CCO)N2C1=O Intermediate Fragment 
143 294.1084470321 O=C1N(C2C=C(O)C(=C=[OH+])O2)C=CC2NCC(CCO)N12
144 294.1084470321 O=C1N(C(O)=C=C(O)C#C[OH2+])C=CC2NCC(CCO)N12 Intermediate Fragment 
145 294.1084470321 O=CN(C=C=C1NCC(CCO)N1)C1C=C(O)C(=C=[OH+])O1 Intermediate Fragment 
146 296.1240970961 OCCC1CNC2C=CN(C3C=C(O)C(=C=[OH+])O3)C(O)N12
147 298.1397471601 OCCC1CNC2CCN(C3C=C(O)C(=C=[OH+])O3)C(O)N12
148 300.1553972241 OCCC1CNC2CCN(C3CC(O)C(=C=[OH+])O3)C(O)N12
149 300.1553972241 O=C(C=[OH+])C(O)=CCN1CCC2NCC(CCO)N2C1O Intermediate Fragment 
150 306.1084470321 CC(O)CC1=CNC2C=CN(C3C=C(O)C(=C=[OH+])O3)C(=O)N12
151 308.1240970961 CC(O)CC1CNC2C=CN(C3C=C(O)C(=C=[OH+])O3)C(=O)N12
152 312.1553972241 CC(O)CC1CNC2CCN(C3C=C(O)C(=C=[OH+])O3)C(O)N12
153 314.1710472881 CC(O)CC1CNC2CCN(C3CC(O)C(=C=[OH+])O3)C(O)N12
154 334.1397471601 CCCC(O)CC1=CNC2C=CN(C3C=C(O)C(=C=[OH+])O3)C(=O)N12
155 348.1553972241 CCCCC(O)CC1=CNC2C=CN(C3C=C(O)C(=C=[OH+])O3)C(=O)N12
156 364.1866973521 CCCCCC(O)CC1CNC2C=CN(C(O)=C=C(O)C#C[OH2+])C(=O)N12 Intermediate Fragment 
157 322.1761326681 CCCCCC(O)CC1=CNC2C=CN(C([OH2+])C#CO)C(=O)N12
158 304.1655679841 C#CC([OH2+])N1C=CC2NC=C(C=C(O)CCCCC)N2C1=O
159 320.1604826041 CCCCCC(O)=CC1=CNC2C=CN(C([OH2+])C#CO)C(=O)N12
160 302.1499179201 C#CC([OH2+])N1C=CC2NC=C(C=C(O)C=CCCC)N2C1=O
161 318.1448325401 CCCC=CC(O)=CC1=CNC2C=CN(C([OH2+])C#CO)C(=O)N12
162 292.1655679841 C=C([OH2+])N1C=CC2NC=C(C=C(O)CCCCC)N2C1=O
163 274.1550033001 C=C([OH2+])N1C=CC2NC=C(C#CCCCCC)N2C1=O
164 274.1550033001 C#CN1C=CC2NC=C(C=C(O)CCCCC)N2C1=[OH+]
165 290.1499179201 C=C([OH2+])N1C=CC2NC=C(C=C(O)C=CCCC)N2C1=O
166 288.1342678561 C=C([OH2+])N1C=CC2NC=C(C=C(O)C#CCCC)N2C1=O
167 71.0127557561 O=CC#C[OH2+]
168 73.0284058201 OCC#C[OH2+]
169 55.0178411361 C#CC=[OH+]
170 75.0440558841 OCC=C[OH2+]
171 77.0597059481 OCCC[OH2+]
172 280.1655679841 CCCCCC(O)=CC1=CNC2C=CN(C[OH2+])C(=O)N12
173 278.1499179201 CCCC=CC(O)=CC1=CNC2C=CN(C[OH2+])C(=O)N12
174 276.1342678561 CCCC#CC(O)=CC1=CNC2C=CN(C[OH2+])C(=O)N12
175 274.1186177921 CC=CC#CC(O)=CC1=CNC2C=CN(C[OH2+])C(=O)N12
176 87.0440558841 CC(O)C#C[OH2+]
177 71.0491412641 CCC#C[OH2+]
178 346.1761326681 CCCCCC(O)CC1=CNC2C=CN(C=C=C(O)C#C[OH2+])C(=O)N12
179 304.1655679841 CCCCCC(O)=CC1=CNC2C=CN(CC#CO)C(=[OH+])N12
180 362.1710472881 CCCCCC(O)CC1=CNC2C=CN(C([OH2+])=C=C(O)C#CO)C(=O)N12
181 364.1866973521 CCCCCC(O)CC1CNC2C=CN(C(=C=CO)OC#C[OH2+])C(=O)N12 Intermediate Fragment 
182 336.1917827321 C=C([OH+]C#CO)N1C=CC2NCC(CC(O)CCCCC)N2C1=O
183 63.0440558841 OCC[OH2+]
184 302.1499179201 CCCC=CC(O)=CC1=CNC2C=CN(CC#CO)C(=[OH+])N12
185 306.1812180481 CCCCCC(O)CC1=CNC2C=CN(CC#CO)C(=[OH+])N12
186 364.1866973521 C=C(OC(=C=[OH+])CO)N1C=CC2NC=C(CC(O)CCCCC)N2C1=O Intermediate Fragment 
187 272.1393532361 C#CN1C=CC2NC=C(C=C(O)C=CCCC)N2C1=[OH+]
188 276.1706533641 C#CN1C=CC2NC=C(CC(O)CCCCC)N2C1=[OH+]
189 278.1863034281 C#CN1C=CC2NCC(CC(O)CCCCC)N2C1=[OH+]
190 280.2019534921 C#CN1C=CC2NCC(CC(O)CCCCC)N2C1[OH2+]
191 364.1866973521 C=C(O)C(=C=[OH+])OCN1C=CC2NC=C(CC(O)CCCCC)N2C1=O Intermediate Fragment 
192 364.1866973521 CCCCCC(O)CC1CNC2C=CN(C=C=C(O)C(=O)C=[OH+])C(=O)N12 Intermediate Fragment 
193 308.1968681121 CCCCCC(O)CC1CNC2C=CN(CC#CO)C(=[OH+])N12
194 59.0127557561 O=C=C[OH2+]
195 41.0021910721 [CH+]=C=O
196 89.0233204401 O=CC(=[OH+])CO
197 91.0389705041 OCC(=[OH+])CO
198 93.0546205681 OCC([OH2+])CO
199 266.1863034281 CCCCCC(O)CC1=CNC2C=CN(C)C(=[OH+])N12
200 264.1706533641 CCCCCC(O)=CC1=CNC2C=CN(C)C(=[OH+])N12
201 262.1550033001 CCCC=CC(O)=CC1=CNC2C=CN(C)C(=[OH+])N12
202 260.1393532361 CCCC#CC(O)=CC1=CNC2C=CN(C)C(=[OH+])N12
203 258.1237031721 CC=CC#CC(O)=CC1=CNC2C=CN(C)C(=[OH+])N12
204 362.1710472881 CCCCCC(O)CC1=CNC2C=CN(C=C=C(O)C(=[OH+])C=O)C(=O)N12
205 364.1866973521 C=C1NC=C(CC(O)CCCCC)N1C(=O)N(C)C1C=C(O)C(=C=[OH+])O1 Intermediate Fragment 
206 364.1866973521 C=CN(C(=O)N1CNC=C1CC(O)CCCCC)C1C=C(O)C(=C=[OH+])O1 Intermediate Fragment 
207 364.1866973521 CCCCCC(O)CC1CNC(=C=CN(C=O)C2C=C(O)C(=C=[OH+])O2)N1 Intermediate Fragment 
208 211.1804897761 C#CC1NCC(CC([OH2+])CCCCC)N1
209 209.1648397121 C#CC1=NC(CC([OH2+])CCCCC)CN1
210 207.1491896481 C#CC1=NC(CC([OH2+])CCCCC)=CN1
211 191.1178895201 C=C1N=CC(C=C([OH2+])C=CCCC)=N1
212 186.0760842841 CC[NH+](CO)C1C=C(O)C(=C=O)O1
213 336.1917827321 CCCCCC(O)CC1CNC(C=C[NH+]=C2C=C(O)C(=C=O)O2)N1
214 318.1812180481 C=C1OC(=[NH+]C#CC2=NC(CC(O)CCCCC)CN2)C=C1O
215 318.1812180481 CCCCCC(O)CC1CNC(C#C[NH+]=C2C=CC(=C=O)O2)N1
216 336.1917827321 CCCCCC(O)CC1CNC(C=C=[NH+]C(O)=C=C(O)C#CO)N1 Intermediate Fragment 
217 292.1655679841 CCCCCC(O)CC1CNC(C#C[NH+]=C(O)C#CO)=N1
218 264.1706533641 C=C(O)[NH+]=C=C=C1N=C(CC(O)CCCCC)CN1
219 336.1917827321 CCCCCC(O)CC1CNC(C=C=[NH+]C(=C=CO)OC#CO)N1 Intermediate Fragment 
220 336.1917827321 C=C([NH+]=C=C=C1NCC(CC(O)CCCCC)N1)OC(=C=O)CO Intermediate Fragment 
221 336.1917827321 C=C(O)C(=C=O)OC=[NH+]C#CC1NCC(CC(O)CCCCC)N1 Intermediate Fragment 
222 336.1917827321 CCCCCC(O)CC1CNC(C=C[NH+]=C=C=C(O)C(=O)C=O)N1 Intermediate Fragment 
223 334.1761326681 CCCCCC(O)CC1CNC(C#C[NH+]=C2C=C(O)C(=C=O)O2)N1
224 364.1866973521 CCCCCC(O)CC1CNC(=C=CN=C2C=C(O)C(=C=[OH+])O2)N1CO Intermediate Fragment 
225 364.1866973521 CCCCCC(O)CCCNC1=NC(=O)N(C2C=C(O)C(=C=[OH+])O2)C=C1 Intermediate Fragment 
226 364.1866973521 CCCCCC(O)CC(=CN)N1CC=CN(C2C=C(O)C(=C=[OH+])O2)C1=O Intermediate Fragment 
227 156.1382906161 CCCCCC(O)CC#C[NH3+]
228 139.1117415201 C#CC=C([OH2+])CCCCC
229 154.1226405521 CCCCCC(O)=CC#C[NH3+]
230 127.1117415201 C#CC([OH2+])CCCCC
231 152.1069904881 CCCC=CC(O)=CC#C[NH3+]
232 337.1757983201 CCCCCC(O)CCN1CC=CN(C2C=C(O)C(=C=[OH+])O2)C1=O
233 337.1757983201 CCCCCC(O)CCN1CC=CN(C(O)=C=C(O)C#C[OH2+])C1=O Intermediate Fragment 
234 337.1757983201 CCCCCC(O)CCN1CC=CN(C=C=C(O)C(=O)C=[OH+])C1=O Intermediate Fragment 
235 347.1601482561 C=C(C=C(O)CCCCC)N1CC=CN(C2C=C(O)C(=C=[OH+])O2)C1=O
236 364.1866973521 C=C(CC(O)CCCCC)N1C(=O)N(C2C=C(O)C(=C=[OH+])O2)C=CC1N Intermediate Fragment 
237 137.0960914561 C#CC=C([OH2+])C=CCCC
238 226.0822322841 [NH3+]C1C=CN(C2=CC(O)C(=C=O)O2)C(O)N1
239 228.0978823481 [NH3+]C1CCN(C2=CC(O)C(=C=O)O2)C(O)N1
240 228.0978823481 [NH3+]C1CCN(C(O)=C=C(O)C#CO)C(O)N1 Intermediate Fragment 
241 364.1866973521 C=NC1C=CN(C2C=C(O)C(=C=[OH+])O2)C(=O)N1CCC(O)CCCCC Intermediate Fragment 
