#In-silico ESI-MS/MS [M+H]+ Spectra
#PREDICTED BY CFM-ID 4.0.8
#SMILES=n1c(nc2c(c1ONc1cccc3c1cccc3)ncn2[C@@H]1O[C@H](CO)[C@@H](C1)O)N
#InChiKey=BSHVOYFUAPSREW-BZUAXINKSA-N
energy0
293.11454 100.00 110 135 125 116 133 113 139 134 132 129 137 144 140 138 142 (78.215 0.89855 0.44888 0.11139 0.074486 0.056148 0.049248 0.043948 0.036523 0.02642 0.026187 0.02276 0.022 0.0060794 0.0054659)
energy1
144.08078 24.79 35 36 58 56 48 54 46 50 53 (13.813 0.96554 0.089701 0.088167 0.078 0.0585 0.032233 0.015978 0.01595)
276.08799 6.30 112 114 128 (3.4176 0.30724 0.12705)
293.11454 100.00 110 135 125 129 113 139 138 137 132 116 142 133 144 134 140 (57.701 0.6788 0.48057 0.39459 0.35589 0.26221 0.24343 0.22485 0.20936 0.14031 0.12798 0.10671 0.090186 0.083148 0.030617)
energy2
75.04406 22.94 29 (2.5508)
91.05423 37.60 42 (4.1804)
93.06988 12.10 41 (1.3453)
115.05423 14.86 38 (1.6521)
117.06988 69.50 37 (7.7271)
134.04612 18.28 4 (2.0325)
136.06177 53.84 5 (5.9868)
140.09307 8.59 8 (0.95485)
142.06513 27.86 45 49 55 47 52 59 (1.846 0.40131 0.37697 0.22191 0.14761 0.10389)
144.08078 84.34 36 35 48 54 56 46 50 53 58 (5.2216 3.5703 0.16123 0.12013 0.10584 0.066057 0.053541 0.04491 0.034117)
150.04104 82.79 61 (9.2055)
152.05669 100.00 63 (11.119)
178.07234 13.66 88 22 (0.91564 0.60366)
192.05160 19.07 178 (2.1202)
194.06725 12.99 90 (1.4439)
206.06725 13.07 87 (1.4534)
234.09855 18.77 17 25 16 (1.2401 0.4329 0.41433)
248.07782 41.48 73 74 85 3 (1.9195 1.5083 1.1229 0.060683)
250.09347 8.12 13 11 6 12 10 (0.60039 0.25291 0.022083 0.016381 0.010836)
266.08838 7.82 84 66 93 91 76 89 81 78 79 83 82 (0.22827 0.18526 0.16735 0.068293 0.064133 0.05859 0.029235 0.022225 0.018544 0.016272 0.01155)
293.11454 49.90 110 116 142 129 113 132 144 135 125 140 137 138 133 134 139 (5.466 0.027545 0.022113 0.010332 0.0039892 0.0035574 0.0028633 0.0026335 0.002171 0.0017295 0.0016182 0.0014089 0.0010407 0.00087654 0.00037023)
319.13019 9.63 173 (1.0706)

0 409.1618795721 Nc1nc(O[NH2+]c2cccc3ccccc23)c2ncn(C3CC(O)C(CO)O3)c2n1
1 160.0756903601 O=[NH+]C1CC=CC2=C1C=CC=C2
2 160.0756903601 O=[NH+]C=C=C=C=C1C=CCCC1 Intermediate Fragment 
3 248.0778156001 [NH3+]C1=NC=C2N=CN(C3CC(O)C(=C=O)O3)C2=N1
4 134.0461215481 [NH2+]=C1N=CC2=NC=NC2=N1
5 136.0617716121 [NH2+]=C1N=C2N=CN=C2CN1
6 250.0934656641 [NH3+]C1=NC=C2N=CN(C3CC(O)C(=CO)O3)C2=N1
7 138.0774216761 [NH3+]C1N=C2N=CN=C2CN1
8 140.0930717401 [NH3+]C1N=C2NCN=C2CN1
9 232.0829009801 C=C1OC(N2C=NC3=CN=C([NH3+])N=C32)C=C1O
10 250.0934656641 C=C1N=CN(C2CC(O)C(=C=O)O2)C1=NC(=N)[NH3+] Intermediate Fragment 
11 250.0934656641 N=CN(C1=NC([NH3+])=NC=C1)C1CC(O)C(=C=O)O1 Intermediate Fragment 
12 250.0934656641 [NH3+]C1=NC=C2N=CN(CCC(O)C(=O)C=O)C2=N1 Intermediate Fragment 
13 250.0934656641 [NH3+]C1=NC=C2N=CN(C(=O)CC(O)C=CO)C2=N1 Intermediate Fragment 
14 252.1091157281 [NH3+]C1=NC=C2N=CN(C3CC(O)C(CO)O3)C2=N1
15 142.1087218041 [NH3+]C1N=C2NCNC2CN1
16 234.0985510441 C=C1OC(N2C=NC3=CN=C([NH3+])N=C32)CC1O
17 234.0985510441 [NH3+]C1=NC=C2N=CN(C3CCC(=CO)O3)C2=N1
18 252.1091157281 C=C1N=CN(C2CC(O)C(=CO)O2)C1=NC(=N)[NH3+] Intermediate Fragment 
19 235.0825666321 CC1=C([NH+]=CN)N(C2C=C(O)C(=C=O)O2)C=N1
20 252.1091157281 N=CN(C1=NC([NH3+])=NC=C1)C1CC(O)C(=CO)O1 Intermediate Fragment 
21 252.1091157281 CC(OC(=CO)CO)N1C=NC2=CN=C([NH3+])N=C21 Intermediate Fragment 
22 178.0723362961 CC(=O)N1C=NC2=CN=C([NH3+])N=C21
23 252.1091157281 [NH3+]C1=NC=C2N=CN(C(CCO)OC=CO)C2=N1 Intermediate Fragment 
24 252.1091157281 [NH3+]C1=NC=C2N=CN(C(=O)CC(O)CCO)C2=N1 Intermediate Fragment 
25 234.0985510441 [NH3+]C1=NC=C2N=CN(CCC(O)C#CO)C2=N1
26 184.1192864881 CC(O)N1CNC2CN=C([NH3+])N=C21
27 182.1036364241 CC(O)N1CNC2=CN=C([NH3+])N=C21
28 73.0284058201 OCC#C[OH2+]
29 75.0440558841 OCC=C[OH2+]
30 150.1277259321 [NH2+]=C1C=CCC2CCCCC12
31 148.1120758681 [NH2+]=C1C=CC=C2CCCCC12
32 148.1120758681 [NH+]#CC=C=CC1CCCCC1 Intermediate Fragment 
33 146.0964258041 [NH2+]=C1C=CC=C2CCCC=C12
34 129.0698767081 C1=CC2=C(C=C1)[CH2+]=CC=C2
35 144.0807757401 [NH2+]=C1C=CC=C2CC=CC=C12
36 144.0807757401 [NH+]#CC=C=C=C1C=CCCC1 Intermediate Fragment 
37 117.0698767081 [CH2+]#CC=C1C=CC=CC1
38 115.0542266441 [C+]#CC=C1C=CC=CC1
39 103.0542266441 [CH2+]#CC1=CC=CC=C1
40 101.0385765801 [C+]#CC1=CC=CC=C1
41 93.0698767081 [CH3+]=C1C=CC=CC1
42 91.0542266441 [CH+]=C1C=CC=CC1
43 79.0542266441 C1=CC=[CH2+]C=C1
44 66.0338255481 CC#CC#[NH+]
45 142.0651256761 [NH+]#CC#CC=C1C=CC=CC1
46 144.0807757401 C=C=CC(=[NH2+])C1=CC=CC=C1 Intermediate Fragment 
47 142.0651256761 [CH2+]C#CC(=N)C1=CC=CC=C1
48 144.0807757401 C=C=C=C1CCCC=C1C#[NH+] Intermediate Fragment 
49 142.0651256761 C#CC=C1CC=CC=C1C#[NH+]
50 144.0807757401 C=C=CC1=CC=CC(=[NH2+])C1=C Intermediate Fragment 
51 118.0651256761 [CH+]=C1C(=N)C=CC=C1C
52 142.0651256761 C#CCC1=CC=CC(=N)C1=[CH+]
53 144.0807757401 C=C=C1C(=[NH2+])C=CC=C1C=C Intermediate Fragment 
54 144.0807757401 C=C=C=C1C(=[NH2+])C=CC=C1C Intermediate Fragment 
55 142.0651256761 [CH+]=C=C=C1C(=N)C=CC=C1C
56 144.0807757401 CC=C=C=C1C=CC=CC1=[NH2+] Intermediate Fragment 
57 104.0494756121 [CH+]=C1C=CC=CC1=N
58 144.0807757401 C=C=C=CC1=CC=CC(=[NH2+])C1 Intermediate Fragment 
59 142.0651256761 C#CC#CC1=CC=CC(=[NH2+])C1
60 260.0414300921 [NH3+]C1=NC(O)=C2N=CN(C3=CC(=O)C(=C=O)O3)C2=N1
61 150.0410361681 [NH3+]C1=NC(=O)C2=NC=NC2=N1
62 262.0570801561 [NH3+]C1=NC(O)=C2N=CN(C3CC(=O)C(=C=O)O3)C2=N1
63 152.0566862321 [NH3+]C1=NC(=O)C2=NCNC2=N1
64 264.0727302201 [NH3+]C1=NC(O)=C2N=CN(C3CC(O)C(=C=O)O3)C2=N1
65 246.0621655361 [CH+]=C1OC(N2C=NC3=C(O)N=C(N)N=C32)C=C1O
66 266.0883802841 [NH3+]C1=NC(O)=C2N=CN(C3CC(O)C(=CO)O3)C2=N1
67 117.0546205681 OC1CCOC1=C[OH2+]
68 154.0723362961 [NH3+]C1=NC(=O)C2NCNC2=N1
69 156.0879863601 [NH3+]C1=NC(O)C2NCNC2=N1
70 234.0621655361 [NH3+]C1=NC(O)=C2N=CN(C3=CC(O)=CO3)C2=N1
71 236.0778156001 [NH3+]C1=NC(O)=C2N=CN(C3CC(O)=CO3)C2=N1
72 238.0934656641 [NH3+]C1=NC(O)=C2N=CN(C3CC(O)CO3)C2=N1
73 248.0778156001 C=C1OC(N2C=NC3=C(O)N=C([NH3+])N=C32)C=C1O
74 248.0778156001 [NH3+]C1=NC(O)=C2N=CN(C3CCC(=C=O)O3)C2=N1
75 249.0618311881 O=C=C1OC(N2C=NC3=C([OH2+])N=CN=C32)CC1O
76 266.0883802841 N=C([NH3+])N=C1C(=C=O)N=CN1C1CC(O)C(=CO)O1 Intermediate Fragment 
77 238.0934656641 NC(=[NH2+])N=C1C=NCN1C1CC(O)C(=C=O)O1
78 266.0883802841 [NH3+]C(=NC=O)N=C1C=NCN1C1CC(O)C(=C=O)O1 Intermediate Fragment 
79 266.0883802841 N=C1C(=C(O)N=C[NH3+])N=CN1C1CC(O)C(=C=O)O1 Intermediate Fragment 
80 224.0665822201 [NH2+]=C1C(=C=O)N=CN1C1CC(O)C(=CO)O1
81 266.0883802841 N=CN(C1=NC([NH3+])=NC(O)=C1)C1CC(O)C(=C=O)O1 Intermediate Fragment 
82 266.0883802841 [NH3+]C1=NC(O)=C(N=C=NC2CC(O)C(=CO)O2)C=N1 Intermediate Fragment 
83 266.0883802841 C=NC1=C(O)N=C([NH3+])N=C1N=C1CC(O)C(=CO)O1 Intermediate Fragment 
84 266.0883802841 [NH3+]C1=NC(O)=C2N=CN(CCC(O)C(=O)C=O)C2=N1 Intermediate Fragment 
85 248.0778156001 [NH3+]C1=NC(O)=C2N=CN(CC=C(O)C#CO)C2=N1
86 208.0829009801 [NH3+]C1=NC(O)=C2N=CN(CC=CO)C2=N1
87 206.0672509161 [NH3+]C1=NC(O)=C2N=CN(CC#CO)C2=N1
88 178.0723362961 C=CN1C=NC2=C(O)N=C([NH3+])N=C21
89 266.0883802841 CC(OC(=C=O)CO)N1C=NC2=C(O)N=C([NH3+])N=C21 Intermediate Fragment 
90 194.0672509161 CC(=O)N1C=NC2=C(O)N=C([NH3+])N=C21
91 266.0883802841 [NH3+]C1=NC(O)=C2N=CN(C(CCO)OC#CO)C2=N1 Intermediate Fragment 
92 224.0778156001 [NH3+]C1=NC(O)=C2N=CN(C(=O)CCO)C2=N1
93 266.0883802841 [NH3+]C1=NC(O)=C2N=CN(C(=O)CC(O)C=CO)C2=N1 Intermediate Fragment 
94 222.0621655361 [NH3+]C1=NC(O)=C2N=CN(C(=O)C=CO)C2=N1
95 198.0985510441 CC(O)N1CNC2=C(O)N=C([NH3+])N=C21
96 131.0855267721 C1=CC2=C(C=CCC2)[CH2+]=C1
97 89.0597059481 [OH2+]C1CCOC1
98 99.0440558841 C=C1OCC=C1[OH2+]
99 99.0440558841 [OH+]=C=C1CCCO1
100 117.0546205681 CCC(O)C(=O)C=[OH+] Intermediate Fragment 
101 99.0440558841 CC=C(O)C#C[OH2+]
102 59.0491412641 CC=C[OH2+]
103 57.0334912001 CC#C[OH2+]
104 61.0284058201 OCC=[OH+]
105 117.0546205681 O=CCC(O)C=C[OH2+] Intermediate Fragment 
106 89.0597059481 CC(O)C=C[OH2+]
107 117.0546205681 OCCCOC#C[OH2+] Intermediate Fragment 
108 117.0546205681 CCOC(=C=[OH+])CO Intermediate Fragment 
109 291.0988853921 NC1=NC([O+]=NC2=CC=CC3=C2C=CC=C3)=C2N=CNC2=N1
110 293.1145354561 NC1=NC(O[NH2+]C2=CC=CC3=C2C=CC=C3)=C2N=CNC2=N1
111 165.0519352001 N=C1N=C2N=CN=C2C(O[NH3+])=N1
112 276.0879863601 C1=CC2=C(C=C1)C(N=[O+]C1=C3N=CN=C3NC=N1)=CC=C2
113 293.1145354561 N=C(N)N=C1NC=NC1=C=[O+]N=C1C=CC=C2CC=CC=C21 Intermediate Fragment 
114 276.0879863601 N=C=NC1=NC=NC1=C=[O+]N=C1C=CC=C2CC=CC=C21
115 251.0927373921 N=C1NC=NC1=C=[O+]N=C1C=CC=C2CC=CC=C21
116 293.1145354561 NC(=NC=[O+]N=C1C=CC=C2CC=CC=C21)N=C1C=NC=N1 Intermediate Fragment 
117 111.0665226441 NC=[NH+]C1C=NC=N1
118 109.0508725801 N=C=[NH+]C1C=NC=N1
119 107.0352225161 N=C=[N+]=C1C=NC=N1
120 185.0709393281 [NH+]#CONC1=CC=CC2=C1C=CC=C2
121 187.0865893921 [NH+]#CONC1C=CC=C2C=CC=CC21
122 210.0661882961 N#CN=C=[O+]N=C1C=CC=C2CC=CC=C21
123 212.0818383601 N#C[NH+]=CON=C1C=CC=C2CC=CC=C21
124 291.0988853921 N=C(N=C=[O+]N=C1C=CC=C2CC=CC=C21)N=C1C=NC=N1
125 293.1145354561 N=C(N)N=C([O+]=NC1=CC=CC2=C1C=CC=C2)C1=CNC=N1 Intermediate Fragment 
126 43.0290745161 [NH+]#CN
127 251.0927373921 N=C([O+]=NC1=CC=CC2=C1C=CC=C2)C1=CNC=N1
128 276.0879863601 N=C=NC([O+]=NC1=CC=CC2=C1C=CC=C2)=C1C=NC=N1
129 293.1145354561 N=C=NC(O[NH+]=C1C=CC=C2CC=CC=C21)=C1N=CNC1=N Intermediate Fragment 
130 264.0879863601 N=C1N=CN=C1C(=N)[O+]=NC1=CC=CC2=C1C=CC=C2
131 266.1036364241 N=C1N=CN=C1C(=[NH2+])ONC1=CC=CC2=C1C=CC=C2
132 293.1145354561 N=C=NC1=C(C(=N)O[NH+]=C2C=CC=C3CC=CC=C32)N=CN1 Intermediate Fragment 
133 293.1145354561 C=C=C1CC=CC=C1C(=C)N=[O+]C1=C2N=CNC2=NC(N)=N1 Intermediate Fragment 
134 293.1145354561 C=C=C(N=[O+]C1=C2N=CNC2=NC(N)=N1)C1=CC=CCC1=C Intermediate Fragment 
135 293.1145354561 NC1=NC(O[NH+]=C=C=C=C=C2C=CC=CC2)=C2NCNC2=N1 Intermediate Fragment 
136 291.0988853921 NC1=NC(O[NH+]=C=C=C=C=C2C=CC=CC2)=C2N=CNC2=N1
137 293.1145354561 C=C=C=C1C(C)=CC=CC1=[NH+]OC1=C2N=CNC2=NC(N)=N1 Intermediate Fragment 
138 293.1145354561 C=C=C=C=C1C=CC=CC1=[NH+]OC1=C2NCNC2=NC(N)=N1 Intermediate Fragment 
139 293.1145354561 C=C=C=CC1=CC=CC(=[NH+]OC2=C3N=CNC3=NC(N)=N2)C1 Intermediate Fragment 
140 293.1145354561 N=C=NC1=C(O[NH+]=C2C=CC=C3CC=CC=C32)N=C(N)N=C1 Intermediate Fragment 
141 266.1036364241 N=C1N=CC(=N)C(O[NH2+]C2=CC=CC3=C2C=CC=C3)=N1
142 293.1145354561 C=NC1=C([O+]=NC2=CC=CC3=C2C=CC=C3)N=C(N)N=C1N Intermediate Fragment 
143 266.1036364241 NC1=NC(N)=NC([O+]=NC2=CC=CC3=C2C=CC=C3)=C1
144 293.1145354561 C=NC1=NC(N)=NC([O+]=NC2=CC=CC3=C2C=CC=C3)=C1N Intermediate Fragment 
145 291.0988853921 C#[N+]C1=NC(=N)N=C(ON=C2C=CC=C3CC=CC=C32)C1=N
146 295.1301855201 NC1=NC(O[NH2+]C2C=CC=C3C=CC=CC32)=C2N=CNC2=N1
147 297.1458355841 NC1=NC(O[NH2+]C2C=CC=C3C=CC=CC32)=C2NCNC2=N1
148 299.1614856481 NC1=NC(O[NH2+]C2C=CC=C3CCC=CC32)=C2NCNC2=N1
149 377.1356648241 NC1=NC(O[NH+]=C2C=CC=C3CC=CC=C32)=C2N=CN(C3CC(O)=CO3)C2=N1
150 379.1513148881 NC1=NC(O[NH+]=C2C=CC=C3CC=CC=C32)=C2N=CN(C3CC(O)CO3)C2=N1
151 391.1513148881 C=C1OC(N2C=NC3=C(O[NH+]=C4C=CC=C5CC=CC=C54)N=C(N)N=C32)CC1O
152 391.1513148881 NC1=NC(O[NH+]=C2C=CC=C3CC=CC=C32)=C2N=CN(C3CCC(=CO)O3)C2=N1
153 409.1618795721 N=C(N)N=C1C(=CO[NH+]=C2C=CC=C3CC=CC=C32)N=CN1C1CC(O)C(=CO)O1 Intermediate Fragment 
154 409.1618795721 NC(=NCO[NH+]=C1C=CC=C2CC=CC=C21)N=C1C=NCN1C1CC(O)C(=C=O)O1 Intermediate Fragment 
155 181.0607685681 OC1CC(N2C=CN=C2)OC1=C=[OH+]
156 409.1618795721 NC(N)=NC(O[NH+]=C1C=CC=C2CC=CC=C21)C1=CN(C2CC(O)C(=C=O)O2)C=N1 Intermediate Fragment 
157 409.1618795721 N=C1C(=C(N=CN)O[NH+]=C2C=CC=C3CC=CC=C32)N=CN1C1CC(O)C(=CO)O1 Intermediate Fragment 
158 409.1618795721 NC=NC1=C(C(N)O[NH+]=C2C=CC=C3CC=CC=C32)N=CN1C1CC(O)C(=C=O)O1 Intermediate Fragment 
159 382.1509805401 N=C1C(=C([NH3+])ON=C2C=CC=C3CC=CC=C32)N=CN1C1CC(O)C(=CO)O1
160 409.1618795721 C=C=C1CC=CC=C1C(C)=[NH+]OC1=C2N=CN(C3CC(O)C(=CO)O3)C2=NC(N)=N1 Intermediate Fragment 
161 409.1618795721 NC1=NC(O[NH+]=C=C=C=C=C2C=CC=CC2)=C2NCN(C3CC(O)C(CO)O3)C2=N1 Intermediate Fragment 
162 409.1618795721 C=C=C=C1C(C)=CC=CC1=[NH+]OC1=C2N=CN(C3CC(O)C(CO)O3)C2=NC(N)=N1 Intermediate Fragment 
163 409.1618795721 C=C=C=C=C1C=CC=CC1=[NH+]OC1=C2NCN(C3CC(O)C(CO)O3)C2=NC(N)=N1 Intermediate Fragment 
164 409.1618795721 N=CN(C1=NC(N)=NC(O[NH+]=C2C=CC=C3CC=CC=C32)=C1)C1CC(O)C(=CO)O1 Intermediate Fragment 
165 159.0764186321 [NH+]#CNC1CC(O)C(CO)O1
166 409.1618795721 NC1=NC(O[NH+]=C2C=CC=C3CC=CC=C32)=C(N=C=NC2CC(O)C(CO)O2)C=N1 Intermediate Fragment 
167 409.1618795721 NC1=NC(O[NH+]=C2C=CC=C3CC=CC=C32)=C2N=CN(CCC(O)C(=O)CO)C2=N1 Intermediate Fragment 
168 391.1513148881 NC1=NC(O[NH+]=C2C=CC=C3CC=CC=C32)=C2N=CN(CCC(O)C#CO)C2=N1
169 373.1407502041 C#CC(O)=CCN1C=NC2=C(O[NH+]=C3C=CC=C4CC=CC=C43)N=C(N)N=C21
170 349.1407502041 NC1=NC(O[NH+]=C2C=CC=C3CC=CC=C32)=C2N=CN(CC=CO)C2=N1
171 347.1251001401 NC1=NC(O[NH+]=C2C=CC=C3CC=CC=C32)=C2N=CN(CC#CO)C2=N1
172 351.1564002681 NC1=NC(O[NH+]=C2C=CC=C3CC=CC=C32)=C2N=CN(CCCO)C2=N1
173 319.1301855201 C=CN1C=NC2=C(O[NH+]=C3C=CC=C4CC=CC=C43)N=C(N)N=C21
174 321.1458355841 CCN1C=NC2=C(O[NH+]=C3C=CC=C4CC=CC=C43)N=C(N)N=C21
175 317.1145354561 C#CN1C=NC2=C(O[NH+]=C3C=CC=C4CC=CC=C43)N=C(N)N=C21
176 409.1618795721 CC(OC(=CO)CO)N1C=NC2=C(O[NH+]=C3C=CC=C4CC=CC=C43)N=C(N)N=C21 Intermediate Fragment 
177 335.1251001401 CC(=O)N1C=NC2=C(O[NH+]=C3C=CC=C4CC=CC=C43)N=C(N)N=C21
178 192.0516008521 [CH2+]C(=O)N1C=NC2=C(O)N=C(N)N=C21
179 337.1407502041 CC(O)N1C=NC2=C(O[NH+]=C3C=CC=C4CC=CC=C43)N=C(N)N=C21
180 409.1618795721 NC1=NC(O[NH+]=C2C=CC=C3CC=CC=C32)=C2N=CN(C(CCO)OC=CO)C2=N1 Intermediate Fragment 
181 353.1720503321 NC1=NC(O[NH+]=C2C=CC=C3CC=CC=C32)=C2NCN(CCCO)C2=N1
182 47.0491412641 CC[OH2+]
183 363.1200147601 NC1=NC(O[NH+]=C2C=CC=C3CC=CC=C32)=C2N=CN(C(=O)C=CO)C2=N1
184 365.1356648241 NC1=NC(O[NH+]=C2C=CC=C3CC=CC=C32)=C2N=CN(C(=O)CCO)C2=N1
185 367.1513148881 NC1=NC(O[NH+]=C2C=CC=C3CC=CC=C32)=C2N=CN(C(O)CCO)C2=N1
186 365.1356648241 NC1=NC(O[NH+]=C2C=CC=C3CC=CC=C32)=C2N=CN(COC=CO)C2=N1
187 409.1618795721 NC1=NC(O[NH+]=C2C=CC=C3CC=CC=C32)=C2N=CN(C(=O)CC(O)CCO)C2=N1 Intermediate Fragment 
188 341.1720503321 CC(O)N1CNC2=C(O[NH+]=C3C=CC=C4CCCC=C43)N=C(N)N=C21
189 339.1564002681 CC(O)N1CNC2=C(O[NH+]=C3C=CC=C4CC=CC=C43)N=C(N)N=C21
190 333.1094500761 [CH2+]C(=O)N1C=NC2=C(ON=C3C=CC=C4CC=CC=C43)N=C(N)N=C21
191 45.0334912001 C=C[OH2+]
192 55.0178411361 C#CC=[OH+]
193 325.1407502041 NC1=NC(O[NH+]=C2C=CC=C3CC=CC=C32)=C2NCN(CO)C2=N1
194 323.1251001401 NC1=NC(O[NH+]=C2C=CC=C3CC=CC=C32)=C2N=CN(CO)C2=N1
195 321.1094500761 NC1=NC(O[NH+]=C2C=CC=C3CC=CC=C32)=C2N=CN(C=O)C2=N1
196 178.0359507881 NC1=NC(O)=C2N=CN(C#[O+])C2=N1
197 319.0938000121 NC1=NC(ON=C2C=CC=C3CC=CC=C32)=C2N=CN(C#[O+])C2=N1
198 87.0440558841 CC(O)C#C[OH2+]
199 71.0491412641 C#CC(C)[OH2+]
200 71.0491412641 CCC#C[OH2+]
201 91.0753560121 CC(O)CC[OH2+]
202 407.1462295081 NC1=NC(O[NH+]=C2C=CC=C3CC=CC=C32)=C2N=CN(C(=O)CC(O)C=CO)C2=N1
