#In-silico ESI-MS/MS [M+H]+ Spectra
#PREDICTED BY CFM-ID 4.0.8
#SMILES=O1[C@H](CO)[C@@H](C[C@@H]1n1ccc(nc1=O)N/C=C/C=O)O
#InChiKey=YNSCAHIKWMTQMP-JTGRSVDPSA-N
energy0
148.05054 12.18 37 24 205 201 (8.2792 0.046306 0.00040923 8.091e-06)
166.06110 100.00 2 38 53 80 57 67 76 158 (65.486 1.3548 0.98325 0.32524 0.12543 0.049784 0.019678 1.4722e-06)
282.10845 6.79 0 180 130 169 227 172 179 230 221 209 219 (4.3925 0.13734 0.052326 0.030296 0.0070495 0.0066341 0.0060948 0.0042141 0.0031006 0.00015857 6.4914e-05)
energy1
97.03964 10.25 28 73 (2.2105 0.061382)
112.05054 35.67 15 (7.9077)
121.03964 19.22 47 55 (4.11 0.15058)
122.03489 25.53 17 (5.6586)
123.05529 30.96 48 54 (6.0387 0.82365)
136.05054 58.09 18 50 (12.732 0.14494)
138.06619 34.60 36 51 (5.0161 2.6539)
148.05054 20.41 37 24 201 205 (4.2861 0.23562 0.00080698 0.00049237)
150.06619 10.94 19 16 (2.4217 0.0022783)
164.04545 10.28 52 7 84 87 81 86 (1.276 0.89715 0.065362 0.020576 0.014918 0.0046044)
166.06110 100.00 2 38 53 57 76 80 67 158 (16.836 3.9007 0.66958 0.23439 0.21966 0.203 0.069097 0.033162)
192.07675 9.63 145 144 (1.591 0.54464)
energy2
43.01784 9.42 33 (1.1607)
45.03349 10.64 32 (1.3112)
54.03383 10.54 103 (1.2991)
55.01784 7.04 30 (0.86831)
56.04948 6.60 102 (0.81417)
57.03349 22.91 97 (2.824)
68.01309 8.07 26 71 (0.93646 0.057982)
70.02874 25.24 25 70 (2.947 0.16446)
94.02874 41.45 60 (5.1097)
96.04439 22.92 22 (2.8256)
97.03964 37.06 28 73 (3.67 0.89843)
99.05529 6.55 29 74 (0.65777 0.15028)
106.02874 7.17 58 (0.88414)
112.05054 49.50 15 (6.1021)
121.03964 11.09 47 55 (1.2574 0.10993)
122.03489 19.07 17 (2.3506)
124.05054 23.52 34 200 (2.0362 0.86367)
134.03489 8.90 35 49 (1.0587 0.039094)
136.05054 97.63 18 50 (11.862 0.17445)
138.06619 11.04 36 51 (0.97848 0.38201)
148.05054 37.66 24 201 37 205 (3.0778 0.76665 0.76254 0.035321)
150.06619 6.59 19 16 (0.42384 0.3891)
164.04545 8.03 84 7 81 52 86 87 (0.39147 0.2007 0.14739 0.13872 0.066817 0.04542)
166.06110 100.00 57 76 2 67 38 53 80 158 (5.4087 1.8152 1.6546 1.452 1.0294 0.46496 0.42296 0.080235)
178.06110 16.48 156 155 (2.0234 0.0083889)
196.10805 11.16 177 (1.3752)
198.12370 22.84 178 (2.816)
224.10297 13.03 171 (1.6064)

0 282.1084470321 O=CC=C[NH2+]c1ccn(C2CC(O)C(CO)O2)c(=O)n1
1 250.0822322841 O=C1N=C([NH+]=CCCO)C=CN1C1=CC(O)=CO1
2 166.0611029161 OCC=C=[NH+]C1=CC=NC(O)=N1
3 252.0978823481 O=C1N=C([NH2+]CCCO)C=CN1C1=CC(O)=CO1
4 254.1135324121 OCCC[NH2+]C1=NC(O)N(C2=CC(O)=CO2)C=C1
5 264.0978823481 C=C1OC(N2C=CC([NH+]=CCCO)=NC2=O)C=C1O
6 168.0767529801 OCCC=[NH+]C1=CC=NC(O)=N1
7 164.0454528521 OC=C=C=[NH+]C1=CC=NC(O)=N1
8 195.0764186321 C=C1OC(N2C=CC=NC2[OH2+])=CC1O
9 236.1029677281 C=C1OC(N2C=CC([NH2+]CC)=NC2=O)C=C1O
10 246.0873176641 C=C1C=CC(N2C=CC([NH+]=C=CCO)=NC2=O)O1
11 172.1080531081 OCCC[NH2+]C1=CC=NC(O)N1
12 72.0443902321 [NH+]#CCCO
13 170.0924030441 OCCC[NH2+]C1=CC=NC(O)=N1
14 74.0600402961 [NH2+]=CCCO
15 112.0505382321 [NH3+]C1=CC=NC(O)=N1
16 150.0661882961 OCC=C=[NH+]C1=CC=NC=N1
17 122.0348881681 C#[N+]C1=CC=NC(O)=N1
18 136.0505382321 C=C=[NH+]C1=CC=NC(O)=N1
19 150.0661882961 CC=C=[NH+]C1=CC=NC(O)=N1
20 168.0767529801 N=C(O)N=C=C=C=[NH+]CCCO Intermediate Fragment 
21 168.0767529801 C=NC(O)=NC(=C)[NH+]=C=CCO Intermediate Fragment 
22 96.0443902321 C#C[NH+]=C=CCO
23 111.0552892641 C=C([NH3+])N=C=C=CO
24 148.0505382321 OC=C=C=[NH+]C1=CC=NC=N1
25 70.0287401681 [NH+]#CC=CO
26 68.0130901041 [NH+]#CC=C=O
27 65.9974400401 N#C[C+]=C=O
28 97.0396392001 [OH2+]C1=NC=CC=N1
29 99.0552892641 [OH2+]C1N=CC=CN1
30 55.0178411361 C#CC=[OH+]
31 114.0661882961 [NH3+]C1=CC=NC(O)N1
32 45.0334912001 C=C[OH2+]
33 43.0178411361 C#C[OH2+]
34 124.0505382321 C=[NH+]C1=CC=NC(O)=N1
35 134.0348881681 [CH+]=C=NC1=CC=NC(O)=N1
36 138.0661882961 CC=[NH+]C1=CC=NC(O)=N1
37 148.0505382321 C=C=C=[NH+]C1=CC=NC(O)=N1
38 166.0611029161 N=C=C=C(N=C=O)[NH+]=CCCO Intermediate Fragment 
39 149.0345538201 C#CC(N=C=C=CO)=[NH+]C=O
40 139.0502038841 C=C(N=C=CCO)[NH+]=C=O
41 137.0345538201 C=C(N=C=C=CO)[NH+]=C=O
42 135.0189037561 C=C(N=C=C=C=O)[NH+]=C=O
43 125.0345538201 O=C[NH+]=C=NC#CCO
44 123.0189037561 O=CC#CN=C=[NH+]C=O
45 44.0494756121 CC=[NH2+]
46 119.0239891361 [NH+]#CC#CN=C=C=CO
47 121.0396392001 [NH+]#CC#CN=C=CCO
48 123.0552892641 [NH+]#CC#CN=CCCO
49 134.0348881681 [NH+]#CC=C(N)N=C=C=C=O
50 136.0505382321 [NH+]#CC=C(N)N=C=C=CO
51 138.0661882961 [NH+]#CC=C(N)N=C=CCO
52 164.0454528521 [NH+]#CC=C(N=C=O)N=C=CCO
53 166.0611029161 NC(=C=C=NC=O)[NH+]=C=CCO Intermediate Fragment 
54 123.0552892641 C#CC(=[NH2+])N=C=CCO
55 121.0396392001 C#CC(=[NH2+])N=C=C=CO
56 149.0345538201 O=C[NH+]=C=C=C=NC#CCO
57 166.0611029161 N=C(O)N=C=C=C=[NH+]C=CCO Intermediate Fragment 
58 106.0287401681 C#CC=[NH+]C#CC=O
59 104.0130901041 C#CC#[N+]C#CC=O
60 94.0287401681 C#C[NH+]=C=C=CO
61 92.0130901041 C#C[NH+]=C=C=C=O
62 89.9974400401 [C+]#CN=C=C=C=O
63 82.0287401681 C=[NH+]C#CC=O
64 80.0130901041 C#[N+]C#CC=O
65 83.0239891361 [CH+]=C=NC(=N)O
66 85.0396392001 C=C=[NH+]C(=N)O
67 166.0611029161 C=C=NC(=O)N=C=[NH+]C=CCO Intermediate Fragment 
68 140.0454528521 [NH3+]C(=O)N=C=NC#CCO
69 72.0443902321 C#C[NH2+]CO
70 70.0287401681 C#C[NH2+]C=O
71 68.0130901041 C#C[NH+]=C=O
72 95.0239891361 [NH2+]=C=NC=C=C=O
73 97.0396392001 [NH2+]=C=NC=C=CO
74 99.0552892641 [NH2+]=C=NC=CCO
75 42.0338255481 CC#[NH+]
76 166.0611029161 C=NC(O)=NC(=C)[NH+]=C=C=CO Intermediate Fragment 
77 75.0552892641 C=[NH+]C(N)O
78 71.0239891361 C#[N+]C(=N)O
79 109.0396392001 C=C([NH3+])N=C=C=C=O
80 166.0611029161 C=C=C(N=C(N)O)[NH+]=C=C=CO Intermediate Fragment 
81 164.0454528521 C#CC(N=C=C=CO)=NC([NH3+])=O
82 146.0348881681 O=C=C=C=[NH+]C1=CC=NC=N1
83 146.0348881681 [CH+]=C=C=NC1=CC=NC(O)=N1
84 164.0454528521 N=C(O)N=C=C=C=[NH+]C#CCO Intermediate Fragment 
85 147.0189037561 O=CC#CN=C=C=C=[NH+]C=O
86 164.0454528521 C=C=NC(=O)N=C=[NH+]C#CCO Intermediate Fragment 
87 164.0454528521 C=NC(O)=NC(=C)[NH+]=C=C=C=O Intermediate Fragment 
88 111.0076703761 O=C1C=COC1=C=[OH+]
89 113.0233204401 OC1C=COC1=C=[OH+]
90 115.0389705041 OC1CCOC1=C=[OH+]
91 117.0546205681 OC1CCOC1=C[OH2+]
92 99.0440558841 C=C1OCC=C1[OH2+]
93 117.0546205681 OCCC(O)C#C[OH2+] Intermediate Fragment 
94 117.0546205681 OCCCOC#C[OH2+] Intermediate Fragment 
95 117.0546205681 CCC(O)C(=O)C=[OH+] Intermediate Fragment 
96 99.0440558841 CC=C(O)C#C[OH2+]
97 57.0334912001 CC#C[OH2+]
98 119.0702706321 OC1CCOC1C[OH2+]
99 119.0702706321 OCCC(O)C=C[OH2+] Intermediate Fragment 
100 264.0978823481 O=C=C1OC(N2C=CC([NH+]=CCCO)=NC2)C=C1O
101 76.0756903601 [NH3+]CCCO
102 56.0494756121 CCC#[NH+]
103 54.0338255481 C=CC#[NH+]
104 207.0400331241 O=C1N=CC=CN1C1C=C(O)C(=C=[OH+])O1
105 207.0400331241 O=C(C=[OH+])C(O)=C=CN1C=CC=NC1=O Intermediate Fragment 
106 209.0556831881 OC1=CC(N2C=CC=NC2O)OC1=C=[OH+]
107 209.0556831881 O=C(C=[OH+])C(O)=C=CN1C=CC=NC1O Intermediate Fragment 
108 211.0713332521 OC1=CC(N2C=CCNC2O)OC1=C=[OH+]
109 193.0607685681 C=C1OC(N2C=CC=NC2=[OH+])C=C1O
110 211.0713332521 O=C(C=[OH+])C(O)=C=CN1C=CCNC1O Intermediate Fragment 
111 151.0502038841 OC#CCN1C=CC=NC1=[OH+]
112 127.0865893921 C#CN1CCCNC1[OH2+]
113 125.0709393281 C#CN1C=CCNC1[OH2+]
114 213.0869833161 OC1=CC(N2CCCNC2O)OC1=C=[OH+]
115 213.0869833161 OC(=C=C(O)N1CCCNC1O)C#C[OH2+] Intermediate Fragment 
116 215.1026333801 OC1CC(N2CCCNC2O)OC1=C=[OH+]
117 222.0509321561 [NH3+]C1=NC(=O)N(C2C=C(O)C(=C=O)O2)C=C1
118 228.0978823481 [NH3+]C1CCN(C2C=C(O)C(=C=O)O2)C(O)N1
119 228.0978823481 [NH3+]C1CCN(C(O)=C=C(O)C#CO)C(O)N1 Intermediate Fragment 
120 236.0665822201 C[NH2+]C1=NC(=O)N(C2C=C(O)C(=C=O)O2)C=C1
121 238.0822322841 C[NH2+]C1=NC(O)N(C2C=C(O)C(=C=O)O2)C=C1
122 240.0978823481 C[NH2+]C1C=CN(C2C=C(O)C(=C=O)O2)C(O)N1
123 250.0822322841 CC[NH2+]C1=NC(=O)N(C2C=C(O)C(=C=O)O2)C=C1
124 252.0978823481 CC[NH2+]C1=NC(O)N(C2C=C(O)C(=C=O)O2)C=C1
125 254.1135324121 CC[NH2+]C1C=CN(C2C=C(O)C(=C=O)O2)C(O)N1
126 264.0978823481 CCC[NH2+]C1=NC(=O)N(C2C=C(O)C(=C=O)O2)C=C1
127 152.0818383601 CCC=[NH+]C1=CC=NC(O)=N1
128 264.0978823481 CCC[NH2+]C1=NC(=O)N(C=C=C(O)C(=O)C=O)C=C1 Intermediate Fragment 
129 264.0978823481 O=C=C1C=CC(N2C=CC([NH2+]CCCO)=NC2=O)O1
130 282.1084470321 OC#CC(O)=C=C(O)N1C=CC([NH2+]CCCO)=NC1O Intermediate Fragment 
131 240.0978823481 O=C1N=C([NH2+]CCCO)C=CN1C(O)C#CO
132 222.0873176641 CCC=[NH+]C1=NC(=O)N(C(O)C#CO)C=C1
133 222.0873176641 C#CC(O)N1C=CC([NH+]=CCCO)=NC1=O
134 222.0873176641 O=C1N=C([NH+]=CCCO)C=CN1CC#CO
135 238.0822322841 O=C1N=C([NH+]=CCCO)C=CN1C(O)C#CO
136 210.0873176641 C=C(O)N1C=CC([NH+]=CCCO)=NC1=O
137 220.0716676001 C#CC(O)N1C=CC([NH+]=C=CCO)=NC1=O
138 220.0716676001 O=C1N=C([NH+]=C=CCO)C=CN1CC#CO
139 236.0665822201 O=C1N=C([NH+]=C=CCO)C=CN1C(O)C#CO
140 208.0716676001 C=C(O)N1C=CC([NH+]=C=CCO)=NC1=O
141 218.0560175361 C#CC(O)N1C=CC([NH+]=C=C=CO)=NC1=O
142 214.1186177921 C=C(O)N1C=CC([NH2+]CCCO)=NC1O
143 212.1029677281 C=C(O)N1C=CC([NH2+]CCCO)=NC1=O
144 192.0767529801 C=C(O)N1C=CC([NH+]=C=CC)=NC1=O
145 192.0767529801 C#CN1C=CC([NH+]=CCCO)=NC1=O
146 208.0716676001 C=C(O)N=C=C=C(N=C=O)[NH+]=CCCO Intermediate Fragment 
147 68.9971056921 [O+]#CC#CO
148 71.0127557561 O=CC#C[OH2+]
149 73.0284058201 OCC#C[OH2+]
150 75.0440558841 OCC=C[OH2+]
151 77.0597059481 OCCC[OH2+]
152 59.0491412641 C=CC[OH2+]
153 198.0873176641 O=C1N=C([NH+]=CCCO)C=CN1CO
154 196.0716676001 O=C1N=C([NH+]=C=CCO)C=CN1CO
155 178.0611029161 C=C=C=[NH+]C1=NC(=O)N(CO)C=C1
156 178.0611029161 CN1C=CC([NH+]=C=C=CO)=NC1=O
157 194.0560175361 O=C1N=C([NH+]=C=C=CO)C=CN1CO
158 166.0611029161 C=C=[NH+]C1=NC(=O)N(CO)C=C1
159 176.0454528521 CN1C=CC([NH+]=C=C=C=O)=NC1=O
160 192.0403674721 O=C=C=C=[NH+]C1=NC(=O)N(CO)C=C1
161 87.0440558841 CC(O)C#C[OH2+]
162 89.0597059481 CC(O)C=C[OH2+]
163 71.0491412641 C#CC(C)[OH2+]
164 71.0491412641 CCC#C[OH2+]
165 91.0753560121 CC(O)CC[OH2+]
166 73.0647913281 C=CC(C)[OH2+]
167 264.0978823481 O=C1N=C([NH2+]CCCO)C=CN1C=C=C(O)C#CO
168 280.0927969681 O=C1N=C([NH2+]CCCO)C=CN1C(O)=C=C(O)C#CO
169 282.1084470321 OC#COC(=C=CO)N1C=CC([NH2+]CCCO)=NC1O Intermediate Fragment 
170 63.0440558841 OCC[OH2+]
171 224.1029677281 O=C1N=C([NH2+]CCCO)C=CN1CC#CO
172 282.1084470321 C=C(OC(=C=O)CO)N1C=CC([NH2+]CCCO)=NC1=O Intermediate Fragment 
173 206.0560175361 C=C(O)N1C=CC([NH+]=C=C=CO)=NC1=O
174 190.0611029161 C#CN1C=CC([NH+]=C=CCO)=NC1=O
175 194.0924030441 C#CN1C=CC([NH2+]CCCO)=NC1=O
176 176.0818383601 C#CN1C=CC([NH+]=CCC)=NC1=O
177 196.1080531081 C#CN1C=CC([NH2+]CCCO)=NC1O
178 198.1237031721 C#CN1C=CC([NH2+]CCCO)NC1O
179 282.1084470321 C=C(O)C(=C=O)OCN1C=CC([NH2+]CCCO)=NC1=O Intermediate Fragment 
180 282.1084470321 O=CC(=O)C(O)=C=CN1C=CC([NH2+]CCCO)=NC1O Intermediate Fragment 
181 226.1186177921 OC#CCN1C=CC([NH2+]CCCO)=NC1O
182 208.1080531081 CCC[NH2+]C1=NC(=O)N(CC#CO)C=C1
183 220.0716676001 O=C=NC(=C=CN=CC#CO)[NH+]=CCCO Intermediate Fragment 
184 59.0127557561 O=C=C[OH2+]
185 41.0021910721 [C+]#CO
186 61.0284058201 OC=C[OH2+]
187 87.0076703761 O=CC(=[OH+])C=O
188 89.0233204401 O=CC(=[OH+])CO
189 71.0127557561 CC(=O)C#[O+]
190 91.0389705041 OCC(=[OH+])CO
191 73.0284058201 CC(=[OH+])C=O
192 93.0546205681 OCC([OH2+])CO
193 75.0440558841 CC(=[OH+])CO
194 184.1080531081 CN1C=CC([NH2+]CCCO)=NC1=O
195 182.0924030441 CN1C=CC([NH+]=CCCO)=NC1=O
196 180.0767529801 CN1C=CC([NH+]=C=CCO)=NC1=O
197 162.0661882961 C=C=C=[NH+]C1=NC(=O)N(C)C=C1
198 180.0767529801 C=NC=C=C(N=C=O)[NH+]=CCCO Intermediate Fragment 
199 109.0396392001 [CH2+]N1C=CC=NC1=O
200 124.0505382321 [CH2+]N1C=CC(N)=NC1=O
201 148.0505382321 C=C=NC1=NC(=O)N([CH2+])C=C1
202 176.0454528521 C=NC=C=C(N=C=O)[NH+]=C=C=CO Intermediate Fragment 
203 133.0396392001 C=[NH+]C#CC=NC#CC=O
204 146.0348881681 C=[NH+]C#CC(=N)N=C=C=C=O
205 148.0505382321 C=[NH+]C#CC(=N)N=C=C=CO
206 176.0454528521 CN(C=C=C=NC#CC#[O+])C(=N)O Intermediate Fragment 
207 176.0454528521 C=CN(C)C(=O)N=C=NC#CC#[O+] Intermediate Fragment 
208 280.0927969681 O=CC(=O)C(O)=C=CN1C=CC([NH2+]CCCO)=NC1=O
209 282.1084470321 C=C(N=C(O)N(C)C1C=C(O)C(=C=O)O1)[NH+]=CCCO Intermediate Fragment 
210 185.0556831881 C[NH+](C(=N)O)C1=CC(O)C(=C=O)O1
211 172.0604342201 C[NH+](CO)C1C=C(O)C(=C=O)O1
212 144.0655196001 C[NH2+]C1CC(O)C(=C=O)O1
213 172.0604342201 C[NH+](C=C=C(O)C(=O)C=O)CO Intermediate Fragment 
214 113.0709393281 C=C([NH3+])N=C=CCO
215 146.0811696641 C[NH2+]C1CC(O)C(=CO)O1
216 128.0706049801 C[NH2+]C1CCC(=C=O)O1
217 142.0498695361 C[NH2+]C1C=C(O)C(=C=O)O1
218 141.0658539481 C=C(N=CCCO)[NH+]=C=O
219 282.1084470321 C=CN(C(=O)N=C[NH2+]CCCO)C1C=C(O)C(=C=O)O1 Intermediate Fragment 
220 184.0604342201 C=C[NH+](CO)C1C=C(O)C(=C=O)O1
221 282.1084470321 N=C(O)N(C=C=C[NH2+]CCCO)C1C=C(O)C(=C=O)O1 Intermediate Fragment 
222 112.0756903601 C#CC=[NH+]CCCO
223 195.0400331241 C#C[NH+](C(=N)O)C1C=C(O)C(=C=O)O1
224 265.0818979361 O=C=C1OC([NH+](C#CC=NCCCO)C=O)C=C1O
225 239.1026333801 O=C=C1OC(=[NH+]C=CCNCCCO)C=C1O
226 237.0869833161 O=C=C1OC(=[NH+]C#CCNCCCO)C=C1O
227 282.1084470321 NC(=C=CN(C=O)C1C=C(O)C(=C=O)O1)[NH2+]CCCO Intermediate Fragment 
228 162.0760842841 OC=C1OC([NH2+]CO)CC1O
229 254.1135324121 NC(C=C[NH+]=C1C=C(O)C(=C=O)O1)NCCCO
230 282.1084470321 O=C=C1OC(=NC=C=C(NCO)[NH2+]CCCO)C=C1O Intermediate Fragment 
