#In-silico ESI-MS/MS [M+H]+ Spectra
#PREDICTED BY CFM-ID 4.0.8
#SMILES=n1(c(nc2c(c1=O)ncn2[C@H]1C[C@H]([C@H](O1)CO)O)N)C(=O)CO
#InChiKey=ILAWNOHAPQPZES-ATRFCDNQSA-N
energy0
192.05160 15.50 20 (11.053)
210.06217 100.00 12 21 31 47 36 45 54 38 48 49 (69.731 0.68848 0.63259 0.080667 0.056796 0.041587 0.024291 0.015366 0.014473 0.0079725)
energy1
150.04104 51.31 14 (13.448)
152.05669 100.00 15 (26.208)
178.03595 34.82 17 (9.1252)
180.05160 55.69 18 189 (14.596 0.00014714)
192.05160 32.24 20 (8.4502)
210.06217 54.59 12 21 31 38 45 49 36 54 47 48 (13.172 0.78129 0.1189 0.081911 0.0534 0.031336 0.028338 0.016907 0.015372 0.0068461)
energy2
45.03349 13.44 7 (2.1239)
55.01784 6.61 194 (1.0445)
57.03349 12.06 192 (1.9067)
108.01924 7.12 26 (1.125)
109.05087 10.37 33 (1.6383)
137.04579 12.22 22 (1.9311)
150.04104 41.43 14 (6.549)
152.05669 100.00 15 (15.806)
178.07234 27.58 110 (4.3595)
194.06725 12.83 123 137 (1.8664 0.16148)
206.06725 21.05 84 (3.3275)
208.08290 70.73 115 (11.179)
210.06217 11.17 12 49 38 31 21 45 54 36 47 48 (0.7085 0.38273 0.28632 0.14411 0.085515 0.04606 0.040298 0.034245 0.019217 0.018998)
210.09855 7.88 116 (1.2452)
212.11420 7.05 117 (1.1136)
224.07782 30.92 128 210 (4.8314 0.056193)
236.07782 7.44 64 173 (1.1089 0.067569)
250.09347 59.74 118 71 77 86 (4.8446 2.3205 1.8527 0.42469)
251.07748 6.74 87 98 95 89 (0.9772 0.055422 0.021656 0.010316)
252.10912 22.41 183 133 72 78 (2.688 0.33694 0.26968 0.24803)
258.11968 5.87 200 (0.92731)
266.08838 11.79 119 99 205 82 177 83 81 (0.98843 0.32397 0.27857 0.16126 0.072642 0.021788 0.016352)

0 326.1095096521 [NH3+]c1nc2c(ncn2C2CC(O)C(CO)O2)c(=O)n1C(=O)CO
1 119.0702706321 OC1CCOC1C[OH2+]
2 117.0546205681 OC1C=COC1C[OH2+]
3 99.0440558841 CC1=C([OH2+])C=CO1
4 99.0440558841 [OH2+]CC1=CC=CO1
5 117.0546205681 C=C(O)C(=C[OH2+])OC Intermediate Fragment 
6 117.0546205681 C=COC(=CO)C[OH2+] Intermediate Fragment 
7 45.0334912001 C=C[OH2+]
8 117.0546205681 OC=C=COCC[OH2+] Intermediate Fragment 
9 117.0546205681 OC=C=C(O)CC[OH2+] Intermediate Fragment 
10 99.0440558841 C#CC(O)=CC[OH2+]
11 208.0465154721 [NH3+]C1=NC2=C(N=CN2)C(=O)N1C(=O)C=O
12 210.0621655361 [NH3+]C1=NC2=C(N=CN2)C(=O)N1C(=O)CO
13 193.0356164401 O=CC(=O)N1C=NC2=C(N=CN2)C1=[OH+]
14 150.0410361681 [NH3+]C1=NC(=O)C2=NC=NC2=N1
15 152.0566862321 [NH3+]C1=NC(=O)C2=NCNC2=N1
16 154.0723362961 [NH3+]C1=NC(=O)C2NCNC2=N1
17 178.0359507881 NC1=NC2=C(N=CN2)C(=O)N1C#[O+]
18 180.0516008521 [NH3+]C1=NC2=C(N=CN2)C(=O)N1C=O
19 182.0672509161 [NH3+]C1=NC2=C(N=CN2)C(=O)N1CO
20 192.0516008521 [CH2+]C(=O)N1C(=O)C2=C(N=C1N)NC=N2
21 210.0621655361 [NH3+]C(=NC(=O)CO)N=C1NC=NC1=C=O Intermediate Fragment 
22 137.0457872001 N=C[NH+]=C1N=CN=C1C=O
23 135.0301371361 N#C[NH+]=C1N=CN=C1C=O
24 114.0661882961 [NH2+]=C1NCNC1C=O
25 110.0348881681 [NH2+]=C1N=CN=C1C=O
26 108.0192381041 N=C1N=CN=C1C#[O+]
27 101.0345538201 N=C=[NH+]C(=O)CO
28 95.0239891361 [O+]#CC1=CNC=N1
29 182.0672509161 NC(N=C1C=NC=N1)=[NH+]C(=O)CO
30 208.0465154721 NC(N=C1NC=NC1=C=O)=[NH+]C(=O)C=O
31 210.0621655361 [NH3+]C(=NC1=CN=CN1)N(C=O)C(=O)C=O Intermediate Fragment 
32 111.0665226441 NC=[NH+]C1C=NC=N1
33 109.0508725801 N=C=[NH+]C1C=NC=N1
34 107.0352225161 N=C=[N+]=C1C=NC=N1
35 82.0399735481 [NH2+]=C1C=NC=N1
36 210.0621655361 N=C([NH3+])N(C(=O)C=O)C(=O)C1=CNC=N1 Intermediate Fragment 
37 168.0403674721 O=CC(O)=[NH+]C(=O)C1=CNC=N1
38 210.0621655361 N=C1NC=NC1=C(O)N(C#[NH+])C(=O)CO Intermediate Fragment 
39 183.0512665041 N=C1N=CN=C1C(=O)[NH+]=C(O)CO
40 193.0356164401 N#C[NH+](C(=O)C=O)C(=O)C1=CNC=N1
41 129.0294684401 N#C[NH+](C=O)C(=O)CO
42 127.0138183761 N#C[NH+](C=O)C(=O)C=O
43 84.0556236121 [NH2+]=C1C=NCN1
44 103.0502038841 N=C=[NH+]C(O)CO
45 210.0621655361 [NH2+]=C=NC1=C(C(=O)N=C(O)CO)N=CN1 Intermediate Fragment 
46 166.0247174081 O=C(N=C(O)C#[O+])C1=CNC=N1
47 210.0621655361 N=C=NC1=CC(=O)N(C(=O)CO)C([NH3+])=N1 Intermediate Fragment 
48 210.0621655361 N=C=NC1=CN=C([NH3+])N(C(=O)CO)C1=O Intermediate Fragment 
49 210.0621655361 C=NC1=C(N)N=C([NH3+])N(C(=O)C=O)C1=O Intermediate Fragment 
50 181.0356164401 NC1=CC(=O)N(C(=O)C#[O+])C(N)=N1
51 183.0512665041 NC1=NC([NH3+])=CC(=O)N1C(=O)C=O
52 193.0356164401 C#[N+]C1=CN=C(N)N(C(=O)C=O)C1=O
53 208.0465154721 C#[N+]C1=C(N)N=C(N)N(C(=O)C=O)C1=O
54 210.0621655361 C=NC1=C(N)C(=O)N(C(=O)C=O)C([NH3+])=N1 Intermediate Fragment 
55 179.0199663761 N=C1C=NC(=N)N(C(=O)C#[O+])C1=O
56 212.0778156001 [NH3+]C1=NC2=C(N=CN2)C(=O)N1C(O)CO
57 214.0934656641 [NH3+]C1=NC2=C(NCN2)C(=O)N1C(O)CO
58 216.1091157281 [NH3+]C1=NC2=C(NCN2)C(O)N1C(O)CO
59 156.0879863601 [NH3+]C1=NC(O)C2NCNC2=N1
60 158.1036364241 [NH3+]C1=NC(O)C2NCNC2N1
61 160.1192864881 [NH3+]C1NC(O)C2NCNC2N1
62 216.1091157281 [NH3+]C(=NC(O)CO)N=C1NCNC1=CO Intermediate Fragment 
63 294.0832949041 [NH3+]C1=NC2=C(N=CN2C2=CC(O)=CO2)C(=O)N1C(O)CO
64 236.0778156001 [NH3+]C1=NC(O)=C2N=CN(C3=CC(O)CO3)C2=N1
65 238.0934656641 [NH3+]C1=NC(O)=C2N=CN(C3CC(O)CO3)C2=N1
66 296.0989449681 [NH3+]C1=NC2=C(N=CN2C2=CC(O)CO2)C(=O)N1C(O)CO
67 278.0883802841 [NH3+]C1=NC2=C(N=CN2C2=CC=CO2)C(=O)N1C(O)CO
68 298.1145950321 [NH3+]C1=NC2=C(N=CN2C2CC(O)CO2)C(=O)N1C(O)CO
69 308.0989449681 CC1=C(O)C=C(N2C=NC3=C2N=C([NH3+])N(C(O)CO)C3=O)O1
70 248.0778156001 CC1=C(O)C=C(N2C=NC3=C(O)N=C([NH3+])N=C32)O1
71 250.0934656641 CC1OC(N2C=NC3=C(O)N=C([NH3+])N=C32)=CC1O
72 252.1091157281 CC1OC(N2C=NC3=C(O)N=C([NH3+])N=C32)CC1O
73 308.0989449681 C=C(O)C(=C)OCN1C=NC2=C1N=C([NH3+])N(C(=O)CO)C2=O Intermediate Fragment 
74 308.0989449681 CC(=O)C(O)=C=CN1C=NC2=C1N=C([NH3+])N(C(O)CO)C2=O Intermediate Fragment 
75 308.0989449681 C=CC(O)=C=C(O)N1C=NC2=C1N=C([NH3+])N(C(O)CO)C2=O Intermediate Fragment 
76 308.0989449681 [NH3+]C1=NC2=C(N=CN2C2=CC=C(CO)O2)C(=O)N1C(O)CO
77 250.0934656641 [NH3+]C1=NC(O)=C2N=CN(C3=CCC(CO)O3)C2=N1
78 252.1091157281 [NH3+]C1=NC(O)=C2N=CN(C3CCC(CO)O3)C2=N1
79 308.0989449681 [NH3+]C1=NC2=C(N=CN2C(O)=C=C=CCO)C(=O)N1C(O)CO Intermediate Fragment 
80 264.0727302201 [NH3+]C1=NC(O)=C2N=CN(C3=CC(O)=C(CO)O3)C2=N1
81 266.0883802841 [NH3+]C1=NC(O)=C2N=CN(C3=CC(O)C(CO)O3)C2=N1
82 266.0883802841 [NH3+]C1=NC(O)=C2N=CN(C(O)=C=C(O)CCO)C2=N1 Intermediate Fragment 
83 266.0883802841 [NH3+]C1=NC(O)=C2N=CN(C(=C=CO)OCCO)C2=N1 Intermediate Fragment 
84 206.0672509161 [NH3+]C1=NC(O)=C2N=CN(C#CCO)C2=N1
85 268.1040303481 [NH3+]C1=NC(O)=C2N=CN(C3CC(O)C(CO)O3)C2=N1
86 250.0934656641 [NH3+]C1=NC=C2N=CN(C3=CC(O)C(CO)O3)C2=N1
87 251.0774812521 OCC1OC(N2C=NC3=C([OH2+])N=CN=C32)=CC1O
88 268.1040303481 N=C([NH3+])N=C1C(=C=O)N=CN1C1CC(O)C(CO)O1 Intermediate Fragment 
89 251.0774812521 NC=[NH+]C1=C(C=O)N=CN1C1=CC(O)=C(CO)O1
90 226.0822322841 [NH2+]=C1C(=C=O)N=CN1C1CC(O)C(CO)O1
91 240.1091157281 NC(=[NH2+])N=C1C=NCN1C1=CC(O)C(CO)O1
92 268.1040303481 [NH3+]C(=NC=O)N=C1C=NCN1C1=CC(O)C(CO)O1 Intermediate Fragment 
93 225.0982166961 NC=[NH+]C1=CN=CN1C1=CC(O)C(CO)O1
94 268.1040303481 NC([NH3+])=NC(=O)C1=CN(C2=CC(O)C(CO)O2)C=N1 Intermediate Fragment 
95 251.0774812521 NC=[NH+]C(=O)C1=CN(C2=CC(O)=C(CO)O2)C=N1
96 209.0556831881 OCC1=C(O)C=C(N2C=NC(C=[OH+])=C2)O1
97 268.1040303481 N=CN(C1=CC(O)C(CO)O1)C1=NC([NH3+])=NC(O)=C1 Intermediate Fragment 
98 251.0774812521 C[NH+](C1=CC(O)=C(C=O)O1)C1=NC(N)=NC(O)=C1
99 266.0883802841 [NH+]#CN(C1=CC(O)C(CO)O1)C1=NC(N)=NC(O)=C1
100 268.1040303481 C=NC1=C(O)N=C([NH3+])N=C1N=C1CC(O)C(CO)O1 Intermediate Fragment 
101 268.1040303481 C=C(O)C(CO)OCN1C=NC2=C(O)N=C([NH3+])N=C21 Intermediate Fragment 
102 268.1040303481 [NH3+]C1=NC(O)=C2N=CN(C=CC(O)C(O)CO)C2=N1 Intermediate Fragment 
103 164.0566862321 [CH2+]N1C=NC2=C(O)N=C(N)N=C21
104 168.0879863601 CN1CNC2=C(O)N=C([NH3+])N=C21
105 170.1036364241 CN1CNC2C1=NC([NH3+])=NC2O
106 93.0546205681 OCC([OH2+])CO
107 91.0389705041 OC=C([OH2+])CO
108 89.0233204401 O=CC([OH2+])=CO
109 176.0566862321 C#CN1C=NC2=C(O)N=C([NH3+])N=C21
110 178.0723362961 C=CN1C=NC2=C(O)N=C([NH3+])N=C21
111 180.0879863601 CCN1C=NC2=C(O)N=C([NH3+])N=C21
112 182.1036364241 CCN1CNC2=C(O)N=C([NH3+])N=C21
113 184.1192864881 CCN1CNC2C1=NC([NH3+])=NC2O
114 63.0440558841 OCC[OH2+]
115 208.0829009801 [NH3+]C1=NC(O)=C2N=CN(C=CCO)C2=N1
116 210.0985510441 [NH3+]C1=NC(O)=C2N=CN(CCCO)C2=N1
117 212.1142011081 [NH3+]C1=NC(O)=C2NCN(CCCO)C2=N1
118 250.0934656641 [NH3+]C1=NC(O)=C2N=CN(C#CC(O)CCO)C2=N1
119 266.0883802841 [NH3+]C1=NC(O)=C2N=CN(C#CC(O)C(O)CO)C2=N1
120 268.1040303481 [NH3+]C1=NC(O)=C2N=CN(C(O)=CC(O)CCO)C2=N1 Intermediate Fragment 
121 75.0440558841 OC=CC[OH2+]
122 73.0284058201 OC#CC[OH2+]
123 194.0672509161 C=C(O)N1C=NC2=C(O)N=C([NH3+])N=C21
124 198.0985510441 CC(O)N1CNC2=C(O)N=C([NH3+])N=C21
125 200.1142011081 CC(O)N1CNC2C1=NC([NH3+])=NC2O
126 47.0491412641 CC[OH2+]
127 222.0621655361 [NH3+]C1=NC(O)=C2N=CN(C(O)=C=CO)C2=N1
128 224.0778156001 [NH3+]C1=NC(O)=C2N=CN(C(O)=CCO)C2=N1
129 226.0934656641 [NH3+]C1=NC(O)=C2N=CN(C(O)CCO)C2=N1
130 268.1040303481 [NH3+]C1=NC(O)=C2N=CN(C(=CCO)OCCO)C2=N1 Intermediate Fragment 
131 268.1040303481 C=C(OC(CO)CO)N1C=NC2=C(O)N=C([NH3+])N=C21 Intermediate Fragment 
132 270.1196804121 [NH3+]C1=NC(O)=C2NCN(C3CC(O)C(CO)O3)C2=N1
133 252.1091157281 [NH3+]C1=NC=C2N=CN(C3CC(O)C(CO)O3)C2=N1
134 253.0931313161 OCC1OC(N2C=NC3=C([OH2+])N=CN=C32)CC1O
135 270.1196804121 [NH3+]C1=NC(O)=C2N=CN(CCC(O)C(O)CO)C2=N1 Intermediate Fragment 
136 308.0989449681 [NH3+]C1=NC2=C(N=CN2C2=CC(O)=C(CO)O2)C(=O)N1CCO
137 194.0672509161 [NH3+]C1=NC2=C(N=CN2)C(=O)N1C=CO
138 294.0832949041 [NH3+]C1=NC2=C(N=CN2C2=CC(O)=C(CO)O2)C(=O)N1CO
139 294.0832949041 [NH3+]C1=NC2=C(N=CN2C(O)=C=C(O)C=CO)C(=O)N1CO Intermediate Fragment 
140 296.0989449681 [NH3+]C1=NC2=C(N=CN2C2=CC(O)C(CO)O2)C(=O)N1CO
141 278.0883802841 CC1=C(O)C=C(N2C=NC3=C2N=C([NH3+])N(CO)C3=O)O1
142 296.0989449681 [NH3+]C1=NC2=C(N=CN2C(=C=CO)OCCO)C(=O)N1CO Intermediate Fragment 
143 298.1145950321 [NH3+]C1=NC2=C(N=CN2C2CC(O)C(CO)O2)C(=O)N1CO
144 280.1040303481 CC1OC(N2C=NC3=C2N=C([NH3+])N(CO)C3=O)=CC1O
145 308.0989449681 CC(O)N1C(=O)C2=C(N=C1[NH3+])N(C1=CC(O)=C(CO)O1)C=N2
146 326.1095096521 [NH3+]C(=NC(O)CO)N=C1C(=C=O)N=CN1C1=CC(O)C(CO)O1 Intermediate Fragment 
147 255.1087813801 NC=[NH+]C1=C(C=O)N=CN1C1CC(O)C(CO)O1
148 253.0931313161 NC=[NH+]C1=C(C=O)N=CN1C1=CC(O)C(CO)O1
149 298.1145950321 NC(N=C1C=NCN1C1=CC(O)=C(CO)O1)=[NH+]C(O)CO
150 326.1095096521 [NH3+]C(=NC1=CN=CN1C1=CC(O)=C(CO)O1)N(C=O)C(O)CO Intermediate Fragment 
151 227.1138667601 NC=[NH+]C1=CN=CN1C1CC(O)C(CO)O1
152 183.0764186321 OC1C=C(N2C=CN=C2)OC1C[OH2+]
153 225.0982166961 NC=[NH+]C1=CN=CN1C(O)=C=C(O)CCO Intermediate Fragment 
154 223.0825666321 NC=[NH+]C1=CN=CN1C1=CC(O)=C(CO)O1
155 296.0989449681 NC(N=C1C=NCN1C1=CC(O)=C(C=O)O1)=[NH+]C(O)CO
156 326.1095096521 N=C([NH3+])N(C(=O)C1=CN(C2=CC(O)=C(CO)O2)C=N1)C(O)CO Intermediate Fragment 
157 326.1095096521 N=C1C(=C(O)N(C[NH3+])C(O)CO)N=CN1C1=CC(O)=C(C=O)O1 Intermediate Fragment 
158 299.0986106201 N=C1C(=C(O)[NH2+]C(O)CO)N=CN1C1=CC(O)=C(CO)O1
159 224.0665822201 [NH2+]=C1C(=C=O)N=CN1C1=CC(O)C(CO)O1
160 326.1095096521 [NH3+]C=NC1=C(C(=O)NC(O)CO)N=CN1C1=CC(O)=C(CO)O1 Intermediate Fragment 
161 326.1095096521 N=CN(C1=CC(=O)N(C(O)CO)C([NH3+])=N1)C1=CC(O)=C(CO)O1 Intermediate Fragment 
162 299.0986106201 NC1=NC([NH+]=C2C=C(O)C(CO)O2)=CC(=O)N1C(O)CO
163 159.0764186321 [NH+]#CNC1CC(O)C(CO)O1
164 326.1095096521 [NH3+]C1=NC=C(N=C=NC2=CC(O)C(CO)O2)C(=O)N1C(O)CO Intermediate Fragment 
165 326.1095096521 C=NC1=C(N=C2C=C(O)C(CO)O2)N=C([NH3+])N(C(O)CO)C1=O Intermediate Fragment 
166 326.1095096521 C=C(O)C(=CO)OCN1C=NC2=C1N=C([NH3+])N(C(O)CO)C2=O Intermediate Fragment 
167 240.0727302201 [NH3+]C1=NC2=C(N=CN2CO)C(=O)N1C(=O)CO
168 238.0570801561 [NH3+]C1=NC2=C(N=CN2CO)C(=O)N1C(=O)C=O
169 222.0621655361 CN1C=NC2=C1N=C([NH3+])N(C(=O)C=O)C2=O
170 326.1095096521 [NH3+]C1=NC2=C(N=CN2C=C=C(O)C(O)CO)C(=O)N1C(O)CO Intermediate Fragment 
171 234.0621655361 C#CN1C=NC2=C1N=C([NH3+])N(C(=O)CO)C2=O
172 204.0516008521 C#CN1C=NC2=C1N=C([NH3+])N(C=O)C2=O
173 236.0778156001 C#CN1C=NC2=C1N=C([NH3+])N(C(O)CO)C2=O
174 238.0934656641 C=CN1C=NC2=C1N=C([NH3+])N(C(O)CO)C2=O
175 240.1091157281 CCN1C=NC2=C1N=C([NH3+])N(C(O)CO)C2=O
176 264.0727302201 [NH3+]C1=NC2=C(N=CN2C#CC=O)C(=O)N1C(O)CO
177 266.0883802841 [NH3+]C1=NC2=C(N=CN2C#CCO)C(=O)N1C(O)CO
178 268.1040303481 [NH3+]C1=NC2=C(N=CN2C=CCO)C(=O)N1C(O)CO
179 270.1196804121 [NH3+]C1=NC2=C(N=CN2CCCO)C(=O)N1C(O)CO
180 308.0989449681 [NH3+]C1=NC2=C(N=CN2C#CC(O)=CCO)C(=O)N1C(O)CO
181 290.0883802841 C=C=C(O)C#CN1C=NC2=C1N=C([NH3+])N(C(O)CO)C2=O
182 290.0883802841 [NH3+]C1=NC2=C(N=CN2C#CC#CCO)C(=O)N1C(O)CO
183 252.1091157281 [NH3+]C1=NC(O)=C2N=CN(C=CC(O)CCO)C2=N1
184 324.0938595881 [NH3+]C1=NC2=C(N=CN2C#CC(O)=C(O)CO)C(=O)N1C(O)CO
185 326.1095096521 [NH3+]C1=NC2=C(N=CN2C(O)=C=C(O)CCO)C(=O)N1C(O)CO Intermediate Fragment 
186 91.0753560121 CC(O)CC[OH2+]
187 89.0597059481 C=C(O)CC[OH2+]
188 236.0414300921 [NH3+]C1=NC2=C(N=CN2C=O)C(=O)N1C(=O)C=O
189 180.0516008521 [NH3+]C1=NC(O)=C2N=CN(C=O)C2=N1
190 77.0597059481 OCCC[OH2+]
191 59.0491412641 CC=C[OH2+]
192 57.0334912001 CC#C[OH2+]
193 43.0178411361 C#C[OH2+]
194 55.0178411361 [CH2+]C#CO
195 71.0127557561 OC#CC=[OH+]
196 250.0570801561 C=C(O)N1C=NC2=C1N=C([NH3+])N(C(=O)C=O)C2=O
197 252.0727302201 C=C(O)N1C=NC2=C1N=C([NH3+])N(C(=O)CO)C2=O
198 254.0883802841 C=C(O)N1C=NC2=C1N=C([NH3+])N(C(O)CO)C2=O
199 256.1040303481 CC(O)N1C=NC2=C1N=C([NH3+])N(C(O)CO)C2=O
200 258.1196804121 CC(O)N1CNC2=C1N=C([NH3+])N(C(O)CO)C2=O
201 29.0385765801 C=[CH3+]
202 280.0676448401 [NH3+]C1=NC2=C(N=CN2C(O)=C=C=O)C(=O)N1C(O)CO
203 282.0832949041 [NH3+]C1=NC2=C(N=CN2C(O)=C=CO)C(=O)N1C(O)CO
204 284.0989449681 [NH3+]C1=NC2=C(N=CN2C(O)=CCO)C(=O)N1C(O)CO
205 266.0883802841 C=C=C(O)N1C=NC2=C1N=C([NH3+])N(C(O)CO)C2=O
206 324.0938595881 [NH3+]C1=NC2=C(N=CN2C(O)=C=C(O)C=CO)C(=O)N1C(O)CO
207 326.1095096521 [NH3+]C1=NC2=C(N=CN2C(=C=CO)OCCO)C(=O)N1C(O)CO Intermediate Fragment 
208 280.0676448401 [NH3+]C1=NC2=C(N=CN2COC#CO)C(=O)N1C(=O)CO
209 282.0832949041 [NH3+]C1=NC2=C(N=CN2COC#CO)C(=O)N1C(O)CO
210 224.0778156001 [NH3+]C1=NC(O)=C2N=CN(COC=CO)C2=N1
211 284.0989449681 [NH3+]C1=NC2=C(N=CN2COC=CO)C(=O)N1C(O)CO
212 296.0989449681 C=C(OC=CO)N1C=NC2=C1N=C([NH3+])N(C(O)CO)C2=O
213 238.0934656641 C=C(OCCO)N1C=NC2=C(O)N=C([NH3+])N=C21
214 298.1145950321 C=C(OCCO)N1C=NC2=C1N=C([NH3+])N(C(O)CO)C2=O
215 326.1095096521 C=C(OC(=CO)CO)N1C=NC2=C1N=C([NH3+])N(C(O)CO)C2=O Intermediate Fragment 
