#In-silico ESI-MS/MS [M+H]+ Spectra
#PREDICTED BY CFM-ID 4.0.8
#SMILES=[nH]1c(nc2c(c1=O)nc(n2[C@@H]1O[C@H](CO)[C@@H](C1)O)Nc1nc(c2c(c1C)[nH]c1c2cccc1)C)N
#InChiKey=AGUYWKWGZLXBGZ-RBSFLKMASA-N
energy0
361.15198 33.12 10 71 76 27 64 38 75 66 43 61 53 20 39 79 48 51 50 44 80 (22.466 0.064201 0.042952 0.039549 0.038148 0.030395 0.022998 0.022011 0.016575 0.013065 0.010641 0.00969 0.0070521 0.0026882 0.0013983 0.0012053 0.0011059 0.00094078 0.00030263)
477.19933 100.00 0 189 154 186 219 232 118 222 228 152 230 124 225 142 143 176 174 244 255 148 215 153 246 245 247 145 (67.323 0.97175 0.2079 0.092062 0.032365 0.029872 0.028585 0.023261 0.018766 0.01509 0.011166 0.0099529 0.0092332 0.0090602 0.0085163 0.0072852 0.0055793 0.0037236 0.0032286 0.0012354 0.001201 0.0011948 0.00092222 0.00050816 0.00047476 0.00016412)
energy1
344.12543 5.49 19 21 72 45 (2.7667 0.52994 0.1591 0.012421)
345.12068 3.57 18 17 (1.642 0.61167)
359.13633 2.99 9 37 70 78 60 74 47 52 (1.8489 0.026165 0.0060335 0.0023885 0.0019895 0.00049226 0.00037023 0.00014957)
361.15198 100.00 10 27 20 66 38 53 75 61 64 76 39 50 71 43 44 79 80 48 51 (59.401 0.85059 0.50305 0.45448 0.3733 0.29456 0.22739 0.22337 0.20899 0.18994 0.1111 0.08401 0.079162 0.068452 0.06316 0.02138 0.0064061 0.0063556 0.0057806)
433.17311 2.79 102 105 (1.7458 0.017583)
459.18876 5.47 87 155 100 97 1 90 93 104 101 91 103 106 (2.5371 0.56054 0.083901 0.081903 0.064672 0.028162 0.022688 0.021728 0.019986 0.016096 0.014162 0.0033772)
477.19933 7.61 0 189 154 124 176 142 222 174 143 228 186 225 118 232 219 230 215 152 246 255 148 244 247 245 153 145 (3.2366 1.1918 0.1657 0.041383 0.03508 0.024084 0.017414 0.013363 0.012855 0.012243 0.010732 0.0094994 0.006776 0.0066556 0.0060609 0.0058164 0.0037297 0.0021115 0.0018551 0.0009685 0.000529 0.00036208 0.00033661 0.00012773 7.1392e-05 3.4057e-05)
energy2
43.01784 4.04 196 (0.81327)
45.03349 10.30 166 (2.0706)
57.03349 21.78 199 (4.379)
59.04914 16.30 201 (3.2773)
89.05971 8.98 175 (1.8055)
170.09643 3.68 58 (0.74026)
210.10257 9.05 110 (1.8204)
285.12068 4.32 235 (0.86852)
344.12543 5.98 19 21 72 45 (1.1331 0.028589 0.023835 0.017134)
359.13633 9.97 9 70 47 52 37 60 74 78 (1.8286 0.03449 0.031813 0.029969 0.028808 0.020715 0.01524 0.014284)
361.15198 100.00 10 27 66 39 20 53 51 64 48 44 76 71 61 38 43 50 75 79 80 (10.061 2.8574 1.2187 0.99846 0.8411 0.79545 0.48139 0.42501 0.39131 0.35422 0.31832 0.31577 0.25362 0.18282 0.18209 0.17974 0.099645 0.092252 0.06063)
365.18328 3.82 82 (0.76865)
367.19893 7.57 83 (1.523)
385.15198 13.31 169 (2.6765)
387.16763 45.85 98 (9.2192)
389.14690 6.81 204 205 206 (0.67143 0.37999 0.31732)
390.15607 4.44 122 (0.89325)
399.16763 4.54 159 (0.91291)
401.14690 3.65 177 (0.73407)
403.16255 9.36 178 180 179 (0.75899 0.67075 0.45188)
407.19385 4.13 182 (0.82959)
409.20950 4.13 183 (0.82959)
417.17820 27.72 95 163 161 188 162 (1.736 1.296 1.1736 0.76271 0.60526)
433.17311 3.92 102 105 (0.75568 0.032155)
447.15238 4.62 224 (0.92913)
447.18876 4.08 85 184 (0.59223 0.22877)
451.18368 5.12 223 217 216 (1.0085 0.019911 0.0013591)
457.17311 4.24 214 (0.85348)
460.17278 7.80 229 117 119 (1.1579 0.38321 0.027808)
475.18368 11.96 141 243 147 173 213 (1.4339 0.40986 0.32166 0.16388 0.07476)

0 477.1993277001 Cc1c([NH2+]c2nc3c(=O)[nH]c(N)nc3n2C2CC(O)C(CO)O2)nc(C)c2c1[nH]c1ccccc12
1 459.1887630161 C=C1C(=[NH+]C2=NC3=CN=C(N)N=C3N2C2C=C(O)C(=C=O)O2)N=C(C)C2=C1NC1CCCCC21
2 345.1570689641 C=C1C(=[NH+]C2=NC3=CN=C(N)N=C3N2)N=C(C)C2=C1N=C1CCCC=C12
3 117.0546205681 OC1CCOC1=C[OH2+]
4 99.0440558841 C=C1OCC=C1[OH2+]
5 117.0546205681 CCC(O)C(=O)C=[OH+] Intermediate Fragment 
6 99.0440558841 CC=C(O)C#C[OH2+]
7 117.0546205681 O=CCC(O)C=C[OH2+] Intermediate Fragment 
8 115.0389705041 OC1CCOC1=C=[OH+]
9 359.1363335201 C=C1C(=[NH+]C2=NC3=C(O)N=C(N)N=C3N2)N=C(C)C2=C1N=C1CC=CC=C12
10 361.1519835841 C=C1C(=[NH+]C2=NC3=C(O)N=C(N)N=C3N2)N=C(C)C2=C1N=C1CCCC=C12
11 343.1414189001 C=C1C(=[NH+]C2=NC3=CN=C(N)N=C3N2)N=C(C)C2=C1N=C1CC=CC=C12
12 212.1182238681 C=C1C(=[NH2+])N=C(C)C2=C1NC1CC=CC=C21
13 197.1073248361 CC1N=CC(=[CH3+])C2=C1C1=C(C=CC=C1)N2
14 195.0916747721 C=C1N=CC(=[CH3+])C2=C1C1=C(C=CC=C1)N2
15 165.0519352001 NC1=NC(=O)C2=NC([NH3+])=NC2=N1
16 167.0675852641 NC1=NC(=O)C2=NC([NH3+])NC2=N1
17 345.1206834561 [CH2+]C1=NC(=NC2=NC3=C(O)N=C(N)N=C3N2)CC2=C1C1=CC=CCC1=N2
18 345.1206834561 C=C1C(=[NH+]C2=NC3=C(O)N=C(N)N=C3N2)N=CC2=C1N=C1CC=CC=C12
19 344.1254344881 C=C1C(=[NH+]C2=NC3=C(O)N=CN=C3N2)N=C(C)C2=C1N=C1CC=CC=C12
20 361.1519835841 C=C1C(=[NH+]C2=NC(=C=O)C(=NC(=N)N)N2)N=C(C)C2=C1N=C1CCCC=C12 Intermediate Fragment 
21 344.1254344881 C=C1C(=NC2=NC(C=O)=C([NH+]=C=N)N2)N=C(C)C2=C1N=C1CC=CC=C12
22 319.1301855201 C=C1C(=NC2=NC(=C=O)C(=[NH2+])N2)N=C(C)C2=C1N=C1CCCC=C12
23 317.1145354561 C=C1C(=NC2=NC(=C=O)C(=[NH2+])N2)N=C(C)C2=C1N=C1CC=CC=C12
24 302.1036364241 C=C1C(=[NH+]C2=NC(=C=O)C=N2)N=C(C)C2=C1N=C1CC=CC=C12
25 300.0879863601 [CH+]=C1C(=NC2=NC(=C=O)C=N2)N=C(C)C2=C1N=C1CC=CC=C12
26 333.1570689641 C=C1C(=NC2=NC(=NC(N)=[NH2+])C=N2)N=C(C)C2=C1N=C1CCCC=C12
27 361.1519835841 C=C1C(=[NH+]C2=NC(=NC(N)=NC=O)C=N2)N=C(C)C2=C1N=C1CCCC=C12 Intermediate Fragment 
28 318.1461699321 C=C1C(=NC2=NC=C([NH+]=CN)N2)N=C(C)C2=C1N=C1CC=CC=C12
29 316.1305198681 C=C1C(=NC2=NC=C([NH+]=C=N)N2)N=C(C)C2=C1N=C1CC=CC=C12
30 314.1148698041 [CH+]=C1C(=NC2=NC=C(N=C=N)N2)N=C(C)C2=C1N=C1CC=CC=C12
31 291.1352709001 C=C1C(=NC2=NC(=[NH2+])C=N2)N=C(C)C2=C1NC1CC=CC=C21
32 289.1196208361 C=C1C(=NC2=NC(=[NH2+])C=N2)N=C(C)C2=C1NC1=C2C=CC=C1
33 276.1243718681 C=C1N=C([NH+]=C2N=CCN2)C(=C)C2=C1C1=C(C=CC=C1)N2
34 274.1087218041 C=C1N=C([NH+]=C2N=CC=N2)C(=C)C2=C1C1=C(C=CC=C1)N2
35 272.0930717401 [CH+]=C1C(N=C2N=CC=N2)=NC(=C)C2=C1NC1=C2C=CC=C1
36 331.1414189001 C=C1C(=NC2=NC(=NC(N)=[NH2+])C=N2)N=C(C)C2=C1N=C1CC=CC=C12
37 359.1363335201 C=C1C(=NC2=NC(=NC(N)=[NH+]C=O)C=N2)N=C(C)C2=C1N=C1CC=CC=C12
38 361.1519835841 C=C1C(=[NH+]C2=NC(C(=O)N=C(N)N)=CN2)N=C(C)C2=C1N=C1CC=CC=C12 Intermediate Fragment 
39 361.1519835841 C=C1C(=[NH+]C2=NC(=C(O)N=CN)C(=N)N2)N=C(C)C2=C1N=C1CC=CC=C12 Intermediate Fragment 
40 332.1254344881 C=C1C(=NC2=NC(=N)C(C([NH3+])=O)=N2)N=C(C)C2=C1N=C1CC=CC=C12
41 334.1410845521 C=C1C(=NC2=NC(=N)C(C([NH3+])=O)=N2)N=C(C)C2=C1N=C1CCCC=C12
42 315.0988853921 [CH+]=C1C(=NC2=NC(=C=O)C(=N)N2)N=C(C)C2=C1N=C1CC=CC=C12
43 361.1519835841 C=C1C(=[NH+]C2=NC(C(N)=O)=C(N=CN)N2)N=C(C)C2=C1N=C1CC=CC=C12 Intermediate Fragment 
44 361.1519835841 C=C1C(=[NH+]C(=N)NC2=NC(N)=NC(O)=C2)N=C(C)C2=C1N=C1CC=CC=C12 Intermediate Fragment 
45 344.1254344881 [CH2+]C1=C2N=C3CC=CC=C3C2=C(C)N=C1N=C=NC1=NC(N)=NC(O)=C1
46 235.0978227721 C=C1C(=NC#[NH+])N=C(C)C2=C1NC1=C2C=CC=C1
47 359.1363335201 [CH+]=C1C(=NC(=N)NC2=NC(N)=NC(O)=C2)N=C(C)C2=C1N=C1CC=CC=C12
48 361.1519835841 C=C1C(=[NH+]C(N)=NC2=C(O)N=C(N)N=C2)N=C(C)C2=C1N=C1CC=CC=C12 Intermediate Fragment 
49 237.1134728361 C=C1C(=NC#[NH+])N=C(C)C2=C1N=C1CCCC=C12
50 361.1519835841 CC1=C2C3=CC=CCC3=NC2=C(C)C([NH+]=C=NC2=C(O)N=C(N)N=C2N)=N1 Intermediate Fragment 
51 361.1519835841 CC1=C2C3=CC=CCC3=NC2=C(C)C([NH+]=C=NC2=NC(N)=NC(O)=C2N)=N1 Intermediate Fragment 
52 359.1363335201 [CH2+]C1=C2N=C3CC=CC=C3C2=C(C)N=C1N=C=NC1=NC(N)=NC(O)=C1N
53 361.1519835841 C=C=C1C2=CC=CCC2=NC1=C(C)C(N)=[NH+]C1=NC2=C(O)N=C(N)N=C2N1 Intermediate Fragment 
54 335.1363335201 C=C(C1=CC2=CCCCC2=N1)C(N)=[NH+]C1=NC2=NC(N)=NC(=O)C2=N1
55 333.1206834561 C=C(C1=CC2=CC=CCC2=N1)C(N)=[NH+]C1=NC2=NC(N)=NC(=O)C2=N1
56 331.1050333921 [CH+]=C(C1=CC2=CC=CCC2=N1)C(N)=NC1=NC2=NC(N)=NC(=O)C2=N1
57 220.0941343601 CCC(N)=[NH+]C1=NC2=NC(N)=NC(=O)C2=N1
58 170.0964258041 C#CC1=C([CH3+]C)C2=CC=CCC2=N1
59 172.1120758681 C#CC1=C([CH3+]C)C2=CCCCC2=N1
60 359.1363335201 C=C=C1C2=CC=CCC2=NC1=C([CH2+])C(N)=NC1=NC2=C(O)N=C(N)N=C2N1
61 361.1519835841 C=C(C1=CC2=CC=CCC2=N1)C(N=CC)=[NH+]C1=NC2=C(O)N=C(N)N=C2N1 Intermediate Fragment 
62 320.1254344881 C=C(C=[NH+]C1=NC2=NC(N)=NC(=O)C2=N1)C1=CC2=CCCCC2=N1
63 144.0807757401 C#[CH+]C1=CC2=CC=CCC2N1
64 361.1519835841 C#CC(N=C(C)C1=CN=C2CCCC=C12)=[NH+]C1=NC2=C(O)N=C(N)N=C2N1 Intermediate Fragment 
65 335.1363335201 CC(N=C=[NH+]C1=NC2=C(O)N=C(N)N=C2N1)=C1C=NC2=C1C=CCC2
66 361.1519835841 C=C=C1N=C2CCCC=C2C1=C(C)N=C=[NH+]C1=NC2=C(O)N=C(N)N=C2N1 Intermediate Fragment 
67 185.1073248361 C#CC1=C(C(C)=[NH2+])C2=CC=CCC2N1
68 166.0651256761 C#CC1=C([CH+]#C)C2=CC=CCC2=N1
69 333.1206834561 CC(N=C=[NH+]C1=NC2=C(O)N=C(N)N=C2N1)=C1C=NC2=C1C=CC=C2
70 359.1363335201 C=C=C1N=C2CC=CC=C2C1=C(C)N=C=[NH+]C1=NC2=C(O)N=C(N)N=C2N1
71 361.1519835841 C=C1C=C(C2=CC=CCC2=N)C(C)=NC1=[NH+]C1=NC2=C(O)N=C(N)N=C2N1 Intermediate Fragment 
72 344.1254344881 [CH+]=C1C=C(C2=CC=CC=C2)C(C)=NC1=NC1=NC2=C(O)N=C(N)N=C2N1
73 266.0784842961 [CH+]=C1C=CC(C)=NC1=NC1=NC2=NC(N)=NC(=O)C2=N1
74 359.1363335201 [CH+]=C1C=C(C2=CC=CCC2=N)C(C)=NC1=NC1=NC2=C(O)N=C(N)N=C2N1
75 361.1519835841 C=C1C(N=C2C=CC=CC2)=CC(C)=NC1=[NH+]C1=NC2=C(O)N=C(N)N=C2N1 Intermediate Fragment 
76 361.1519835841 C=C1C(=[NH+]C2=NC3=C(O)N=C(N)N=C3N2)N=C(C)C(C2=CC=CC=C2)=C1N Intermediate Fragment 
77 79.0542266441 C1=CC=[CH2+]C=C1
78 359.1363335201 [CH+]=C1C(=NC2=NC3=C(O)N=C(N)N=C3N2)N=C(C)C(C2=CC=CC=C2)=C1N
79 361.1519835841 C=C=C1C(CC)=NC2=C1C(C)=NC(=[NH+]C1=NC3=C(O)N=C(N)N=C3N1)C2=C Intermediate Fragment 
80 361.1519835841 C=C1C(=[NH+]C2=NC3=C(O)N=C(N)N=C3N2)N=C(C)C2=C1N=CC2=C=CCC Intermediate Fragment 
81 363.1676336481 C=C1C(=[NH+]C2=NC3=C(O)N=C(N)N=C3N2)N=C(C)C2=C1N=C1CCCCC12
82 365.1832837121 C=C1C(=[NH+]C2=NC3=C(O)N=C(N)N=C3N2)N=C(C)C2=C1NC1CCCCC21
83 367.1989337761 CC1=NC(=[NH+]C2=NC3=C(O)N=C(N)N=C3N2)C(C)C2=C1C1CCCCC1N2
84 445.1731129521 C=C1C(=[NH+]C2=NC3=C(O)N=C(N)N=C3N2C2CC(O)=CO2)N=C(C)C2=C1N=C1CCCC=C12
85 447.1887630161 C=C1C(=[NH+]C2=NC3=C(O)N=C(N)N=C3N2C2CC(O)=CO2)N=C(C)C2=C1N=C1CCCCC12
86 449.2044130801 C=C1C(=[NH+]C2=NC3=C(O)N=C(N)N=C3N2C2CC(O)=CO2)N=C(C)C2=C1NC1CCCCC21
87 459.1887630161 C=C1OC(N2C([NH+]=C3N=C(C)C4=C(N=C5CCCCC54)C3=C)=NC3=C(O)N=C(N)N=C32)C=C1O
88 441.1781983321 C=C1C=CC(N2C([NH+]=C3N=C(C)C4=C(N=C5CCCC=C54)C3=C)=NC3=C(O)N=C(N)N=C32)O1
89 442.1622139201 C=C1OC(N2C([NH+]=C3N=C(C)C4=C(N=C5CCCC=C54)C3=C)=NC3=C(O)N=CN=C32)C=C1O
90 459.1887630161 C=C1OC(N2C([NH+]=C3N=C(C)C4=C(N=C5CCCCC54)C3=C)=NC(=C=O)C2=NC(=N)N)C=C1O Intermediate Fragment 
91 459.1887630161 C=C1OC(N2C(=NC(N)=NC=O)C=NC2=[NH+]C2=NC(C)=C3C4=CCCCC4=NC3=C2C)C=C1O Intermediate Fragment 
92 389.1720503321 C=C1OC(N2C(=[NH2+])C=NC2=NC2=NC(C)=C3C4=CCCCC4=NC3=C2C)C=C1O
93 459.1887630161 C=C1C(=[NH+]C2=NC3=C(O)N=C(N)N=C3N2CC=C(O)C(C)=O)N=C(C)C2=C1N=C1CCCC=C12 Intermediate Fragment 
94 441.1781983321 C#CC(O)=CCN1C([NH+]=C2N=C(C)C3=C(N=C4CCCC=C43)C2=C)=NC2=C(O)N=C(N)N=C21
95 417.1781983321 C=C1C(=[NH+]C2=NC3=C(O)N=C(N)N=C3N2CC#CO)N=C(C)C2=C1N=C1CCCCC12
96 413.1468982041 C=C1C(=[NH+]C2=NC3=C(O)N=C(N)N=C3N2CC#CO)N=C(C)C2=C1N=C1CC=CC=C12
97 459.1887630161 C=C(C=O)OC(C)N1C([NH+]=C2N=C(C)C3=C(N=C4CCCC=C43)C2=C)=NC2=C(O)N=C(N)N=C21 Intermediate Fragment 
98 387.1676336481 C=C1C(=[NH+]C2=NC3=C(O)N=C(N)N=C3N2CC)N=C(C)C2=C1N=C1CC=CC=C12
99 389.1832837121 C=C1C(=[NH+]C2=NC3=C(O)N=C(N)N=C3N2CC)N=C(C)C2=C1N=C1CCCC=C12
100 459.1887630161 C#COC(C=C=O)N1C([NH+]=C2N=C(C)C3=C(NC4CCCCC34)C2=C)=NC2=C(O)N=C(N)N=C21 Intermediate Fragment 
101 459.1887630161 C#CC(O)=CC(=O)N1C([NH+]=C2N=C(C)C3=C(NC4CCCCC34)C2=C)=NC2=C(O)N=C(N)N=C21 Intermediate Fragment 
102 433.1731129521 C=C1C(=[NH+]C2=NC3=C(O)N=C(N)N=C3N2C(=O)C#CO)N=C(C)C2=C1NC1CCCCC21
103 459.1887630161 C=C1OC(N2C([NH+]=C(N=CC)C(=C)C3=CC4=CCCCC4=N3)=NC3=C(O)N=C(N)N=C32)C=C1O Intermediate Fragment 
104 459.1887630161 C=C=C1N=C2CCCCC2C1=C(C)N=C=[NH+]C1=NC2=C(O)N=C(N)N=C2N1C1C=C(O)C(=C)O1 Intermediate Fragment 
105 433.1731129521 C=C1OC(N2C([NH+]=C=NC(C)=C3C=NC4=C3CCCC4)=NC3=C(O)N=C(N)N=C32)C=C1O
106 459.1887630161 C=C1OC(N2C([NH+]=C3N=C(C)C(C4=CCCC=C4)=C(N)C3=C)=NC3=C(O)N=C(N)N=C32)C=C1O Intermediate Fragment 
107 218.1651740601 CC1=NC(=[NH2+])C(C)C2=C1C1CCCCC1N2
108 216.1495239961 C=C1C(=[NH2+])N=C(C)C2=C1NC1CCCCC21
109 214.1338739321 C=C1C(=[NH2+])N=C(C)C2=C1NC1CCCC=C21
110 210.1025738041 C=C1C(=[NH2+])N=C(C)C2=C1N=C1CC=CC=C12
111 266.0883802841 [NH3+]C1=NC(O)=C2N=CN(C3CC(O)C(=CO)O3)C2=N1
112 268.1040303481 [NH3+]C1=NC(O)=C2N=CN(C3CC(O)C(CO)O3)C2=N1
113 150.0410361681 [NH3+]C1=NC(=O)C2=NC=NC2=N1
114 283.1149293801 NC1=NC(O)=C2N=C([NH3+])N(C3CC(O)C(CO)O3)C2=N1
115 283.1149293801 NC1=NC(O)=C2N=C([NH3+])N(C(=O)CC(O)CCO)C2=N1 Intermediate Fragment 
116 461.1680275721 C=C1C(=[NH+]C2=NC3=C(O)N=C(N)N=C3N2C2C=C(O)C(=C=O)O2)N=CC2=C1NC1CCCCC21
117 460.1727786041 C=C1C(=[NH+]C2=NC3=C(O)N=CN=C3N2C2C=C(O)C(=C=O)O2)N=C(C)C2=C1NC1CCCCC21
118 477.1993277001 CC1=NC(=[NH+]C2=NC(=C=O)C(=NC(=N)N)N2C2C=C(O)C(=C=O)O2)C(C)C2=C1C1CCCCC1N2 Intermediate Fragment 
119 460.1727786041 C=C1C(=NC2=NC(C=O)=C([NH+]=CN)N2C2C=C(O)C(=C=O)O2)N=C(C)C2=C1N=C1CCCCC12
120 435.1775296361 CC1=NC(=NC2=NC(=C=O)C(=[NH2+])N2C2C=C(O)C(=C=O)O2)C(C)C2=C1C1CCCCC1N2
121 418.1509805401 C=C1C(=[NH+]C2=NC(C=O)=CN2C2C=C(O)C(=C=O)O2)N=C(C)C2=C1N=C1CCCCC12
122 390.1560659201 C=C1C(=[NH+]C2=NC=CN2C2C=C(O)C(=C=O)O2)N=C(C)C2=C1N=C1CCCCC12
123 449.2044130801 CC1=C2C(=C(C)C(N=C3N=CC(=NC(N)=[NH2+])N3C3C=C(O)C(=C=O)O3)=N1)NC1CCCCC21
124 477.1993277001 CC1=C2C(=C(C)C([NH+]=C3N=CC(=NC(N)=NC=O)N3C3C=C(O)C(=C=O)O3)=N1)NC1CCCCC21 Intermediate Fragment 
125 434.1935140481 C=C1C(=NC2=NC=C([NH+]=CN)N2C2C=C(O)C(=C=O)O2)N=C(C)C2=C1NC1CCCCC21
126 407.1826150161 CC1=C2C(=C(C)C(N=C3N=CC(=[NH2+])N3C3C=C(O)C(=C=O)O3)=N1)NC1CCCCC21
127 434.1935140481 C=C1C(=NC2=NC=C([NH+]=CN)N2CC=C(O)C(=O)C=O)N=C(C)C2=C1N=C1CCCCC12 Intermediate Fragment 
128 434.1935140481 C=C1C(=NC2=NC=C([NH+]=CN)N2C(=O)C=C(O)C#CO)N=C(C)C2=C1NC1CCCCC21 Intermediate Fragment 
129 432.1778639841 C=C1C(=NC2=NC=C([NH+]=CN)N2C2C=C(O)C(=C=O)O2)N=C(C)C2=C1N=C1CCCCC12
130 432.1778639841 C=C1C(=NC2=NC=C([NH+]=CN)N2CC=C(O)C(=O)C=O)N=C(C)C2=C1N=C1CCCC=C12 Intermediate Fragment 
131 430.1622139201 C=C1C(=NC2=NC=C([NH+]=CN)N2C2C=C(O)C(=C=O)O2)N=C(C)C2=C1N=C1CCCC=C12
132 409.1982650801 CC1=C2C3CCCCC3NC2C(C)C(N=C2N=CC(=[NH2+])N2C2C=C(O)C(=C=O)O2)=N1
133 389.1720503321 CC1=C2C(=C(C)C(N=C3N=CC(=[NH2+])N3C3C=CC(=C=O)O3)=N1)N=C1CCCCC12
134 407.1826150161 CC1=C2C(=C(C)C(N=C3N=CC(=[NH2+])N3CC=C(O)C(=O)C=O)=N1)N=C1CCCCC12 Intermediate Fragment 
135 407.1826150161 CC1=C2C(=C(C)C(N=C3N=CC(=[NH2+])N3C(=O)C=C(O)C#CO)=N1)NC1CCCCC21 Intermediate Fragment 
136 363.1564002681 CC1=C2C(=C(C)C(N=C3N=CC(=[NH2+])N3C(=O)C#CO)=N1)N=C1CCCCC12
137 333.1458355841 CC(=O)N1C(=[NH2+])C=NC1=NC1=NC(C)=C2C3=CC=CCC3=NC2=C1C
138 75.0440558841 OCC=C[OH2+]
139 405.1669649521 CC1=C2C(=C(C)C(N=C3N=CC(=[NH2+])N3C3C=C(O)C(=C=O)O3)=N1)N=C1CCCCC12
140 392.1717159841 C=C1C(=[NH+]C2=NC=CN2C2C=C(O)C(=C=O)O2)N=C(C)C2=C1NC1CCCCC21
141 475.1836776361 CC1=C2C(=C(C)C(N=C3N=CC(=NC(N)=[NH+]C=O)N3C3C=C(O)C(=C=O)O3)=N1)N=C1CCCCC12
142 477.1993277001 C=C1C(=[NH+]C2=NC(C(=O)N=C(N)N)=CN2C2C=C(O)C(=C=O)O2)N=C(C)C2=C1NC1CCCCC21 Intermediate Fragment 
143 477.1993277001 C=C1C(=[NH+]C2=NC(=C(O)N=CN)C(=N)N2C2C=C(O)C(=C=O)O2)N=C(C)C2=C1NC1CCCCC21 Intermediate Fragment 
144 433.1618795721 C=C1C(=NC2=NC(=C=O)C(=[NH2+])N2C2C=C(O)C(=C=O)O2)N=C(C)C2=C1NC1CCCCC21
145 477.1993277001 C=C1C(=[NH+]C(=N)N(C2=NC(N)=NC(O)=C2)C2C=C(O)C(=C=O)O2)N=C(C)C2=C1NC1CCCCC21 Intermediate Fragment 
146 366.1560659201 C=C1C(=NC(=[NH2+])N=C2C=C(O)C(=C=O)O2)N=C(C)C2=C1NC1CCCCC21
147 475.1836776361 C=C1C(=NC(=[NH2+])N(C2=NC(N)=NC(O)=C2)C2C=C(O)C(=C=O)O2)N=C(C)C2=C1N=C1CCCCC12
148 477.1993277001 CC1=NC(=[NH+]C(=NC2=C(O)N=C(N)N=C2)N=C2C=C(O)C(=C=O)O2)C(C)C2=C1C1CCCCC1N2 Intermediate Fragment 
149 353.1608169521 CC1=C2C(=C(C)C(N=C=[NH+]C3C=C(O)C(=C=O)O3)=N1)NC1CCCCC21
150 125.0457872001 NC1=NC(=O)C(=[NH2+])C=N1
151 127.0614372641 NC1=NC(=O)C([NH3+])C=N1
152 477.1993277001 CC1=C2C3CCCCC3NC2C(C)C([NH+]=C=NC2=C(O)N=C(N)N=C2N=C2C=C(O)C(=C=O)O2)=N1 Intermediate Fragment 
153 477.1993277001 CC1=C2C(=C(C)C([NH+]=CN(C3=NC(N)=NC(O)=C3N)C3C=C(O)C(=C=O)O3)=N1)N=C1CCCCC12 Intermediate Fragment 
154 477.1993277001 C=C1C(=[NH+]C2=NC3=C(O)N=C(N)N=C3N2CC=C(O)C(=O)C=O)N=C(C)C2=C1NC1CCCCC21 Intermediate Fragment 
155 459.1887630161 C=C1C(=[NH+]C2=NC3=C(O)N=C(N)N=C3N2CC=C(O)C#CO)N=C(C)C2=C1N=C1CCCCC12
156 421.2094984601 CC1=NC(=[NH+]C2=NC3=C(O)N=C(N)N=C3N2CC#CO)C(C)C2=C1C1CCCCC1N2
157 419.1938483961 C=C1C(=[NH+]C2=NC3=C(O)N=C(N)N=C3N2CC#CO)N=C(C)C2=C1NC1CCCCC21
158 401.1832837121 C#CCN1C([NH+]=C2N=C(C)C3=C(N=C4CCCCC43)C2=C)=NC2=C(O)N=C(N)N=C21
159 399.1676336481 C#CCN1C([NH+]=C2N=C(C)C3=C(N=C4CCCC=C43)C2=C)=NC2=C(O)N=C(N)N=C21
160 373.1519835841 C=C1C(=[NH+]C2=NC3=C(O)N=C(N)N=C3N2C)N=C(C)C2=C1N=C1CC=CC=C12
161 417.1781983321 CC1=C2C3=CCCCC3=NC2=C(C)C([NH+]=C2N=CC(=NC(N)=NC=O)N2CC#CO)=N1 Intermediate Fragment 
162 417.1781983321 C=C1C(=[NH+]C(N=CC#CO)=NC2=C(O)N=C(N)N=C2)N=C(C)C2=C1N=C1CCCCC12 Intermediate Fragment 
163 417.1781983321 C=C=C1N=C2CCCCC2C1=C(C)N=C=[NH+]C1=NC2=C(O)N=C(N)N=C2N1CC#CO Intermediate Fragment 
164 415.1625482681 C=C1C(=[NH+]C2=NC3=C(O)N=C(N)N=C3N2CC#CO)N=C(C)C2=C1N=C1CCCC=C12
165 63.0440558841 OCC[OH2+]
166 45.0334912001 C=C[OH2+]
167 393.2145838401 C=C1C(=[NH+]C2=NC3=C(O)N=C(N)N=C3N2CC)N=C(C)C2=C1NC1CCCCC21
168 391.1989337761 C=C1C(=[NH+]C2=NC3=C(O)N=C(N)N=C3N2CC)N=C(C)C2=C1N=C1CCCCC12
169 385.1519835841 C=CN1C([NH+]=C2N=C(C)C3=C(N=C4CC=CC=C43)C2=C)=NC2=C(O)N=C(N)N=C21
170 91.0389705041 OCC(=[OH+])CO
171 93.0546205681 OCC([OH2+])CO
172 371.1363335201 C=C1C(=NC2=NC3=C(O)N=C(N)N=C3N2[CH2+])N=C(C)C2=C1N=C1CC=CC=C12
173 475.1836776361 C=C1C(=[NH+]C2=NC3=C(O)N=C(N)N=C3N2CC=C(O)C(=O)C=O)N=C(C)C2=C1N=C1CCCCC12
174 477.1993277001 C=C(O)C(=C=O)OCN1C([NH+]=C2N=C(C)C3=C(NC4CCCCC34)C2=C)=NC2=C(O)N=C(N)N=C21 Intermediate Fragment 
175 89.0597059481 CC(O)C=C[OH2+]
176 477.1993277001 C=C1C(=[NH+]C2=NC3=C(O)N=C(N)N=C3N2C(C)OC(=C=O)C=O)N=C(C)C2=C1NC1CCCCC21 Intermediate Fragment 
177 401.1468982041 C=C1C(=[NH+]C2=NC3=C(O)N=C(N)N=C3N2C(C)=O)N=C(C)C2=C1N=C1CC=CC=C12
178 403.1625482681 C=C1C(=[NH+]C2=NC3=C(O)N=C(N)N=C3N2C(C)=O)N=C(C)C2=C1N=C1CCCC=C12
179 403.1625482681 CC(=O)N1C(=NC(N)=NC=O)C=NC1=[NH+]C1=NC(C)=C2C3=CC=CCC3=NC2=C1C Intermediate Fragment 
180 403.1625482681 C=C=C1N=C2CCCC=C2C1=C(C)N=C=[NH+]C1=NC2=C(O)N=C(N)N=C2N1C(C)=O Intermediate Fragment 
181 405.1781983321 C=C1C(=[NH+]C2=NC3=C(O)N=C(N)N=C3N2C(C)=O)N=C(C)C2=C1N=C1CCCCC12
182 407.1938483961 C=C1C(=[NH+]C2=NC3=C(O)N=C(N)N=C3N2C(C)=O)N=C(C)C2=C1NC1CCCCC21
183 409.2094984601 CC(=O)N1C([NH+]=C2N=C(C)C3=C(NC4CCCCC34)C2C)=NC2=C(O)N=C(N)N=C21
184 447.1887630161 C=C1C(=[NH+]C2=NC3=C(O)N=C(N)N=C3N2C(C)OC#CO)N=C(C)C2=C1N=C1CCCCC12
185 449.2044130801 C=C1C(=[NH+]C2=NC3=C(O)N=C(N)N=C3N2C(C)OC#CO)N=C(C)C2=C1NC1CCCCC21
186 477.1993277001 CC1=NC(=[NH+]C2=NC3=C(O)N=C(N)N=C3N2C(C=C=O)OC#CO)C(C)C2=C1C1CCCCC1N2 Intermediate Fragment 
187 435.1887630161 CC1=NC(=[NH+]C2=NC3=C(O)N=C(N)N=C3N2C(=O)C#CO)C(C)C2=C1C1CCCCC1N2
188 417.1781983321 C#CC(=O)N1C([NH+]=C2N=C(C)C3=C(NC4CCCCC34)C2=C)=NC2=C(O)N=C(N)N=C21
189 477.1993277001 CC1=NC(=[NH+]C2=NC3=C(O)N=C(N)N=C3N2C(=O)C=C(O)C#CO)C(C)C2=C1C1CCCCC1N2 Intermediate Fragment 
190 431.1574628881 C=C1C(=[NH+]C2=NC3=C(O)N=C(N)N=C3N2C(=O)C#CO)N=C(C)C2=C1N=C1CCCCC12
191 47.0491412641 CC[OH2+]
192 29.0385765801 C=[CH3+]
193 68.9971056921 [O+]#CC#CO
194 41.0021910721 [C+]#CO
195 71.0127557561 O=CC#C[OH2+]
196 43.0178411361 C#C[OH2+]
197 73.0284058201 OCC#C[OH2+]
198 55.0178411361 C#CC=[OH+]
199 57.0334912001 C#CC[OH2+]
200 77.0597059481 OCCC[OH2+]
201 59.0491412641 C=CC[OH2+]
202 393.1781983321 C=C1C(=[NH+]C2=NC3=C(O)N=C(N)N=C3N2C=O)N=C(C)C2=C1NC1CCCCC21
203 391.1625482681 C=C1C(=[NH+]C2=NC3=C(O)N=C(N)N=C3N2C=O)N=C(C)C2=C1N=C1CCCCC12
204 389.1468982041 C=C1C(=[NH+]C2=NC3=C(O)N=C(N)N=C3N2C=O)N=C(C)C2=C1N=C1CCCC=C12
205 389.1468982041 CC1=C2C3=CC=CCC3=NC2=C(C)C([NH+]=C2N=CC(=NC(N)=NC=O)N2C=O)=N1 Intermediate Fragment 
206 389.1468982041 C=C=C1N=C2CCCC=C2C1=C(C)N=C=[NH+]C1=NC2=C(O)N=C(N)N=C2N1C=O Intermediate Fragment 
207 387.1312481401 C=C1C(=[NH+]C2=NC3=C(O)N=C(N)N=C3N2C=O)N=C(C)C2=C1N=C1CC=CC=C12
208 87.0440558841 CC(O)C#C[OH2+]
209 69.0334912001 C=CC#C[OH2+]
210 91.0753560121 CC(O)CC[OH2+]
211 73.0647913281 C=CC(C)[OH2+]
212 73.0647913281 CCC=C[OH2+]
213 475.1836776361 C=C1C(=[NH+]C2=NC3=C(O)N=C(N)N=C3N2C(=O)C=C(O)C#CO)N=C(C)C2=C1NC1CCCCC21
214 457.1731129521 C=C1C(=[NH+]C2=NC3=C(O)N=C(N)N=C3N2CC=C(O)C#CO)N=C(C)C2=C1N=C1CCCC=C12
215 477.1993277001 CC=C1C(=C(C)C(N)=[NH+]C2=NC3=C(O)N=C(N)N=C3N2C2C=C(O)C(=C=O)O2)N=C2CCCCC12 Intermediate Fragment 
216 451.1836776361 C=C(C1=CC2CCCCC2N1)C(N)=[NH+]C1=NC2=C(O)N=C(N)N=C2N1C1C=C(O)C(=C=O)O1
217 451.1836776361 C=C(C1=CC2CCCCC2N1)C(N)=[NH+]C1=NC2=C(O)N=C(N)N=C2N1C(=O)C=C(O)C#CO Intermediate Fragment 
218 449.1680275721 C=C(C1=CC2CCCCC2=N1)C(N)=[NH+]C1=NC2=C(O)N=C(N)N=C2N1C1C=C(O)C(=C=O)O1
219 477.1993277001 C=C(C1=CC2CCCCC2N1)C(N=CC)=[NH+]C1=NC2=C(O)N=C(N)N=C2N1C1C=C(O)C(=C=O)O1 Intermediate Fragment 
220 436.1727786041 C=C(C=[NH+]C1=NC2=C(O)N=C(N)N=C2N1C1C=C(O)C(=C=O)O1)C1=CC2CCCCC2N1
221 436.1727786041 C=C(C=[NH+]C1=NC2=C(O)N=C(N)N=C2N1C(=O)C=C(O)C#CO)C1=CC2CCCCC2N1 Intermediate Fragment 
222 477.1993277001 C=CC(N=C(C)C1=CNC2CCCCC12)=[NH+]C1=NC2=C(O)N=C(N)N=C2N1C1C=C(O)C(=C=O)O1 Intermediate Fragment 
223 451.1836776361 CC(N=C=[NH+]C1=NC2=C(O)N=C(N)N=C2N1C1C=C(O)C(=C=O)O1)=C1CNC2CCCCC12
224 447.1523775081 CC(N=C=[NH+]C1=NC2=C(O)N=C(N)N=C2N1C1C=C(O)C(=C=O)O1)=C1C=NC2=C1CCCC2
225 477.1993277001 CC=C1NC2CCCCC2C1=C(C)N=C=[NH+]C1=NC2=C(O)N=C(N)N=C2N1C1C=C(O)C(=C=O)O1 Intermediate Fragment 
226 168.0807757401 C#CC1=C([CH2+]=C)C2=CC=CCC2=N1
227 449.1680275721 CC(N=C=[NH+]C1=NC2=C(O)N=C(N)N=C2N1C1C=C(O)C(=C=O)O1)=C1C=NC2CCCCC12
228 477.1993277001 C=C1C=C(C2CCCCC2N)C(C)=NC1=[NH+]C1=NC2=C(O)N=C(N)N=C2N1C1C=C(O)C(=C=O)O1 Intermediate Fragment 
229 460.1727786041 C=C1C=C(C2=CCCCC2)C(C)=NC1=[NH+]C1=NC2=C(O)N=C(N)N=C2N1C1C=C(O)C(=C=O)O1
230 477.1993277001 C=C1C(NC2CCCCC2)=CC(C)=NC1=[NH+]C1=NC2=C(O)N=C(N)N=C2N1C1C=C(O)C(=C=O)O1 Intermediate Fragment 
231 384.1414784761 CC1=NC(=[NH+]C2=NC3=C(O)N=C(N)N=C3N2C2C=C(O)C(=C=O)O2)C(C)CC1
232 477.1993277001 C=C1C(=[NH+]C2=NC3=C(O)N=C(N)N=C3N2C2C=C(O)C(=C=O)O2)N=C(C)C(C2CCCCC2)=C1N Intermediate Fragment 
233 399.1523775081 CC1=NC(=[NH+]C2=NC3=C(O)N=C(N)N=C3N2C2C=C(O)C(=C=O)O2)C(C)C(N)C1
234 397.1367274441 CC1=NC(=[NH+]C2=NC3=C(O)N=C(N)N=C3N2C2C=C(O)C(=C=O)O2)C(C)C(N)=C1
235 285.1206834561 CC1=NC(=[NH+]C2=NC3=NC(N)=NC(=O)C3=N2)C(C)C(N)=C1
236 380.1101783481 C=C1C=CC(C)=NC1=[NH+]C1=NC2=C(O)N=C(N)N=C2N1C1C=C(O)C(=C=O)O1
237 395.1210773801 C=C1C(N)=CC(C)=NC1=[NH+]C1=NC2=C(O)N=C(N)N=C2N1C1C=C(O)C(=C=O)O1
238 79.0542266441 CC=C=C=C=[CH3+] Intermediate Fragment 
239 77.0385765801 C=CC#CC#[CH2+]
240 81.0698767081 C1=CCC[CH2+]=C1
241 83.0855267721 C1=[CH2+]CCCC1
242 83.0855267721 C=C=CCC[CH4+] Intermediate Fragment 
243 475.1836776361 C=C1C(=[NH+]C2=NC3=C(O)N=C(N)N=C3N2C2C=C(O)C(=C=O)O2)N=C(C)C(C2=CCCCC2)=C1N
244 477.1993277001 C=C1C(=[NH+]C2=NC3=C(O)N=C(N)N=C3N2C2C=C(O)C(=C=O)O2)N=C(C)C2=C1NC(CCC)C2C Intermediate Fragment 
245 477.1993277001 C=C1C(=[NH+]C2=NC3=C(O)N=C(N)N=C3N2C2C=C(O)C(=C=O)O2)N=C(C)C2=C1NC(CC)C2CC Intermediate Fragment 
246 477.1993277001 C=C1C(=[NH+]C2=NC3=C(O)N=C(N)N=C3N2C2C=C(O)C(=C=O)O2)N=C(C)C2=C1NC(C)C2CCC Intermediate Fragment 
247 477.1993277001 C=C1C(=[NH+]C2=NC3=C(O)N=C(N)N=C3N2C2C=C(O)C(=C=O)O2)N=C(C)C2=C1NCC2CCCC Intermediate Fragment 
248 421.1367274441 C=C1C(=[NH+]C2=NC3=C(O)N=C(N)N=C3N2C2C=C(O)C(=C=O)O2)N=C(C)C2=C1NCC2
249 423.1523775081 CC1=NC(=[NH+]C2=NC3=C(O)N=C(N)N=C3N2C2C=C(O)C(=C=O)O2)C(C)C2=C1CCN2
250 425.1680275721 CC1=NC(=[NH+]C2=NC3=C(O)N=C(N)N=C3N2C2C=C(O)C(=C=O)O2)C(C)C2NCCC12
251 427.1836776361 CC1NC(=[NH+]C2=NC3=C(O)N=C(N)N=C3N2C2C=C(O)C(=C=O)O2)C(C)C2NCCC12
252 433.1367274441 C=C1C(=[NH+]C2=NC3=C(O)N=C(N)N=C3N2C2C=C(O)C(=C=O)O2)N=C(C)C2=C1N=CC2C
253 437.1680275721 CC1=NC(=[NH+]C2=NC3=C(O)N=C(N)N=C3N2C2C=C(O)C(=C=O)O2)C(C)C2=C1C(C)CN2
254 449.1680275721 C=C1C(=[NH+]C2=NC3=C(O)N=C(N)N=C3N2C2C=C(O)C(=C=O)O2)N=C(C)C2=C1NCC2CC
255 477.1993277001 C=C1C(=[NH+]C2=NC3=C(O)N=C(N)N=C3N2C2C=C(O)C(=C=O)O2)N=C(C)C2=C1NC(CCCC)C2 Intermediate Fragment 
