#In-silico ESI-MS/MS [M+H]+ Spectra
#PREDICTED BY CFM-ID 4.0.8
#SMILES=n1(cnc2c(c1=O)ncn2[C@H]1C[C@H]([C@H](O1)CO)O)CCCC(=O)c1cccnc1
#InChiKey=PLOWXEWWHWYDSH-BZUAXINKSA-N
energy0
137.04579 3.16 30 (2.3718)
284.11420 100.00 23 122 70 72 114 103 67 127 134 107 62 86 99 89 57 93 (70.317 1.1309 0.77344 0.55561 0.53839 0.41497 0.3206 0.18145 0.17429 0.15118 0.12655 0.096526 0.074781 0.048443 0.043774 0.0094544)
288.14550 2.26 136 (1.6924)
290.16115 2.29 137 (1.7184)
energy1
69.03349 5.35 154 (1.4046)
106.02874 15.17 45 192 (3.7945 0.18965)
120.04439 5.94 39 (1.5604)
122.06004 8.73 38 (2.2935)
135.03014 4.55 29 (1.196)
146.06004 3.97 27 (1.0415)
148.07569 21.71 26 (5.7011)
149.04579 11.30 34 (2.9686)
151.06144 18.82 35 (4.9436)
161.04579 5.69 41 (1.4936)
163.06144 16.70 42 (4.3864)
177.07709 5.81 48 (1.5255)
179.09274 6.26 49 (1.6447)
205.07200 26.15 56 (6.8671)
243.08765 8.21 112 104 (1.9519 0.20484)
253.07200 5.45 111 133 94 102 (0.82364 0.6008 0.0043646 0.0028843)
255.08765 4.34 121 110 73 95 101 (0.61172 0.46056 0.046423 0.012 0.0079334)
256.11929 5.54 69 (1.4557)
257.10330 14.52 120 109 63 96 91 (1.8437 1.5802 0.20367 0.1019 0.084867)
267.08765 8.59 119 58 100 92 (1.8903 0.21307 0.087828 0.065395)
282.09855 4.28 22 85 66 98 (1.0233 0.083565 0.0099203 0.0067079)
284.11420 100.00 23 127 107 122 114 72 70 67 134 57 103 86 93 89 62 99 (19.891 2.1355 0.94904 0.83426 0.4913 0.32999 0.30325 0.25641 0.2436 0.20019 0.19332 0.13945 0.12606 0.060818 0.057244 0.050674)
energy2
45.03349 22.61 11 (2.9735)
55.01784 12.62 284 (1.6597)
57.03349 19.31 17 (2.539)
59.04914 9.06 282 (1.191)
73.02841 6.63 253 13 (0.72588 0.14616)
78.03383 13.65 212 (1.7953)
80.04948 10.75 52 210 213 (0.53552 0.48973 0.38815)
89.05971 9.17 246 7 (1.2008 0.0044134)
106.02874 9.78 192 45 (0.6509 0.63477)
130.06513 8.21 153 (1.0799)
135.03014 20.84 29 (2.7404)
137.04579 28.28 30 (3.7191)
148.07569 7.56 26 (0.99347)
151.06144 8.33 35 (1.0952)
163.06144 9.27 42 (1.2193)
177.07709 18.96 48 (2.4936)
179.09274 15.21 49 (2.0001)
193.07200 8.00 163 (1.0514)
219.08765 6.73 187 130 (0.58961 0.29571)
231.08765 26.79 106 (3.5221)
233.10330 8.77 202 125 (1.1361 0.016614)
235.08257 9.47 164 142 (0.95866 0.28646)
256.11929 8.70 69 (1.1439)
257.10330 12.55 120 96 63 91 109 (1.4598 0.12582 0.027808 0.021554 0.015214)
258.09855 7.25 336 118 (0.94667 0.0063829)
266.10364 25.86 50 24 (3.2851 0.115)
284.11420 100.00 23 93 72 127 114 134 67 62 99 122 103 57 89 86 70 107 (4.5578 2.6839 1.0839 0.98523 0.56761 0.4857 0.48453 0.38299 0.36685 0.35702 0.26877 0.25518 0.2427 0.18425 0.15005 0.092948)
294.13494 10.87 258 (1.4288)
340.14042 11.97 299 300 263 264 (0.7444 0.51558 0.1863 0.12796)
364.14042 8.54 271 270 (0.77458 0.34846)

0 400.1615452241 O=C(CCCn1cnc2c(ncn2C2CC(O)C(CO)O2)c1=[OH+])c1cccnc1
1 382.1509805401 OC(=CC#CN1C=NC2=C(C1)N=CN2C1=CC(O)=C(C=[OH+])O1)C1CCCNC1
2 268.1192864881 [OH2+]C(=CC#CN1C=NC2=C(C1)N=CN2)C1=CC=CNC1
3 119.0702706321 OC1CCOC1C[OH2+]
4 117.0546205681 OC1C=COC1C[OH2+]
5 85.0284058201 [OH2+]C1=COC=C1
6 87.0440558841 [OH2+]C1C=COC1
7 89.0597059481 [OH2+]C1CCOC1
8 99.0440558841 CC1=C([OH2+])C=CO1
9 99.0440558841 [OH2+]CC1=CC=CO1
10 117.0546205681 C=C(O)C(=C[OH2+])OC Intermediate Fragment 
11 45.0334912001 C=C[OH2+]
12 117.0546205681 C=COC(=CO)C[OH2+] Intermediate Fragment 
13 73.0284058201 OC#CC[OH2+]
14 75.0440558841 OC=CC[OH2+]
15 91.0389705041 OC=C([OH2+])CO
16 117.0546205681 OC=C=COCC[OH2+] Intermediate Fragment 
17 57.0334912001 C#CC[OH2+]
18 117.0546205681 OC=C=C(O)CC[OH2+] Intermediate Fragment 
19 99.0440558841 C#CC(O)=CC[OH2+]
20 117.0546205681 C=C=C(O)C(O)C[OH2+] Intermediate Fragment 
21 115.0389705041 OC1=C(C[OH2+])OC=C1
22 282.0985510441 OC(=CC#CN1C=NC2=C(N=CN2)C1=[OH+])C1=CC=CNC1
23 284.1142011081 OC(=CC#CN1C=NC2=C(N=CN2)C1=[OH+])C1=CCCNC1
24 266.1036364241 [OH2+]C(=CC#CN1C=NC2=C(C1)N=CN2)C1=CC=CN=C1
25 150.0913404241 C#CC=C([OH2+])C1=CCCNC1
26 148.0756903601 C#CC=C([OH2+])C1=CC=CNC1
27 146.0600402961 C#CC=C([OH2+])C1=CC=CN=C1
28 144.0443902321 [C+]#CC=C(O)C1=CC=CN=C1
29 135.0301371361 [OH+]=C1N=CN=C2N=CN=C12
30 137.0457872001 [OH+]=C1N=CN=C2NCN=C12
31 139.0614372641 [OH+]=C1N=CN=C2NCNC12
32 134.0600402961 C#CC(=[OH+])C1=CC=CNC1
33 132.0443902321 C#CC(=[OH+])C1=CC=CN=C1
34 149.0457872001 [CH2+]N1C=NC2=C(N=CN2)C1=O
35 151.0614372641 CN1C=NC2=C(N=CN2)C1=[OH+]
36 153.0770873281 CN1C=NC2=C(NCN2)C1=[OH+]
37 124.0756903601 C=C([OH2+])C1=CC=CNC1
38 122.0600402961 C=C([OH2+])C1=CC=CN=C1
39 120.0443902321 [CH+]=C(O)C1=CC=CN=C1
40 159.0301371361 [C+]#CN1C=NC2=C(N=CN2)C1=O
41 161.0457872001 C#CN1C=NC2=C(N=CN2)C1=[OH+]
42 163.0614372641 C=CN1C=NC2=C(N=CN2)C1=[OH+]
43 110.0600402961 [OH+]=CC1C=CC=NC1
44 108.0443902321 [OH+]=CC1=CC=CN=C1
45 106.0287401681 [O+]#CC1=CC=CN=C1
46 173.0457872001 [CH2+]C#CN1C=NC2=C(N=CN2)C1=O
47 175.0614372641 CC#CN1C=NC2=C(N=CN2)C1=[OH+]
48 177.0770873281 CC=CN1C=NC2=C(N=CN2)C1=[OH+]
49 179.0927373921 CCCN1C=NC2=C(N=CN2)C1=[OH+]
50 266.1036364241 [OH+]=C1C2=C(N=CN1C#CC#CC1=CCCNC1)NC=N2
51 82.0651256761 C1=CC[NH2+]C=C1
52 80.0494756121 C1=CC=[NH+]C=C1
53 199.0250517561 O=C=[C+]C#CN1C=NC2=C(N=CN2)C1=O
54 201.0407018201 O=C=CC#CN1C=NC2=C(N=CN2)C1=[OH+]
55 203.0563518841 OC=CC#CN1C=NC2=C(N=CN2)C1=[OH+]
56 205.0720019481 OCCC#CN1C=NC2=C(N=CN2)C1=[OH+]
57 284.1142011081 CN(C#CC=C(O)C1=CC=CN=C1)C([OH2+])=C1N=CNC1=N Intermediate Fragment 
58 267.0876520121 C=[N+](C#CC=C(O)C1=CC=CN=C1)C(=O)C1=CNC=N1
59 173.0709393281 C=[NH+]C#CC=C(O)C1=CC=CN=C1
60 108.0192381041 N=C1N=CN=C1C#[O+]
61 110.0348881681 [NH2+]=C1N=CN=C1C=O
62 284.1142011081 N=CN(C#CC=C(O)C1=CC=CNC1)C(=[OH+])C1=CNC=N1 Intermediate Fragment 
63 257.1033020761 O=C([NH+]=C=C=C=C(O)C1=CCCNC1)C1=CNC=N1
64 190.0974884241 N=C=[NH+]C#CC=C(O)C1=CCCNC1
65 95.0239891361 [O+]#CC1=CNC=N1
66 282.0985510441 N#C[NH+](C#CC=C(O)C1=CC=CNC1)C(=O)C1=CNC=N1
67 284.1142011081 OC(=CC#CN(C=[OH+])C=NC1=CN=CN1)C1=CC=CNC1 Intermediate Fragment 
68 191.0815040121 O=C[NH+]=C=C=C=C(O)C1=CCCNC1
69 256.1192864881 OC(=CC#C[NH+]=C=NC1=CN=CN1)C1=CCCNC1
70 284.1142011081 OC(=CC#CN=C=NC1=C(C=[OH+])N=CN1)C1=CCCNC1 Intermediate Fragment 
71 254.1036364241 OC(=CC#C[NH+]=C=NC1=CN=CN1)C1=CC=CNC1
72 284.1142011081 C=NC1=C(C(=[OH+])N=C=C=C=C(O)C2=CCCNC2)N=CN1 Intermediate Fragment 
73 255.0876520121 O=C([NH+]=C=C=C=C(O)C1=CC=CNC1)C1=CNC=N1
74 189.0658539481 O=C[NH+]=C=C=C=C(O)C1=CC=CNC1
75 187.0502038841 O=C[NH+]=C=C=C=C(O)C1=CC=CN=C1
76 94.0399735481 C#[N+]C1=CN=CN1
77 165.1022394561 [NH+]#CC#CC(O)C1CCCNC1
78 163.0865893921 [NH+]#CC#CC(=O)C1CCCNC1
79 161.0709393281 [NH+]#CC#CC(=O)C1=CCCNC1
80 120.0192381041 C#[N+]C1=NC=NC1=C=O
81 122.0348881681 C=[NH+]C1=NC=NC1=C=O
82 124.0505382321 C=[NH+]C1NC=NC1=C=O
83 126.0661882961 C=[NH+]C1NCNC1=C=O
84 128.0818383601 C=[NH+]C1NCNC1=CO
85 282.0985510441 C=NC1=C(C(=O)[NH+]=C=C=C=C(O)C2=CC=CNC2)N=CN1
86 284.1142011081 N=C=NC1=CC(=[OH+])N(C#CC=C(O)C2=CCCNC2)C=N1 Intermediate Fragment 
87 242.0924030441 OC(=CC#CN1C=NC=CC1=[OH+])C1=CC=CNC1
88 240.0767529801 OC(=CC#CN1C=NC=CC1=[OH+])C1=CC=CN=C1
89 284.1142011081 N=C=NC1=CN=CN(C#CC=C(O)C2=CCCNC2)C1=[OH+] Intermediate Fragment 
90 238.0611029161 O=C1C=CN=CN1C#C[C+]=C(O)C1=CC=CN=C1
91 257.1033020761 [NH3+]C1=CN=CN(C#CC=C(O)C2=CC=CNC2)C1=O
92 267.0876520121 C=[NH+]C1=CN=CN(C#CC=C(O)C2=CC=CN=C2)C1=O
93 284.1142011081 C=NC1=C(N)N=CN(C#CC=C(O)C2=CC=CNC2)C1=[OH+] Intermediate Fragment 
94 253.0720019481 NC1=CC(=O)N(C#C[C+]=C(O)C2=CC=CN=C2)C=N1
95 255.0876520121 [NH3+]C1=CC(=O)N(C#CC=C(O)C2=CC=CN=C2)C=N1
96 257.1033020761 [NH3+]C1=CC(=O)N(C#CC=C(O)C2=CC=CNC2)C=N1
97 268.0829009801 NC1=C(N)C(=O)N(C#C[C+]=C(O)C2=CC=CN=C2)C=N1
98 282.0985510441 C=[NH+]C1=C(N)N=CN(C#CC=C(O)C2=CC=CN=C2)C1=O
99 284.1142011081 C=NC1=C(N)C(=[OH+])N(C#CC=C(O)C2=CC=CNC2)C=N1 Intermediate Fragment 
100 267.0876520121 C=[NH+]C1=CC(=O)N(C#CC=C(O)C2=CC=CN=C2)C=N1
101 255.0876520121 [NH3+]C1=CN=CN(C#CC=C(O)C2=CC=CN=C2)C1=O
102 253.0720019481 NC1=CN=CN(C#C[C+]=C(O)C2=CC=CN=C2)C1=O
103 284.1142011081 C=CNCC(=C)C(O)=CC#CN1C=NC2=C(N=CN2)C1=[OH+] Intermediate Fragment 
104 243.0876520121 C=C(C)C(O)=CC#CN1C=NC2=C(N=CN2)C1=[OH+]
105 241.0720019481 C=C(C)C(O)=[C+]C#CN1C=NC2=C(N=CN2)C1=O
106 231.0876520121 CCC(O)=CC#CN1C=NC2=C(N=CN2)C1=[OH+]
107 284.1142011081 C=C=C(CNC)C(O)=CC#CN1C=NC2=C(N=CN2)C1=[OH+] Intermediate Fragment 
108 268.0829009801 C=[N+]=CC(=C)C(O)=CC#CN1C=NC2=C(N=CN2)C1=O
109 257.1033020761 CC=C(C)C(O)=CC#CN1C=NC2=C(N=CN2)C1=[OH+]
110 255.0876520121 C=C=C(C)C(O)=CC#CN1C=NC2=C(N=CN2)C1=[OH+]
111 253.0720019481 C=C=C(C)C(O)=[C+]C#CN1C=NC2=C(N=CN2)C1=O
112 243.0876520121 CC=CC(O)=CC#CN1C=NC2=C(N=CN2)C1=[OH+]
113 241.0720019481 CC#CC(O)=CC#CN1C=NC2=C(N=CN2)C1=[OH+]
114 284.1142011081 CC=C=C(CN)C(O)=CC#CN1C=NC2=C(N=CN2)C1=[OH+] Intermediate Fragment 
115 242.0672509161 [NH+]#CCC(O)=CC#CN1C=NC2=C(N=CN2)C1=O
116 244.0829009801 [NH2+]=CCC(O)=CC#CN1C=NC2=C(N=CN2)C1=O
117 256.0829009801 C=C(C=[NH2+])C(O)=CC#CN1C=NC2=C(N=CN2)C1=O
118 258.0985510441 C=C(C[NH3+])C(O)=CC#CN1C=NC2=C(N=CN2)C1=O
119 267.0876520121 C=C=C=C(C)C(O)=CC#CN1C=NC2=C(N=CN2)C1=[OH+]
120 257.1033020761 CCC=CC(O)=CC#CN1C=NC2=C(N=CN2)C1=[OH+]
121 255.0876520121 CCC#CC(O)=CC#CN1C=NC2=C(N=CN2)C1=[OH+]
122 284.1142011081 CC(=C=CCN)C(O)=CC#CN1C=NC2=C(N=CN2)C1=[OH+] Intermediate Fragment 
123 225.0407018201 C#CC(O)=[C+]C#CN1C=NC2=C(N=CN2)C1=O
124 227.0563518841 C#CC(O)=CC#CN1C=NC2=C(N=CN2)C1=[OH+]
125 233.1033020761 CCC(O)CC#CN1C=NC2=C(N=CN2)C1=[OH+]
126 268.0829009801 [NH3+]C=CC#CC(O)=CC#CN1C=NC2=C(N=CN2)C1=O
127 284.1142011081 CNCC=C=CC(O)=CC#CN1C=NC2=C(N=CN2)C1=[OH+] Intermediate Fragment 
128 215.0563518841 CC(O)=[C+]C#CN1C=NC2=C(N=CN2)C1=O
129 217.0720019481 CC(O)=CC#CN1C=NC2=C(N=CN2)C1=[OH+]
130 219.0876520121 CC(O)CC#CN1C=NC2=C(N=CN2)C1=[OH+]
131 229.0720019481 C=CC(O)=CC#CN1C=NC2=C(N=CN2)C1=[OH+]
132 239.0563518841 CC#CC(O)=[C+]C#CN1C=NC2=C(N=CN2)C1=O
133 253.0720019481 C=CC#CC(O)=CC#CN1C=NC2=C(N=CN2)C1=[OH+]
134 284.1142011081 C=C=CNCCC(O)=CC#CN1C=NC2=C(N=CN2)C1=[OH+] Intermediate Fragment 
135 286.1298511721 OC(=CC#CN1C=NC2=C(N=CN2)C1=[OH+])C1CCCNC1
136 288.1455012361 OC(CC#CN1C=NC2=C(N=CN2)C1=[OH+])C1CCCNC1
137 290.1611513001 OC(CC=CN1C=NC2=C(N=CN2)C1=[OH+])C1CCCNC1
138 368.1353304761 OC1=COC(N2C=NC3=C2N=CN(C#CC=C(O)C2CCCNC2)C3=[OH+])=C1
139 370.1509805401 OC1=COC(N2C=NC3=C2N=CN(C#CCC(O)C2CCCNC2)C3=[OH+])=C1
140 372.1666306041 OC1=COC(N2C=NC3=C2N=CN(C=CCC(O)C2CCCNC2)C3=[OH+])=C1
141 382.1509805401 CC1=C(O)C=C(N2C=NC3=C2N=CN(C#CC=C(O)C2CCCNC2)C3=[OH+])O1
142 235.0825666321 CC1OC(N2C=NC3=C([OH2+])N=CN=C32)=CC1O
143 237.0982166961 CC1OC(N2C=NC3=C([OH2+])N=CN=C32)CC1O
144 261.0982166961 CCN1C=NC2=C(N=CN2C2=CC(O)=C(C)O2)C1=[OH+]
145 277.1295168241 CCCN1C=NC2=C(N=CN2C2=CC(O)C(C)O2)C1=[OH+]
146 382.1509805401 C=C(O)C(=C)OCN1C=NC2=C1N=CN(C#CC=C(O)C1=CCCNC1)C2=[OH+] Intermediate Fragment 
147 382.1509805401 CC(=O)C(O)=C=CN1C=NC2=C1N=CN(C#CC=C(O)C1CCCNC1)C2=[OH+] Intermediate Fragment 
148 308.1142011081 C#CN1C=NC2=C1N=CN(C#CC=C(O)C1=CCCNC1)C2=[OH+]
149 382.1509805401 O=CC1=CC=C(N2C=NC3=C2N=CN(C#CCC(O)C2CCCNC2)C3=[OH+])O1
150 156.1382906161 C=CCC([OH2+])C1CCCNC1
151 154.1226405521 C#CCC([OH2+])C1CCCNC1
152 152.1069904881 C#CC=C([OH2+])C1CCCNC1
153 130.0651256761 [CH2+]#CC#CC1=CC=CNC1
154 69.0334912001 C#CC=C[OH2+]
155 128.0494756121 [CH2+]#CC#CC1=CC=CN=C1
156 245.0305310601 [O+]#CC1=C(O)C=C(N2C=NC3=C(O)N=CN=C32)O1
157 247.0461811241 O=CC1=C(O)C=C(N2C=NC3=C([OH2+])N=CN=C32)O1
158 249.0618311881 OCC1=C(O)C=C(N2C=NC3=C([OH2+])N=CN=C32)O1
159 251.0774812521 OCC1OC(N2C=NC3=C([OH2+])N=CN=C32)=CC1O
160 251.0774812521 OC=C=C(OCCO)N1C=NC2=C([OH2+])N=CN=C21 Intermediate Fragment 
161 253.0931313161 OCC1OC(N2C=NC3=C([OH2+])N=CN=C32)CC1O
162 253.0931313161 OCC(O)C(O)C=CN1C=NC2=C([OH2+])N=CN=C21 Intermediate Fragment 
163 193.0720019481 OCC=CN1C=NC2=C([OH2+])N=CN=C21
164 235.0825666321 OCCC(O)C#CN1C=NC2=C([OH2+])N=CN=C21
165 253.0931313161 OCCC(O)C=C(O)N1C=NC2=C([OH2+])N=CN=C21 Intermediate Fragment 
166 253.0931313161 OCC=C(OCCO)N1C=NC2=C([OH2+])N=CN=C21 Intermediate Fragment 
167 255.1087813801 OCC1OC(N2CNC3=C([OH2+])N=CN=C32)CC1O
168 138.0913404241 C#CC(=[OH+])C1CCCNC1
169 136.0756903601 C#CC(=[OH+])C1=CCCNC1
170 263.0774812521 CN1C=NC2=C(N=CN2C2=CC(O)=C(CO)O2)C1=[OH+]
171 265.0931313161 CN1C=NC2=C(N=CN2C2=CC(O)C(CO)O2)C1=[OH+]
172 267.1087813801 CN1C=NC2=C(N=CN2C2CC(O)C(CO)O2)C1=[OH+]
173 267.1087813801 CN1C=NC2=C(N=CN2C=CC(O)C(O)CO)C1=[OH+] Intermediate Fragment 
174 267.1087813801 CN1C=NC2=C(N=CN2C(O)=CC(O)CCO)C1=[OH+] Intermediate Fragment 
175 269.1244314441 CN1C=NC2=C(NCN2C2CC(O)C(CO)O2)C1=[OH+]
176 128.1069904881 C=C([OH2+])C1CCCNC1
177 126.0913404241 C=C([OH2+])C1=CCCNC1
178 106.0651256761 [CH2+]#CC1=CC=CNC1
179 104.0494756121 [CH2+]#CC1=CC=CN=C1
180 275.0774812521 CCN1C=NC2=C(N=CN2C2=CC(O)=C(C=O)O2)C1=[OH+]
181 277.0931313161 CCN1C=NC2=C(N=CN2C2=CC(O)=C(CO)O2)C1=[OH+]
182 165.0770873281 CCN1C=NC2=C(N=CN2)C1=[OH+]
183 279.1087813801 CCN1C=NC2=C(N=CN2C2=CC(O)C(CO)O2)C1=[OH+]
184 169.1083874561 CCN1C=NC2=C(NCN2)C1[OH2+]
185 279.1087813801 CCN1C=NC2=C(N=CN2C(O)=C=C(O)CCO)C1=[OH+] Intermediate Fragment 
186 279.1087813801 CCN1C=NC2=C(N=CN2C(=C=CO)OCCO)C1=[OH+] Intermediate Fragment 
187 219.0876520121 CCN1C=NC2=C(N=CN2C#CCO)C1=[OH+]
188 114.0913404241 [OH+]=CC1CCCNC1
189 114.0913404241 CNCCCC=C=[OH+] Intermediate Fragment 
190 112.0756903601 [OH+]=C=C1CCCNC1
191 92.0494756121 [CH+]=C1C=CC=NC1
192 106.0287401681 C=C=C=C(C#[O+])C=N Intermediate Fragment 
193 287.0774812521 CC=CN1C=NC2=C(N=CN2C2=CC(O)=C(C=O)O2)C1=[OH+]
194 289.0931313161 CCCN1C=NC2=C(N=CN2C2=CC(O)=C(C=O)O2)C1=[OH+]
195 291.1087813801 CCCN1C=NC2=C(N=CN2C2=CC(O)=C(CO)O2)C1=[OH+]
196 263.1138667601 CCCN1C=NC2=C(N=CN2C2=CC(O)CO2)C1=[OH+]
197 291.1087813801 CCCN1C=NC2=C(N=CN2C(O)=C=C(O)C=CO)C1=[OH+] Intermediate Fragment 
198 293.1244314441 CCCN1C=NC2=C(N=CN2C2=CC(O)C(CO)O2)C1=[OH+]
199 183.1240375201 CCCN1C=NC2=C(NCN2)C1[OH2+]
200 293.1244314441 CCCN1C=NC2=C(N=CN2C(O)=C=C(O)CCO)C1=[OH+] Intermediate Fragment 
201 293.1244314441 CCCN1C=NC2=C(N=CN2C(=C=CO)OCCO)C1=[OH+] Intermediate Fragment 
202 233.1033020761 CCCN1C=NC2=C(N=CN2C#CCO)C1=[OH+]
203 295.1400815081 CCCN1C=NC2=C(N=CN2C2CC(O)C(CO)O2)C1=[OH+]
204 295.1400815081 CCCN1C=NC2=C(N=CN2C=CC(O)C(O)CO)C1=[OH+] Intermediate Fragment 
205 277.1295168241 CCCN1C=NC2=C(N=CN2C#CC(O)CCO)C1=[OH+]
206 295.1400815081 CCCN1C=NC2=C(N=CN2C(O)=CC(O)CCO)C1=[OH+] Intermediate Fragment 
207 295.1400815081 CCCN1C=NC2=C(N=CN2C(=CCO)OCCO)C1=[OH+] Intermediate Fragment 
208 382.1509805401 O=CC1=C(O)C=C(N2C=NC3=C2N=CN(C#CCCC2CCCNC2)C3=[OH+])O1
209 268.1192864881 [OH+]=C1C2=C(N=CN1C#CC#CC1CCCNC1)NC=N2
210 80.0494756121 C=C=C=CC=[NH2+] Intermediate Fragment 
211 53.0385765801 C=CC#[CH2+]
212 78.0338255481 C#CC#CC=[NH2+]
213 80.0494756121 C=C=C=C[NH+]=C Intermediate Fragment 
214 315.0723958721 O=CC1=C(O)C=C(N2C=NC3=C2N=CN(C#CCCO)C3=[OH+])O1
215 317.0880459361 O=CC1=C(O)C=C(N2C=NC3=C2N=CN(C=CCCO)C3=[OH+])O1
216 319.1036960001 O=CC1=C(O)C=C(N2C=NC3=C2N=CN(CCCCO)C3=[OH+])O1
217 321.1193460641 OCCCCN1C=NC2=C(N=CN2C2=CC(O)=C(CO)O2)C1=[OH+]
218 207.0876520121 OCCC=CN1C=NC2=C(N=CN2)C1=[OH+]
219 321.1193460641 OC=CC(O)=C=C(O)N1C=NC2=C1N=CN(CCCCO)C2=[OH+] Intermediate Fragment 
220 400.1615452241 CN(C#CC=C(O)C1CCCNC1)C([OH2+])=C1N=CN(C2=CC(O)=C(C=O)O2)C1=N Intermediate Fragment 
221 400.1615452241 N=CN(C#CCC(O)C1CCCNC1)C(=[OH+])C1=CN(C2=CC(O)=C(C=O)O2)C=N1 Intermediate Fragment 
222 373.1506461921 O=CC1=C(O)C=C(N2C=NC(C(=O)[NH+]=C=CCC(O)C3CCCNC3)=C2)O1
223 383.1349961281 C[NH+](C#CC=C(O)C1=CCCNC1)C(=O)C1=CN(C2=CC(O)=C(C=O)O2)C=N1
224 400.1615452241 O=CC1=C(O)C=C(N2C=NC=C2N=CN(C#CCC(O)C2CCCNC2)C=[OH+])O1 Intermediate Fragment 
225 216.1342678561 C=[NH+]C1CNCN1C1CC(O)C(CO)O1
226 214.1186177921 C=[NH+]C1=CNCN1C1CC(O)C(CO)O1
227 212.1029677281 C=[NH+]C1=CN=CN1C1CC(O)C(CO)O1
228 210.0873176641 C=[NH+]C1=CN=CN1C1=CC(O)C(CO)O1
229 208.0716676001 C=[NH+]C1=CN=CN1C1=CC(O)=C(CO)O1
230 372.1666306041 O=CC1=C(O)C=C(N2C=NC=C2N=C=[NH+]C=CCC(O)C2CCCNC2)O1
231 258.1349365521 OC(=CC#C[NH+]=C=NC1=CN=CN1)C1CCCNC1
232 370.1509805401 O=CC1=C(O)C=C(N2C=NC=C2N=C=[NH+]C#CCC(O)C2CCCNC2)O1
233 368.1353304761 O=CC1=C(O)C=C(N2C=NC=C2N=C=[NH+]C#CC=C(O)C2CCCNC2)O1
234 400.1615452241 O=CC1=C(O)C=C(N2C=NC(C=[OH+])=C2N=C=NC=CCC(O)C2CCCNC2)O1 Intermediate Fragment 
235 400.1615452241 C=NC1=C(C(=[OH+])N=C=CCC(O)C2CCCNC2)N=CN1C1=CC(O)=C(C=O)O1 Intermediate Fragment 
236 240.0978823481 C=[NH+]C1=C(C=O)N=CN1C1CC(O)C(CO)O1
237 400.1615452241 N=CN(C1=CC(=[OH+])N(C#CCC(O)C2CCCNC2)C=N1)C1=CC(O)=C(C=O)O1 Intermediate Fragment 
238 373.1506461921 O=C=C1OC(=[NH+]C2=CC(=O)N(C=CCC(O)C3CCCNC3)C=N2)C=C1O
239 244.1080531081 OC(=CC#CN1C=NC=CC1=[OH+])C1=CCCNC1
240 400.1615452241 O=CC1=C(O)C=C(N=C=NC2=CN=CN(C=CCC(O)C3CCCNC3)C2=[OH+])O1 Intermediate Fragment 
241 144.0655196001 C=[NH+]C1=CC(O)C(CO)O1
242 400.1615452241 C=NC1=C(N=C2C=C(O)C(=C=O)O2)N=CN(C=CCC(O)C2CCCNC2)C1=[OH+] Intermediate Fragment 
243 269.1033020761 C=[NH+]C1=CN=CN(C#CC=C(O)C2=CC=CNC2)C1=O
244 400.1615452241 C=C(O)C(=C=O)OCN1C=NC2=C1N=CN(C#CCC(O)C1CCCNC1)C2=[OH+] Intermediate Fragment 
245 87.0440558841 C=C(O)C=C[OH2+]
246 89.0597059481 C=C(O)CC[OH2+]
247 296.1142011081 CN1C=NC2=C1N=CN(C#CC=C(O)C1=CC=CNC1)C2=[OH+]
248 294.0985510441 CN1C=NC2=C1N=CN(C#CC=C(O)C1=CC=CN=C1)C2=[OH+]
249 400.1615452241 O=CC(=O)C(O)=C=CN1C=NC2=C1N=CN(C=CCC(O)C1CCCNC1)C2=[OH+] Intermediate Fragment 
250 105.0546205681 C=C(O)C([OH2+])CO
251 93.0546205681 OCC([OH2+])CO
252 61.0284058201 OCC=[OH+]
253 73.0284058201 CC([OH2+])=C=O
254 89.0233204401 O=CC([OH2+])=CO
255 290.1036364241 C#CN1C=NC2=C1N=CN(C#CC#CC1=CCCNC1)C2=[OH+]
256 310.1298511721 C#CN1C=NC2=C1N=CN(C#CC=C(O)C1CCCNC1)C2=[OH+]
257 312.1455012361 C#CN1C=NC2=C1N=CN(C#CCC(O)C1CCCNC1)C2=[OH+]
258 294.1349365521 C#CN1C=NC2=C1N=CN(C#CC=CC1CCCNC1)C2=[OH+]
259 314.1611513001 C#CN1C=NC2=C1N=CN(C=CCC(O)C1CCCNC1)C2=[OH+]
260 316.1768013641 C#CN1C=NC2=C1N=CN(CCCC(O)C1CCCNC1)C2=[OH+]
261 63.0440558841 OCC[OH2+]
262 338.1247657921 O=CC#CN1C=NC2=C1N=CN(C#CC=C(O)C1CCCNC1)C2=[OH+]
263 340.1404158561 O=CC#CN1C=NC2=C1N=CN(C#CCC(O)C1CCCNC1)C2=[OH+]
264 340.1404158561 CNCCCCC(O)=CC#CN1C=NC2=C(N=CN2C#CC=O)C1=[OH+] Intermediate Fragment 
265 342.1560659201 O=CC#CN1C=NC2=C1N=CN(C=CCC(O)C1CCCNC1)C2=[OH+]
266 324.1455012361 O=CC#CN1C=NC2=C1N=CN(C#CCCC1CCCNC1)C2=[OH+]
267 344.1717159841 O=CC#CN1C=NC2=C1N=CN(CCCC(O)C1CCCNC1)C2=[OH+]
268 382.1509805401 O=C=C=C(O)C#CN1C=NC2=C1N=CN(C=CCC(O)C1CCCNC1)C2=[OH+]
269 101.0597059481 C#CC(O)CC[OH2+]
270 364.1404158561 C=C=C(O)C#CN1C=NC2=C1N=CN(C#CC=C(O)C1CCCNC1)C2=[OH+]
271 364.1404158561 O=CC#CC#CN1C=NC2=C1N=CN(C#CCC(O)C1CCCNC1)C2=[OH+]
272 237.0982166961 OCCC(O)C=CN1C=NC2=C([OH2+])N=CN=C21
273 400.1615452241 OC#CC(O)=C=C(O)N1C=NC2=C1N=CN(C=CCC(O)C1CCCNC1)C2=[OH+] Intermediate Fragment 
274 91.0753560121 CC(O)CC[OH2+]
275 73.0647913281 C=C([OH2+])CC
276 310.0934656641 OCN1C=NC2=C1N=CN(C#CC=C(O)C1=CC=CN=C1)C2=[OH+]
277 312.1091157281 OCN1C=NC2=C1N=CN(C#CC=C(O)C1=CC=CNC1)C2=[OH+]
278 314.1247657921 OCN1C=NC2=C1N=CN(C#CC=C(O)C1=CCCNC1)C2=[OH+]
279 296.1142011081 OCN1C=NC2=C1N=CN(C#CC#CC1=CCCNC1)C2=[OH+]
280 316.1404158561 OCN1C=NC2=C1N=CN(C#CC=C(O)C1CCCNC1)C2=[OH+]
281 77.0597059481 OCCC[OH2+]
282 59.0491412641 CC=C[OH2+]
283 43.0178411361 C#C[OH2+]
284 55.0178411361 [CH2+]C#CO
285 71.0127557561 OC#CC=[OH+]
286 68.9971056921 [O+]#CC#CO
287 324.1091157281 C=C(O)N1C=NC2=C1N=CN(C#CC=C(O)C1=CC=CNC1)C2=[OH+]
288 326.1247657921 C=C(O)N1C=NC2=C1N=CN(C#CC=C(O)C1=CCCNC1)C2=[OH+]
289 328.1404158561 C=C(O)N1C=NC2=C1N=CN(C#CC=C(O)C1CCCNC1)C2=[OH+]
290 310.1298511721 C=C(O)N1C=NC2=C1N=CN(C#CC#CC1CCCNC1)C2=[OH+]
291 330.1560659201 C=C(O)N1C=NC2=C1N=CN(C#CCC(O)C1CCCNC1)C2=[OH+]
292 332.1717159841 C=C(O)N1C=NC2=C1N=CN(C=CCC(O)C1CCCNC1)C2=[OH+]
293 47.0491412641 CC[OH2+]
294 29.0385765801 C=[CH3+]
295 354.1196804121 O=C=C=C(O)N1C=NC2=C1N=CN(C#CC=C(O)C1CCCNC1)C2=[OH+]
296 356.1353304761 O=C=C=C(O)N1C=NC2=C1N=CN(C#CCC(O)C1CCCNC1)C2=[OH+]
297 209.0669165681 OC=CC(O)N1C=NC2=C([OH2+])N=CN=C21
298 358.1509805401 O=C=C=C(O)N1C=NC2=C1N=CN(C=CCC(O)C1CCCNC1)C2=[OH+]
299 340.1404158561 C=C=C(O)N1C=NC2=C1N=CN(C#CC=C(O)C1CCCNC1)C2=[OH+]
300 340.1404158561 O=C=C=C(O)N1C=NC2=C1N=CN(C#CCCC1CCCNC1)C2=[OH+]
301 398.1458951601 OC#CC(O)=C=C(O)N1C=NC2=C1N=CN(C#CCC(O)C1CCCNC1)C2=[OH+]
302 400.1615452241 O=C=C=C(OC#CO)N1C=NC2=C1N=CN(CCCC(O)C1CCCNC1)C2=[OH+] Intermediate Fragment 
303 354.1196804121 OC#COCN1C=NC2=C1N=CN(C#CC=C(O)C1=CCCNC1)C2=[OH+]
304 356.1353304761 OC#COCN1C=NC2=C1N=CN(C#CC=C(O)C1CCCNC1)C2=[OH+]
305 358.1509805401 OC#COCN1C=NC2=C1N=CN(C#CCC(O)C1CCCNC1)C2=[OH+]
306 370.1509805401 C=C(OC#CO)N1C=NC2=C1N=CN(C#CCC(O)C1CCCNC1)C2=[OH+]
307 372.1666306041 C=C(OC#CO)N1C=NC2=C1N=CN(C=CCC(O)C1CCCNC1)C2=[OH+]
308 400.1615452241 C=C(OC(=C=O)C=O)N1C=NC2=C1N=CN(C=CCC(O)C1CCCNC1)C2=[OH+] Intermediate Fragment 
309 400.1615452241 CCNCC(C)C(O)CC#CN1C=NC2=C(N=CN2C2=CC(O)=C(C=O)O2)C1=[OH+] Intermediate Fragment 
310 359.1349961281 CC(C)C(O)CC=CN1C=NC2=C(N=CN2C2=CC(O)=C(C=O)O2)C1=[OH+]
311 245.1033020761 CC(C)C(O)=CC#CN1C=NC2=C(N=CN2)C1=[OH+]
312 357.1193460641 CC(C)C(O)CC#CN1C=NC2=C(N=CN2C2=CC(O)=C(C=O)O2)C1=[OH+]
313 355.1036960001 CC(C)C(O)=CC#CN1C=NC2=C(N=CN2C2=CC(O)=C(C=O)O2)C1=[OH+]
314 349.1506461921 CCC(O)CCCN1C=NC2=C(N=CN2C2=CC(O)=C(CO)O2)C1=[OH+]
315 347.1349961281 CCC(O)CCCN1C=NC2=C(N=CN2C2=CC(O)=C(C=O)O2)C1=[OH+]
316 345.1193460641 CCC(O)CC=CN1C=NC2=C(N=CN2C2=CC(O)=C(C=O)O2)C1=[OH+]
317 343.1036960001 CCC(O)CC#CN1C=NC2=C(N=CN2C2=CC(O)=C(C=O)O2)C1=[OH+]
318 341.0880459361 CCC(O)=CC#CN1C=NC2=C(N=CN2C2=CC(O)=C(C=O)O2)C1=[OH+]
319 400.1615452241 CCC(CNC)C(O)CC#CN1C=NC2=C(N=CN2C2=CC(O)=C(C=O)O2)C1=[OH+] Intermediate Fragment 
320 400.1615452241 CCCC(CN)C(O)CC#CN1C=NC2=C(N=CN2C2=CC(O)=C(C=O)O2)C1=[OH+] Intermediate Fragment 
321 372.1302450961 CC(C[NH3+])C(O)CC#CN1C=NC2=C(N=CN2C2=CC(O)=C(C=O)O2)C1=O
322 383.1349961281 CCCC(C)C(O)=CC#CN1C=NC2=C(N=CN2C2=CC(O)=C(C=O)O2)C1=[OH+]
323 269.1033020761 CC=C=C(C)C(O)=CC#CN1C=NC2=C(N=CN2)C1=[OH+]
324 271.1189521401 CCC=C(C)C(O)=CC#CN1C=NC2=C(N=CN2)C1=[OH+]
325 373.1506461921 CCCCC(O)CC=CN1C=NC2=C(N=CN2C2=CC(O)=C(C=O)O2)C1=[OH+]
326 400.1615452241 CC(CCCN)C(O)CC#CN1C=NC2=C(N=CN2C2=CC(O)=C(C=O)O2)C1=[OH+] Intermediate Fragment 
327 400.1615452241 CNCCCCC(O)CC#CN1C=NC2=C(N=CN2C2=CC(O)=C(C=O)O2)C1=[OH+] Intermediate Fragment 
328 329.0880459361 CC(O)CC#CN1C=NC2=C(N=CN2C2=CC(O)=C(C=O)O2)C1=[OH+]
329 331.1036960001 CC(O)CC=CN1C=NC2=C(N=CN2C2=CC(O)=C(C=O)O2)C1=[OH+]
330 357.1193460641 CCCC(O)CC#CN1C=NC2=C(N=CN2C2=CC(O)=C(C=O)O2)C1=[OH+]
331 369.1193460641 CCCCC(O)=CC#CN1C=NC2=C(N=CN2C2=CC(O)=C(C=O)O2)C1=[OH+]
332 371.1349961281 CCCCC(O)CC#CN1C=NC2=C(N=CN2C2=CC(O)=C(C=O)O2)C1=[OH+]
333 400.1615452241 CCCNCCC(O)CC#CN1C=NC2=C(N=CN2C2=CC(O)=C(C=O)O2)C1=[OH+] Intermediate Fragment 
334 384.1302450961 CC[NH2+]CCC(O)=CC#CN1C=NC2=C(N=CN2C2=CC(O)=C(C=O)O2)C1=O
335 374.1458951601 C[NH2+]CCC(O)CC=CN1C=NC2=C(N=CN2C2=CC(O)=C(C=O)O2)C1=O
336 258.0985510441 C=[NH+]CCC(O)=CC#CN1C=NC2=C(N=CN2)C1=O
337 372.1302450961 C[NH2+]CCC(O)CC#CN1C=NC2=C(N=CN2C2=CC(O)=C(C=O)O2)C1=O
338 370.1145950321 C[NH2+]CCC(O)=CC#CN1C=NC2=C(N=CN2C2=CC(O)=C(C=O)O2)C1=O
339 358.1145950321 [NH3+]CCC(O)CC#CN1C=NC2=C(N=CN2C2=CC(O)=C(C=O)O2)C1=O
340 356.0989449681 [NH3+]CCC(O)=CC#CN1C=NC2=C(N=CN2C2=CC(O)=C(C=O)O2)C1=O
341 335.1349961281 CC(O)CCCN1C=NC2=C(N=CN2C2=CC(O)=C(CO)O2)C1=[OH+]
342 333.1193460641 CC(O)CCCN1C=NC2=C(N=CN2C2=CC(O)=C(C=O)O2)C1=[OH+]
343 68.0494756121 C#CC=[NH+]C
