#In-silico ESI-MS/MS [M+H]+ Spectra
#PREDICTED BY CFM-ID 4.0.8
#SMILES=[C@H]1(C[C@@H](O[C@@H]1CO)n1cc(c(=O)n(c1=O)c1c2c3c(c4c1CC(C(C4O)O)O)ccc1c3c(cc2)c(cc1)N)C)O
#InChiKey=QXCWXOGCMDLNSB-KMJGCBOYSA-N
energy0
426.14483 100.00 29 30 31 24 (18.079 14.705 10.651 0.019295)
427.12885 15.33 32 35 (5.9731 0.68717)
444.15540 55.56 5 34 43 71 92 104 93 52 89 98 101 69 100 103 108 (20.247 1.4468 0.96371 0.47806 0.40802 0.23203 0.20221 0.081462 0.035824 0.03279 0.0097711 0.0053378 0.00096276 0.00046662 0.00013671)
542.19218 9.26 172 166 184 170 3 175 168 185 171 16 15 222 18 228 230 229 231 (1.2518 1.2141 0.9272 0.293 0.15944 0.049155 0.048354 0.046617 0.011736 0.0072576 0.0068547 0.0051683 0.0022656 0.00052694 0.00043378 0.00031274 8.031e-05)
560.20274 9.25 0 363 275 247 315 268 203 274 365 313 356 373 368 186 200 314 270 371 372 272 390 370 (3.7648 0.048278 0.041133 0.038889 0.032198 0.027084 0.018914 0.010688 0.0094085 0.0086194 0.0067189 0.0055629 0.0048556 0.00143 0.0012458 0.00028197 0.00016376 4.3636e-05 4.3046e-05 2.8341e-05 2.195e-05 6.9204e-06)
energy1
99.04406 2.57 7 123 119 (0.61613 0.55679 0.22246)
127.05020 1.96 28 (1.0623)
414.14483 2.20 97 359 72 59 335 (1.0281 0.12268 0.03939 0.0046866 0.00078986)
426.14483 100.00 31 29 30 24 (31.46 14.358 8.392 0.017916)
427.12885 21.49 32 35 (11.544 0.11078)
442.13975 2.08 6 68 110 109 51 (0.90019 0.11286 0.070334 0.044284 0.00074322)
444.15540 17.57 5 93 92 43 71 104 34 52 69 89 98 101 103 100 108 (7.516 0.73395 0.33099 0.22389 0.20028 0.15022 0.12392 0.091532 0.072103 0.054975 0.028685 0.0019901 0.001126 0.00043502 0.00016412)
energy2
43.01784 18.11 127 (1.8094)
45.03349 29.63 121 (2.9602)
59.04914 8.52 124 (0.85166)
71.04914 11.19 281 258 259 (0.44463 0.43065 0.24242)
75.04406 24.63 194 210 (2.042 0.41907)
230.09643 16.17 144 (1.6158)
298.08626 13.12 159 158 (0.7904 0.5205)
300.10191 27.14 150 149 (1.365 1.3463)
302.11756 42.57 138 136 137 (2.8553 1.2314 0.16617)
303.10157 23.78 139 (2.3757)
314.08117 9.44 26 (0.9434)
318.11247 21.64 10 154 155 156 152 157 (1.553 0.21139 0.19748 0.0871 0.083873 0.029625)
322.14377 9.34 20 (0.93279)
354.12370 12.58 84 (1.257)
382.15500 13.75 347 (1.3735)
384.13427 15.25 76 349 96 (0.80638 0.70592 0.01129)
410.14992 9.26 190 243 (0.62251 0.30242)
426.14483 34.72 31 29 30 24 (2.1265 1.1532 0.098593 0.09069)
427.12885 19.12 32 35 (1.8959 0.014874)
428.16048 11.85 23 167 22 334 216 (0.83231 0.18754 0.086772 0.060432 0.016919)
442.13975 10.89 68 6 110 51 109 (0.81824 0.15453 0.068695 0.035456 0.011102)
444.15540 100.00 5 71 52 43 34 104 92 89 93 69 98 101 100 108 103 (4.0681 1.5445 1.3578 1.0568 0.57597 0.3525 0.24149 0.2217 0.18717 0.16767 0.071348 0.052224 0.034906 0.030776 0.028255)
454.13975 8.80 366 221 (0.4657 0.41357)
458.17105 11.32 197 211 (0.99708 0.13384)
470.17105 81.07 189 188 346 348 328 350 (5.2031 2.0079 0.2768 0.26834 0.21944 0.12438)
472.15031 40.29 254 253 202 (2.1923 1.1409 0.69275)
476.21800 23.60 193 341 (1.873 0.4853)
500.18161 11.08 361 262 322 330 333 241 337 239 329 226 238 244 (0.36826 0.33687 0.1069 0.0689 0.066794 0.060882 0.03096 0.022297 0.015537 0.014635 0.01027 0.0051201)
530.19218 12.79 317 2 269 311 360 367 310 (1.1059 0.13389 0.019534 0.0082765 0.0077351 0.001268 0.0012013)
532.20783 15.85 273 316 304 301 299 308 297 289 307 358 (1.0786 0.47706 0.01371 0.0051955 0.0038088 0.0017509 0.0017077 0.00074189 0.00052726 0.00033967)

0 560.2027413401 Cc1cn(C2CC(O)C(CO)O2)c(=O)n(-c2c3c(c4ccc5ccc([NH3+])c6ccc2c4c56)C(O)C(O)C(O)C3)c1=O
1 528.1765265921 CC1=CN(C2C=C(O)CO2)C(=O)N(C2=C3CC=C4C5=C(C=CC(=C35)C3=C(O)C(O)=C(O)C=C32)CCC4[NH3+])C1=O
2 530.1921766561 CC1=CN(C2C=C(O)CO2)C(=O)N(C2=C3CCC4C5=C(C=CC(=C35)C3=C(O)C(O)=C(O)C=C32)CCC4[NH3+])C1=O
3 542.1921766561 C=C1OC(N2C=C(C)C(=O)N(C3=C4CCC5C6=C(C=CC(=C46)C4=C(O)C(O)=C(O)C=C43)CCC5[NH3+])C2=O)C=C1O
4 446.1710472881 CC1=C(O)N(C2=C3CCC4C5=C(C=CC(=C35)C3=C(O)C(O)=C(O)C=C32)CCC4[NH3+])C(=O)N=C1
5 444.1553972241 CC1=C(O)N(C2=C3CC=C4C5=C(C=CC(=C35)C3=C(O)C(O)=C(O)C=C32)CCC4[NH3+])C(=O)N=C1
6 442.1397471601 CC1=C(O)N(C2=C3CC=C4C([NH3+])=CCC5=C4C3=C(C=C5)C3=C(O)C(O)=C(O)C=C32)C(=O)N=C1
7 99.0440558841 C=C1OC=CC1[OH2+]
8 101.0597059481 CC1OC=CC1[OH2+]
9 320.1281198561 [NH3+]C1CCC2=C3C4=C(C=C2)C2=C(C=C(O)C(=O)C2=O)C=C4CCC31
10 318.1124697921 [NH3+]C1CCC2=C3C1=CCC1=CC4=C(C(=O)C(=O)C(O)=C4)C(=C13)C=C2
11 225.0869833161 C=C1OC(N2C=C(C)C(=[OH+])NC2O)=CC1O
12 524.1816119721 C=C1OC(N2C=C(C)C(=O)N(C3=C4CC=C5C6=C(C=CC(=C46)C4=CC(O)=C(O)C=C43)CCC5[NH3+])C2=O)C=C1O
13 524.1816119721 C=C1OC(N2C=C(C)C(=O)N(C3=C4CC=C5C6=C(C=CC(=C46)C4=C(O)C(O)=CC=C43)CCC5[NH3+])C2=O)C=C1O
14 524.1816119721 C=C1C=CC(N2C=C(C)C(=O)N(C3=C4CC=C5C6=C(C=CC(=C46)C4=C(O)C(O)=C(O)C=C43)CCC5[NH3+])C2=O)O1
15 542.1921766561 C#COC(=C=CO)N1C=C(C)C(=O)N(C2=C3CCC4C([NH3+])CCC5C=CC(=C3C54)C3=C(O)C(O)=C(O)C=C32)C1=O Intermediate Fragment 
16 542.1921766561 C=C1OC(N2C=C(C)C(=O)N(C3=C(C)C(C(=O)C(O)=C=O)=C4C=CC5=C6C4=C3CCC6C([NH3+])CC5)C2=O)C=C1O Intermediate Fragment 
17 482.1710472881 C=C1OC(N2C=C(C)C(=O)N(C3=C(C)C(C=O)=C4C=CC5=C6C(=CCC3=C46)C([NH3+])=CC5)C2=O)C=C1O
18 542.1921766561 C=C1OC(N2C=C(C)C(=O)N(C3=C(C=C(O)C(O)=C=O)C=C4C=CC5=C6C4=C3CCC6C([NH3+])CC5)C2=O)C=C1O Intermediate Fragment 
19 450.2023474161 CC1=C(O)N(C2=C3CCC4C([NH3+])CCC5CCC(=C3C54)C3=C(O)C(O)=C(O)C=C32)C(=O)N=C1
20 322.1437699201 [NH3+]C1CCC2=C3C4=C(C=C2)C2=C(C=C(O)C(O)=C2O)C=C4CCC31
21 448.1866973521 CC1=C(O)N(C2=C3CCC4C([NH3+])CCC5C=CC(=C3C54)C3=C(O)C(O)=C(O)C=C32)C(=O)N=C1
22 428.1604826041 CC1=C(O)N(C2=C3CC=C4C5=C(C=CC(=C35)C3=C(O)C=C(O)C=C32)CCC4[NH3+])C(=O)N=C1
23 428.1604826041 CC1=C(O)N(C2=C3CC=C4C5=C(C=CC(=C35)C3=C(O)C(O)=CC=C32)CCC4[NH3+])C(=O)N=C1
24 426.1448325401 CC1=CN(C2=C3CC=C4C([NH3+])=CCC5=C4C3=C(C=C5)C3=C(O)C(O)=C(O)C=C32)C(=O)N=C1
25 316.0968197281 [NH3+]C1C=CC2=C3C1=CCC1=CC4=C(C(=O)C(=O)C(O)=C4)C(=C13)C=C2
26 314.0811696641 [NH2+]=C1C=CC2=C3C1=CCC1=CC4=C(C(=O)C(=O)C(O)=C4)C(=C13)C=C2
27 125.0345538201 C=C1C=NC(O)=NC1=[OH+]
28 127.0502038841 CC1C=NC(O)=NC1=[OH+]
29 426.1448325401 CC1=C(O)N(C2=C3CC=C4C([NH3+])=CCC5=C4C3=C(C=C5)C3=CC(O)=C(O)C=C32)C(=O)N=C1
30 426.1448325401 CC1=C(O)N(C2=C3CC=C4C([NH3+])=CCC5=C4C3=C(C=C5)C3=C(O)C=C(O)C=C32)C(=O)N=C1
31 426.1448325401 CC1=C(O)N(C2=C3CC=C4C([NH3+])=CCC5=C4C3=C(C=C5)C3=C(O)C(O)=CC=C32)C(=O)N=C1
32 427.1288481281 CC1=C([OH2+])N(C2=C3CC=C4C=CCC5=C4C3=C(C=C5)C3=C(O)C(O)=C(O)C=C32)C(=O)N=C1
33 428.1240970961 [NH3+]C1=CCC2=C3C1=CCC1=C(N4C(=O)N=CC=C4O)C4=CC(O)=C(O)C(O)=C4C(=C13)C=C2
34 444.1553972241 CC(=C=N)C(=O)N(C=O)C1=C2CC=C3C4=C(C=CC(=C24)C2=C1C=C(O)C(O)=C2O)CCC3[NH3+] Intermediate Fragment 
35 427.1288481281 C=C(C)C(=O)[N+](=C=O)C1=C2CC=C3C(N)=CCC4=C3C2=C(C=C4)C2=C1C=C(O)C(O)=C2O
36 417.1444981921 CC=C(O)[NH+](C=O)C1=C2CC=C3C(N)=CCC4=C3C2=C(C=C4)C2=C1C=C(O)C(O)=C2O
37 393.1444981921 NC1CCC2C=CC3=C4C(=C([NH+](C=O)C=O)C5=C3C(=O)C(=O)C(O)=C5)CCC1C42
38 391.1288481281 NC1CCC2=C3C4=C(C=C2)C2=C(C=C(O)C(=O)C2=O)C([NH+](C=O)C=O)=C4CCC31
39 363.1339335081 NC1CCC2C=CC3=C4C(=C([NH+]=C=O)C5=C3C(=O)C(=O)C(O)=C5)CCC1C42
40 361.1182834441 NC1CCC2=C3C4=C(C=C2)C2=C(C=C(O)C(=O)C2=O)C([NH+]=C=O)=C4CCC31
41 84.0443902321 CC(C#[NH+])=CO
42 416.1604826041 CC(C#[NH+])=C(O)N=C1C2=CC(O)=C(O)C(=O)C2=C2C=CC3=C4C2=C1CCC4C(N)CC3
43 444.1553972241 CC(=C=NC=O)C(=O)N=C1C2=CC(O)=C(O)C(=O)C2=C2C=CC3=C4C2=C1CCC4C([NH3+])CC3 Intermediate Fragment 
44 401.1495835721 C=C(C)C(=O)[NH+]=C1C2=CC(O)=C(O)C(=O)C2=C2C=CC3=C4C(=CCC1=C24)C(N)CC3
45 399.1339335081 C=C(C)C(=O)[NH+]=C1C2=CC(O)=C(O)C(=O)C2=C2C=CC3=C4C(=CCC1=C24)C(N)=CC3
46 397.1182834441 [CH+]=C(C)C(=O)N=C1C2=CC(O)=C(O)C(=O)C2=C2C=CC3=C4C(=CCC1=C24)C(N)=CC3
47 389.1495835721 CC=C(O)[NH+]=C1C2=CC(O)=C(O)C(=O)C2=C2C=CC3=C4C(=CCC1=C24)C(N)CC3
48 387.1339335081 CC=C(O)[NH+]=C1C2=CC(O)=C(O)C(=O)C2=C2C=CC3=C4C(=CCC1=C24)C(N)=CC3
49 385.1182834441 C=C=C(O)[NH+]=C1C2=CC(O)=C(O)C(=O)C2=C2C=CC3=C4C(=CCC1=C24)C(N)=CC3
50 383.1026333801 [CH+]=C=C(O)N=C1C2=CC(O)=C(O)C(=O)C2=C2C=CC3=C4C(=CCC1=C24)C(N)=CC3
51 442.1397471601 CC(=C=[NH+]C=O)C(=O)N=C1C2=CC(O)=C(O)C(=O)C2=C2C=CC3=C4C(=CCC1=C24)C(N)CC3
52 444.1553972241 CC(=C=NC(O)=NC1=C2CC=C3C4=C(C=CC(=C24)C2=C1C=C(O)C(O)=C2O)CCC3[NH3+])C=O Intermediate Fragment 
53 376.1291824761 NC1C=CC2=C3C1=CCC1C3=C(C=C2)C2=C(C=C(O)C(=O)C2=O)C1N=C([NH3+])O
54 384.0978823481 C#[N+]C(O)=NC1=C2CC=C3C(N)=CCC4=C3C2=C(C=C4)C2=C1C=C(O)C(=O)C2=O
55 386.1135324121 C=[NH+]C(O)=NC1=C2CC=C3C(N)=CCC4=C3C2=C(C=C4)C2=C1C=C(O)C(=O)C2=O
56 388.1291824761 C=[NH+]C(O)=NC1=C2CC=C3C4=C(C=CC(=C24)C2=C1C=C(O)C(=O)C2=O)CCC3N
57 390.1448325401 C=[NH+]C(O)=NC1=C2CCC3C4=C(C=CC(=C24)C2=C1C=C(O)C(=O)C2=O)CCC3N
58 412.1291824761 C=C=C=[NH+]C(O)=NC1=C2CC=C3C(N)=CCC4=C3C2=C(C=C4)C2=C1C=C(O)C(O)=C2O
59 414.1448325401 CC=C=[NH+]C(O)=NC1=C2CC=C3C(N)=CCC4=C3C2=C(C=C4)C2=C1C=C(O)C(O)=C2O
60 416.1604826041 CC=C=[NH+]C(O)=NC1=C2CC=C3C4=C(C=CC(=C24)C2=C1C=C(O)C(O)=C2O)CCC3N
61 329.0920686961 NC1C=CC2=C3C1=CCC1=C3C(=C3C(=O)C(=O)C(=O)C=C3C1=[NH2+])C=C2
62 331.1077187601 NC1CCC2=C3C1=CCC1=C3C(=C3C(=O)C(=O)C(=O)C=C3C1=[NH2+])C=C2
63 333.1233688241 NC1CCC2=C3C4=C(CCC31)C(=[NH2+])C1=CC(=O)C(=O)C(=O)C1=C4C=C2
64 335.1390188881 NC1CCC2C=CC3=C4C(=O)C(=O)C(=O)C=C4C(=[NH2+])C4=C3C2C1CC4
65 355.0713332521 N=C1C=CC2=C3C1=CCC1=C([NH+]=C=O)C4=C(C(=O)C(=O)C(O)=C4)C(=C13)C=C2
66 357.0869833161 NC1C=CC2=C3C1=CCC1=C([NH+]=C=O)C4=C(C(=O)C(=O)C(O)=C4)C(=C13)C=C2
67 359.1026333801 NC1CCC2=C3C1=CCC1=C([NH+]=C=O)C4=C(C(=O)C(=O)C(O)=C4)C(=C13)C=C2
68 442.1397471601 CC(=C=[NH+]C(O)=NC1=C2CC=C3C(N)=CCC4=C3C2=C(C=C4)C2=C1C=C(O)C(O)=C2O)C=O
69 444.1553972241 CC=C=NC(=O)N(C=O)C1=C2CC=C3C4=C(C=CC(=C24)C2=C1C=C(O)C(O)=C2O)CCC3[NH3+] Intermediate Fragment 
70 389.1131980641 NC1CCC2=C3C1=CCC1=C([NH+](C=O)C=O)C4=C(C(=O)C(=O)C(O)=C4)C(=C13)C=C2
71 444.1553972241 CC1=C(O)N(C2=C(C)C(C(=O)C(O)=C=O)=C3C=CC4=C5C(=CCC2=C35)C([NH3+])CC4)C(=O)N=C1 Intermediate Fragment 
72 414.1448325401 CC1=C(O)N(C2=C(C)C(C(O)=C=O)=C3C=CC4=C5C(=CCC2=C35)C([NH3+])=CC4)C(=O)N=C1
73 412.1291824761 [CH2+]C1=C(N2C(=O)N=CC(C)=C2O)C2=C3C(=C1C(O)=C=O)C=CC1=C3C(=CC2)C(N)=CC1
74 388.1655679841 CC1=C(N2C(=O)N=CC(C)C2=O)C2=C3C(=C1C=O)C=CC1=C3C(=CC2)C([NH3+])CC1
75 386.1499179201 CC1=C(N2C(=O)N=CC(C)C2=O)C2=C3C(=C1C=O)C=CC1=C3C(=CC2)C([NH3+])=CC1
76 384.1342678561 C=C1C=NC(=O)N(C2=C(C)C(C=O)=C3C=CC4=C5C(=CCC2=C35)C([NH3+])=CC4)C1=O
77 382.1186177921 C=C1C=NC(=O)N(C2=C(C)C(C#[O+])=C3C=CC4=C5C(=CCC2=C35)C(N)=CC4)C1=O
78 59.0127557561 O=C=C[OH2+]
79 61.0284058201 OC=C[OH2+]
80 63.0440558841 OCC[OH2+]
81 360.1706533641 CC1=C(N2C(=O)N=CC(C)C2=O)C2=C3C(=C1)C=CC1=C3C(=CC2)C([NH3+])CC1
82 358.1550033001 CC1=C(N2C(=O)N=CC(C)C2=O)C2=C3C(=C1)C=CC1=C3C(=CC2)C([NH3+])C=C1
83 356.1393532361 CC1=C(N2C(=O)N=CC(C)C2=O)C2=C3C(=C1)C=CC1=C3C(=CC2)C(=[NH2+])C=C1
84 354.1237031721 C=C1C=NC(=O)N(C2=C(C)C=C3C=CC4=C5C(=CCC2=C35)C(=[NH2+])C=C4)C1=O
85 352.1080531081 C=C1C=NC(=O)N(C2=C([CH2+])C=C3C=CC4=C5C(=CCC2=C35)C(=N)C=C4)C1=O
86 87.0076703761 O=C=C(O)C=[OH+]
87 89.0233204401 OC=C(O)C=[OH+]
88 91.0389705041 OC=C(O)C[OH2+]
89 444.1553972241 CC1=C(O)N(C2=C(C=C=O)C(C(O)=C=O)=C3C=CC4=C5C3=C2CCC5C([NH3+])CC4)C(=O)N=C1 Intermediate Fragment 
90 416.1604826041 CC1=C(O)N(C2=C(C)C(C(O)=C=O)=C3C=CC4=C5C(=CCC2=C35)C([NH3+])CC4)C(=O)N=C1
91 382.1186177921 [CH2+]C1=C(O)N(C2=C(C#CO)C=C3C=CC4=C5C(=CCC2=C35)C(N)=CC4)C(=O)N=C1
92 444.1553972241 CC1=C(O)N(C2=C(C=C(O)C=O)C(C=O)=C3C=CC4=C5C(=CCC2=C35)C([NH3+])CC4)C(=O)N=C1 Intermediate Fragment 
93 444.1553972241 CC1=C(O)N(C2=C(C=C(O)C(O)=C=O)C=C3C=CC4=C5C(=CCC2=C35)C([NH3+])CC4)C(=O)N=C1 Intermediate Fragment 
94 105.0546205681 C=C(O)C(O)C[OH2+]
95 338.0924030441 [CH+]=C1C=NC(=O)N(C2=CC=C3C=CC4=C5C(=CCC2=C35)C(=N)C=C4)C1=O
96 384.1342678561 CC1=C(O)N(C2=C(C#CO)C=C3C=CC4=C5C(=CCC2=C35)C([NH3+])=CC4)C(=O)N=C1
97 414.1448325401 CC1=C(O)N(C2=C(C=C(O)C=O)C=C3C=CC4=C5C(=CCC2=C35)C([NH3+])=CC4)C(=O)N=C1
98 444.1553972241 C=C(O)C(O)=C(O)C1=C2C=CC3=C4C(=CCC(=C24)C(N2C(=O)N=CC(C)=C2O)=C1)C([NH3+])=CC3 Intermediate Fragment 
99 340.1080531081 C=C1C=NC(=O)N(C2=CC=C3C=CC4=C5C(=CCC2=C35)C(=[NH2+])C=C4)C1=O
100 444.1553972241 C=C1CC=C([NH3+])C2=C1C1=C(C)C3=C(C=C(O)C(O)=C3O)C(N3C(=O)N=CC(C)=C3O)=C1C=C2 Intermediate Fragment 
101 444.1553972241 C=C([NH3+])C1=CCC2=C(N3C(=O)N=CC(C)=C3O)C3=CC(O)=C(O)C(O)=C3C3=C2C1=C(C)C=C3 Intermediate Fragment 
102 401.1131980641 C=C1C=NC(=O)N(C2=C3CC=CC4=C(C)C=CC(=C43)C3=C(O)C(O)=C(O)C=C32)C1=[OH+]
103 444.1553972241 CC=C([NH3+])C1=CCC2=C(N3C(=O)N=CC(C)=C3O)C3=CC(O)=C(O)C(O)=C3C3=C2C1=CC=C3 Intermediate Fragment 
104 444.1553972241 CC1=C(O)N(C2=C3CC=CC4=C(CC=C[NH3+])C=CC(=C43)C3=C(O)C(O)=C(O)C=C32)C(=O)N=C1 Intermediate Fragment 
105 417.1444981921 CCC1=C2C=CCC3=C(N4C(=O)N=CC(C)=C4[OH2+])C4=CC(O)=C(O)C(O)=C4C(=C23)C=C1
106 415.1288481281 C=CC1=C2C=CCC3=C(N4C(=O)N=CC(C)=C4[OH2+])C4=CC(O)=C(O)C(O)=C4C(=C23)C=C1
107 403.1288481281 CC1=C2C=CCC3=C(N4C(=O)N=CC(C)C4=[OH+])C4=CC(O)=C(O)C(O)=C4C(=C23)C=C1
108 444.1553972241 CC1=C(O)N(CC2=CC(O)=C(O)C(=O)C2=C2C=CC3=C4C(=CCC=C24)C([NH3+])=CC3)C(=O)N=C1 Intermediate Fragment 
109 442.1397471601 CC(=C=N)C(=O)N(C=O)C1=C2CC=C3C([NH3+])=CCC4=C3C2=C(C=C4)C2=C1C=C(O)C(O)=C2O Intermediate Fragment 
110 442.1397471601 CC1=C(O)N(C2=C(C)C(C(=O)C(O)=C=O)=C3C=CC4=C5C(=CCC2=C35)C([NH3+])=CC4)C(=O)N=C1 Intermediate Fragment 
111 111.0076703761 O=C1C=COC1=C=[OH+]
112 113.0233204401 OC1C=COC1=C=[OH+]
113 115.0389705041 OC1C=COC1=C[OH2+]
114 87.0440558841 [OH2+]C1C=COC1
115 115.0389705041 C=C=C(O)C(=O)C[OH2+] Intermediate Fragment 
116 115.0389705041 O=C=C=C(O)CC[OH2+] Intermediate Fragment 
117 117.0546205681 OC1C=COC1C[OH2+]
118 89.0597059481 [OH2+]C1CCOC1
119 99.0440558841 [OH2+]C=C1C=CCO1
120 117.0546205681 C=COC(=C[OH2+])CO Intermediate Fragment 
121 45.0334912001 C=C[OH2+]
122 117.0546205681 C=C=C(O)C(O)C[OH2+] Intermediate Fragment 
123 99.0440558841 C=C=C(O)C=C[OH2+]
124 59.0491412641 CC=C[OH2+]
125 57.0334912001 CC#C[OH2+]
126 117.0546205681 OC=C=C(O)CC[OH2+] Intermediate Fragment 
127 43.0178411361 C#C[OH2+]
128 89.0597059481 C=C(O)CC[OH2+]
129 117.0546205681 OC=C=COCC[OH2+] Intermediate Fragment 
130 119.0702706321 OC1CCOC1C[OH2+]
131 101.0597059481 [OH2+]CC1C=CCO1
132 119.0702706321 OCC=C(O)CC[OH2+] Intermediate Fragment 
133 101.0597059481 C=C=C(O)CC[OH2+]
134 326.1750700481 [NH3+]C1CCC2CCC3=C4C(=CC5=C3C(=O)C(O)C(O)=C5)CCC1C42
135 324.1594199841 [NH3+]C1CCC2CCC3=C4C(=CC5=C3C(=O)C(=O)C(O)=C5)CCC1C42
136 302.1175551721 [NH3+]C1=CCC2=C3C1=CCC1=CC4=C(C=C(O)C(O)=C4)C(=C13)C=C2
137 302.1175551721 [NH3+]C1=CCC2=C3C1=CCC1=CC4=C(C(O)=CC(O)=C4)C(=C13)C=C2
138 302.1175551721 [NH3+]C1=CCC2=C3C1=CCC1=CC4=C(C(O)=C(O)C=C4)C(=C13)C=C2
139 303.1015707601 OC1=CC2=C(C([OH2+])=C1O)C1=C3C(=C2)CC=C2C=CCC(=C23)C=C1
140 320.1281198561 CC1=C(C(=O)C(O)=C=O)C2=C3C(=C1)CC=C1C3=C(C=C2)CCC1[NH3+] Intermediate Fragment 
141 320.1281198561 [NH3+]C1CCC2=C3C4=C(C=C2)C(C(O)=C=O)=C(C=C=O)C=C4CCC31 Intermediate Fragment 
142 320.1281198561 [NH3+]C1CCC2=C3C1=CCC1=CC(C=C(O)C=O)=C(C=O)C(=C13)C=C2 Intermediate Fragment 
143 320.1281198561 [NH3+]C1CCC2=C3C1=CCC1=CC(C=C(O)C(O)=C=O)=CC(=C13)C=C2 Intermediate Fragment 
144 230.0964258041 [CH2+]C1=CC2=C3C(=C1)CC=C1C(=N)C=CC(=C13)C=C2
145 320.1281198561 C=C(O)C(O)=C(O)C1=CC=C2CC=C3C([NH3+])=CCC4=C3C2=C1C=C4 Intermediate Fragment 
146 320.1281198561 [NH3+]C=CCC1=C2C=CCC3=CC4=C(C(O)=C(O)C(O)=C4)C(=C32)C=C1 Intermediate Fragment 
147 293.1172208241 CCC1=C2C=CCC3=CC4=C(C([OH2+])=C(O)C(O)=C4)C(=C32)C=C1
148 291.1015707601 C=CC1=C2C=CCC3=CC4=C(C([OH2+])=C(O)C(O)=C4)C(=C32)C=C1
149 300.1019051081 [NH2+]=C1C=CC2=C3C1=CCC1=CC4=C(C=C(O)C(O)=C4)C(=C13)C=C2
150 300.1019051081 [NH3+]C1=CCC2=C3C1=CCC1=CC4=C(C(=O)C(=O)C=C4)C(=C13)C=C2
151 301.0859206961 O=C1C(=[OH+])C2=C(C=C1O)C=C1CC=C3C=CCC4=C3C1=C2C=C4
152 318.1124697921 CC1=C(C(=O)C(O)=C=O)C2=C3C(=C1)CC=C1C([NH3+])=CCC(=C13)C=C2 Intermediate Fragment 
153 258.0913404241 C=C1C=C2CC=C3C(=[NH2+])C=CC4=C3C2=C(C=C4)C1=C=O
154 318.1124697921 [NH3+]C1CCC2=C3C1=CCC1=CC(C=C=O)=C(C(O)=C=O)C(=C13)C=C2 Intermediate Fragment 
155 318.1124697921 [NH3+]C1=CCC2=C3C1=CCC1=CC(C=C(O)C=O)=C(C=O)C(=C13)C=C2 Intermediate Fragment 
156 318.1124697921 [NH3+]C1=CCC2=C3C1=CCC1=CC(C=C(O)C(O)=C=O)=CC(=C13)C=C2 Intermediate Fragment 
157 318.1124697921 C=C(O)C(=O)C(=O)C1=CC=C2CC=C3C([NH3+])=CCC4=C3C2=C1C=C4 Intermediate Fragment 
158 298.0862550441 [NH2+]=C1C=CC2=CC=C3C4=CC(=O)C(O)=CC4=CC4=C3C2=C1C=C4
159 298.0862550441 [NH2+]=C1C=CC2=C3C1=CCC1=CC4=C(C(=O)C(=O)C=C4)C(=C13)C=C2
160 299.0702706321 O=C1C(=[OH+])C2=C(C=C1O)C=C1C=CC3=CC=CC4=C3C1=C2C=C4
161 239.0662478721 CC1=CN(C2=CC(O)C(=C=[OH+])O2)C(O)NC1=O
162 243.0975480001 CC1CN(C2=CC(O)C(=C=[OH+])O2)C(O)NC1O
163 243.0975480001 CC1CN(C(O)=C=C(O)C#C[OH2+])C(O)NC1O Intermediate Fragment 
164 245.1131980641 CC1CN(C2=CC(O)C(=C[OH2+])O2)C(O)NC1O
165 247.1288481281 CC1CN(C2=CC(O)C(C[OH2+])O2)C(O)NC1O
166 542.1921766561 CC1=CN(C2C=C(O)C(=C=O)O2)C(=O)N(C2=C3CCC4C([NH3+])CCC5C=CC(=C3C54)C3=CC(O)=C(O)C=C32)C1=O
167 428.1604826041 CC1=C(O)N(C2=C3CC=C4C5=C(C=CC(=C35)C3=CC(O)=C(O)C=C32)CCC4[NH3+])C(=O)N=C1
168 542.1921766561 CC1=CN(C=C=C(O)C(=O)C=O)C(=O)N(C2=C3CCC4C([NH3+])CCC5C=CC(=C3C54)C3=CC(O)=C(O)C=C32)C1=O Intermediate Fragment 
169 454.1761326681 C#CN1C=C(C)C(=O)N(C2=C3CCC4C5=C(C=CC(=C35)C3=CC(O)=C(O)C=C32)CCC4[NH3+])C1=O
170 542.1921766561 CC1=CN(C2C=C(O)C(=C=O)O2)C(=O)N(C2=C3CCC4C([NH3+])CCC5C=CC(=C3C54)C3=C(O)C=C(O)C=C32)C1=O
171 542.1921766561 CC1=CN(C=C=C(O)C(=O)C=O)C(=O)N(C2=C3CCC4C([NH3+])CCC5C=CC(=C3C54)C3=C(O)C=C(O)C=C32)C1=O Intermediate Fragment 
172 542.1921766561 CC1=CN(C2C=C(O)C(=C=O)O2)C(=O)N(C2=C3CCC4C([NH3+])CCC5C=CC(=C3C54)C3=C(O)C(O)=CC=C32)C1=O
173 304.1332052361 [NH3+]C1CCC2=C3C4=C(C=C2)C2=C(C=CC(=O)C2=O)C=C4CCC31
174 524.1816119721 CC1=CN(C2C=C(O)C(=C=O)O2)C(=O)N(C2=C3CCC4C5=C(C=CC(=C35)C3=CC(O)=CC=C32)CCC4[NH3+])C1=O
175 542.1921766561 CC1=CN(C=C=C(O)C(=O)C=O)C(=O)N(C2=C3CCC4C([NH3+])CCC5C=CC(=C3C54)C3=C(O)C(O)=CC=C32)C1=O Intermediate Fragment 
176 454.1761326681 C#CN1C=C(C)C(=O)N(C2=C3CCC4C5=C(C=CC(=C35)C3=C(O)C(O)=CC=C32)CCC4[NH3+])C1=O
177 543.1761922441 CC1=CN(C2C=C(O)C(=C=[OH+])O2)C(=O)N(C2=C3CCC4CCCC5C=CC(=C3C54)C3=C(O)C(O)=C(O)C=C32)C1=O
178 525.1656275601 C=C1OC(N2C=C(C)C(=[OH+])N(C3=C4CC=C5CCCC6=C5C4=C(C=C6)C4=C(O)C(O)=C(O)C=C43)C2=O)C=C1O
179 429.1444981921 CC1=C([OH2+])N(C2=C3CC=C4CCCC5=C4C3=C(C=C5)C3=C(O)C(O)=C(O)C=C32)C(=O)N=C1
180 543.1761922441 CC1=CN(C=C=C(O)C(=O)C=[OH+])C(=O)N(C2=C3CCC4CCCC5C=CC(=C3C54)C3=C(O)C(O)=C(O)C=C32)C1=O Intermediate Fragment 
181 455.1601482561 C#CN1C=C(C)C(=[OH+])N(C2=C3CCC4CCCC5=C4C3=C(C=C5)C3=C(O)C(O)=C(O)C=C32)C1=O
182 543.1761922441 CC1=CN(C2C=C(O)C(=C=[OH+])O2)C(=O)N(C2=C(C)C(C(=O)C(O)=C=O)=C3C=CC4CCCC5CCC2=C3C45)C1=O Intermediate Fragment 
183 544.1714412121 [NH3+]C1CCC2C=CC3=C4C(=C(N5C(=O)C=CN(C6C=C(O)C(=C=O)O6)C5=O)C5=CC(O)=C(O)C(O)=C53)CCC1C42
184 542.1921766561 CC1=CN(C2C=CC(=C=O)O2)C(=O)N(C2=C3CCC4C([NH3+])CCC5C=CC(=C3C54)C3=C(O)C(O)=C(O)C=C32)C1=O
185 542.1921766561 CC1=CN(C2C=CC(=C=O)O2)C(=O)N(C2=C(C)C(C(=O)C(O)=C=O)=C3C=CC4CCC([NH3+])C5CCC2=C3C45)C1=O Intermediate Fragment 
186 560.2027413401 C=C(OC(=C=O)CO)N1C=C(C)C(=O)N(C2=C3CCC4C([NH3+])CCC5C=CC(=C3C54)C3=C(O)C(O)=C(O)C=C32)C1=O Intermediate Fragment 
187 468.1553972241 C#CN1C=C(C)C(=O)N(C2=C3CC=C4C5=C(C=CC(=C35)C3=C(O)C(O)=C(O)C=C32)CCC4[NH3+])C1=O
188 470.1710472881 C#CN1C=C(C)C(=O)N(C2=C3CCC4C5=C(C=CC(=C35)C3=C(O)C(O)=C(O)C=C32)CCC4[NH3+])C1=O
189 470.1710472881 C#CN1C=C(C)C(=O)N(C2=C(C)C(C(=O)C(O)=C=O)=C3C=CC4=C5C3=C2CCC5C([NH3+])CC4)C1=O Intermediate Fragment 
190 410.1499179201 C#CN1C=C(C)C(=O)N(C2=C(C)C(C=O)=C3C=CC4=C5C(=CCC2=C35)C([NH3+])=CC4)C1=O
191 472.1866973521 C#CN1C=C(C)C(=O)N(C2=C3CCC4C([NH3+])CCC5C=CC(=C3C54)C3=C(O)C(O)=C(O)C=C32)C1=O
192 474.2023474161 C#CN1C=C(C)C(=O)N(C2=C3CCC4C([NH3+])CCC5CCC(=C3C54)C3=C(O)C(O)=C(O)C=C32)C1=O
193 476.2179974801 C#CN1C=C(C)C(=O)N(C2=C3C=C(O)C(O)C(O)C3=C3CCC4CCC([NH3+])C5CCC2=C3C45)C1=O
194 75.0440558841 OCC=C[OH2+]
195 486.1659619081 C=C(O)N1C=C(C)C(=O)N(C2=C3CC=C4C5=C(C=CC(=C35)C3=C(O)C(O)=C(O)C=C32)CCC4[NH3+])C1=O
196 486.1659619081 C=C(O)N(C=O)C=C(C)C(=O)N=C1C2=CC(O)=C(O)C(=O)C2=C2C=CC3=C4C(=CCC1=C24)C([NH3+])CC3 Intermediate Fragment 
197 458.1710472881 C=C(O)[NH+]=C=C(C)C(=O)N=C1C2=CC(O)=C(O)C(=O)C2=C2C=CC3=C4C2=C1CCC4C(N)CC3
198 486.1659619081 C=C(O)N1C=C(C)C(=O)N(C2=C(C)C(C(=O)C(O)=C=O)=C3C=CC4=C5C(=CCC2=C35)C([NH3+])CC4)C1=O Intermediate Fragment 
199 488.1816119721 C=C(O)N1C=C(C)C(=O)N(C2=C3CCC4C5=C(C=CC(=C35)C3=C(O)C(O)=C(O)C=C32)CCC4[NH3+])C1=O
200 560.2027413401 C=C(O)C(=C=O)OCN1C=C(C)C(=O)N(C2=C3CCC4C([NH3+])CCC5C=CC(=C3C54)C3=C(O)C(O)=C(O)C=C32)C1=O Intermediate Fragment 
201 474.1659619081 CC1=CN(C=O)C(=O)N(C2=C3CCC4C5=C(C=CC(=C35)C3=C(O)C(O)=C(O)C=C32)CCC4[NH3+])C1=O
202 472.1503118441 CC1=CN(C=O)C(=O)N(C2=C3CC=C4C5=C(C=CC(=C35)C3=C(O)C(O)=C(O)C=C32)CCC4[NH3+])C1=O
203 560.2027413401 CC1=CN(C=C=C(O)C(=O)C=O)C(=O)N(C2=C3CCC4C([NH3+])CCC5CCC(=C3C54)C3=C(O)C(O)=C(O)C=C32)C1=O Intermediate Fragment 
204 84.9920203121 O=CC(=O)C#[O+]
205 71.0127557561 O=CC#C[OH2+]
206 71.0127557561 CC(=O)C#[O+]
207 73.0284058201 OCC#C[OH2+]
208 73.0284058201 CC(=[OH+])C=O
209 93.0546205681 OCC([OH2+])CO
210 75.0440558841 CC(=[OH+])CO
211 458.1710472881 CC1=CN(C)C(=O)N(C2=C3CC=C4C5=C(C=CC(=C35)C3=C(O)C(O)=C(O)C=C32)CCC4[NH3+])C1=O
212 456.1553972241 CC1=CN(C)C(=O)N(C2=C3CC=C4C([NH3+])=CCC5=C4C3=C(C=C5)C3=C(O)C(O)=C(O)C=C32)C1=O
213 139.0502038841 [CH2+]N1C=C(C)C(=O)N=C1O
214 438.1448325401 [CH2+]N1C=C(C)C(=O)N(C2=C3CC=C4C(N)=CCC5=C4C3=C(C=C5)C3=C(O)C(O)=CC=C32)C1=O
215 456.1553972241 CC(=CN(C)C=O)C(=O)N=C1C2=CC(O)=C(O)C(=O)C2=C2C=CC3=C4C(=CCC1=C24)C([NH3+])=CC3 Intermediate Fragment 
216 428.1604826041 C=[NH+]C=C(C)C(=O)N=C1C2=CC(O)=C(O)C(=O)C2=C2C=CC3=C4C(=CCC1=C24)C(N)CC3
217 456.1553972241 CC1=CN(C)C(=O)N(C2=C(C)C(C(=O)C(O)=C=O)=C3C=CC4=C5C(=CCC2=C35)C([NH3+])=CC4)C1=O Intermediate Fragment 
218 398.1499179201 C=C1C(N2C(=O)C(C)=CN(C)C2=O)=C2CC=C3C(=[NH2+])C=CC4=C3C2=C(C=C4)C1C=O
219 396.1342678561 C=C1C(=C=O)C2=C3C(=C1N1C(=O)C(C)=CN(C)C1=O)CC=C1C(=[NH2+])C=CC(=C13)C=C2
220 456.1553972241 CC1=CN(C)C(=O)N(C2=C(C=C(O)C(O)=C=O)C=C3C=CC4=C5C(=CCC2=C35)C([NH3+])=CC4)C1=O Intermediate Fragment 
221 454.1397471601 [CH2+]N1C=C(C)C(=O)N(C2=C3CC=C4C(N)=CCC5=C4C3=C(C=C5)C3=C(O)C(O)=C(O)C=C32)C1=O
222 542.1921766561 CC1=CN(C=C=C(O)C#CO)C(=O)N(C2=C3CCC4C([NH3+])CCC5C=CC(=C3C54)C3=C(O)C(O)=C(O)C=C32)C1=O
223 524.1816119721 C#CC(O)=C=CN1C=C(C)C(=O)N(C2=C3CCC4C5=C(C=CC(=C35)C3=C(O)C(O)=C(O)C=C32)CCC4[NH3+])C1=O
224 524.1816119721 CC1=CN(C=C=C(O)C#CO)C(=O)N(C2=C3CCC4C5=C(C=CC(=C35)C3=C(O)C(O)=CC=C32)CCC4[NH3+])C1=O
225 524.1816119721 CC1=CN(CC#CC#CO)C(=O)N(C2=C3CCC4C5=C(C=CC(=C35)C3=C(O)C(O)=C(O)C=C32)CCC4[NH3+])C1=O
226 500.1816119721 CC1=CN(CC#CO)C(=O)N(C2=C3CCC4C5=C(C=CC(=C35)C3=C(O)C(O)=C(O)C=C32)CCC4[NH3+])C1=O
227 498.1659619081 CC1=CN(CC#CO)C(=O)N(C2=C3CC=C4C5=C(C=CC(=C35)C3=C(O)C(O)=C(O)C=C32)CCC4[NH3+])C1=O
228 542.1921766561 CC(=CN=C=C=C(O)C#CO)C(=O)N(C=O)C1=C2CCC3C([NH3+])CCC4C=CC(=C2C43)C2=C1C=C(O)C(O)=C2O Intermediate Fragment 
229 542.1921766561 CC1=CN(C=C=C(O)C#CO)C(=O)N(C2=C(C)C(C(=O)C(O)=C=O)=C3C=CC4CCC([NH3+])C5CCC2=C3C45)C1=O Intermediate Fragment 
230 542.1921766561 CC1=CN(C=C=C(O)C#CO)C(=O)N(C2=C(C=C(O)C=O)C(C=O)=C3C=CC4CCC([NH3+])C5CCC2=C3C45)C1=O Intermediate Fragment 
231 542.1921766561 CC1=CN(C=C=C(O)C#CO)C(=O)N(C2=C(C=C(O)C(O)=C=O)C=C3C=CC4CCC([NH3+])C5CCC2=C3C45)C1=O Intermediate Fragment 
232 504.2129121001 CC1=CN(CC#CO)C(=O)N(C2=C3CCC4C([NH3+])CCC5CCC(=C3C54)C3=C(O)C(O)=C(O)C=C32)C1=O
233 502.1972620361 CC1=CN(CC#CO)C(=O)N(C2=C3CCC4C([NH3+])CCC5C=CC(=C3C54)C3=C(O)C(O)=C(O)C=C32)C1=O
234 484.1866973521 C#CCN1C=C(C)C(=O)N(C2=C3CCC4C5=C(C=CC(=C35)C3=C(O)C(O)=C(O)C=C32)CCC4[NH3+])C1=O
235 482.1710472881 CC1=CN(CC#CO)C(=O)N(C2=C3CC=C4C5=C(C=CC(=C35)C3=CC(O)=C(O)C=C32)CCC4[NH3+])C1=O
236 482.1710472881 CC1=CN(CC#CO)C(=O)N(C2=C3CC=C4C5=C(C=CC(=C35)C3=C(O)C(O)=CC=C32)CCC4[NH3+])C1=O
237 482.1710472881 C#CCN1C=C(C)C(=O)N(C2=C3CC=C4C5=C(C=CC(=C35)C3=C(O)C(O)=C(O)C=C32)CCC4[NH3+])C1=O
238 500.1816119721 CC(=CN=CC#CO)C(=O)N(C=O)C1=C2CCC3C4=C(C=CC(=C24)C2=C1C=C(O)C(O)=C2O)CCC3[NH3+] Intermediate Fragment 
239 500.1816119721 CC(=CN(C=O)CC#CO)C(=O)N=C1C2=CC(O)=C(O)C(=O)C2=C2C=CC3=C4C2=C1CCC4C([NH3+])CC3 Intermediate Fragment 
240 472.1866973521 CC(=C[NH+]=CC#CO)C(=O)N=C1C2=CC(O)=C(O)C(=O)C2=C2C=CC3CCC(N)C4CCC1=C2C34
241 500.1816119721 CC1=CN(CC#CO)C(=O)N(C2=C(C)C(C(=O)C(O)=C=O)=C3C=CC4=C5C3=C2CCC5C([NH3+])CC4)C1=O Intermediate Fragment 
242 440.1604826041 CC1=CN(CC#CO)C(=O)N(C2=C(C)C(C=O)=C3C=CC4=C5C(=CCC2=C35)C([NH3+])=CC4)C1=O
243 410.1499179201 CC1=CN(C=C=C=O)C(=O)N(C2=C(C)C=C3C=CC4=C5C(=CCC2=C35)C([NH3+])=CC4)C1=O
244 500.1816119721 CC1=CN(CC#CO)C(=O)N(C2=C(C=C(O)C(O)=C=O)C=C3C=CC4=C5C3=C2CCC5C([NH3+])CC4)C1=O Intermediate Fragment 
245 498.1659619081 CC1=CN(CC#CO)C(=O)N(C2=C(C)C(C(=O)C(O)=C=O)=C3C=CC4=C5C(=CCC2=C35)C([NH3+])CC4)C1=O Intermediate Fragment 
246 41.0021910721 [CH+]=C=O
247 560.2027413401 CC1=CN(C(O)=C=C(O)C#CO)C(=O)N(C2=C3CCC4C([NH3+])CCC5CCC(=C3C54)C3=C(O)C(O)=C(O)C=C32)C1=O Intermediate Fragment 
248 492.2129121001 C=C(O)N1C=C(C)C(=O)N(C2=C3CCC4C([NH3+])CCC5CCC(=C3C54)C3=C(O)C(O)=C(O)C=C32)C1=O
249 490.1972620361 C=C(O)N1C=C(C)C(=O)N(C2=C3CCC4C([NH3+])CCC5C=CC(=C3C54)C3=C(O)C(O)=C(O)C=C32)C1=O
250 484.1503118441 C=C(O)N1C=C(C)C(=O)N(C2=C3CC=C4C([NH3+])=CCC5=C4C3=C(C=C5)C3=C(O)C(O)=C(O)C=C32)C1=O
251 77.0597059481 OCCC[OH2+]
252 476.1816119721 CC1=CN(C=O)C(=O)N(C2=C3CCC4C([NH3+])CCC5C=CC(=C3C54)C3=C(O)C(O)=C(O)C=C32)C1=O
253 472.1503118441 CC(=CN(C=O)C=O)C(=O)N=C1C2=CC(O)=C(O)C(=O)C2=C2C=CC3=C4C(=CCC1=C24)C([NH3+])CC3 Intermediate Fragment 
254 472.1503118441 CC1=CN(C=O)C(=O)N(C2=C(C)C(C(=O)C(O)=C=O)=C3C=CC4=C5C(=CCC2=C35)C([NH3+])CC4)C1=O Intermediate Fragment 
255 412.1291824761 CC1=CN(C=O)C(=O)N(C2=C(C)C(C=O)=C3C=CC4=C5C(=CCC2=C35)C(=[NH2+])C=C4)C1=O
256 470.1346617801 CC1=CN(C=O)C(=O)N(C2=C3CC=C4C([NH3+])=CCC5=C4C3=C(C=C5)C3=C(O)C(O)=C(O)C=C32)C1=O
257 87.0440558841 C=C(O)C=C[OH2+]
258 71.0491412641 C=CC(=C)[OH2+]
259 71.0491412641 C#CCC[OH2+]
260 91.0753560121 CC(O)CC[OH2+]
261 518.1921766561 CC1=CN(C(=O)C#CO)C(=O)N(C2=C3CCC4C([NH3+])CCC5CCC(=C3C54)C3=C(O)C(O)=C(O)C=C32)C1=O
262 500.1816119721 C#CC(=O)N1C=C(C)C(=O)N(C2=C3CCC4C([NH3+])CCC5C=CC(=C3C54)C3=C(O)C(O)=C(O)C=C32)C1=O
263 516.1765265921 CC1=CN(C(=O)C#CO)C(=O)N(C2=C3CCC4C([NH3+])CCC5C=CC(=C3C54)C3=C(O)C(O)=C(O)C=C32)C1=O
264 498.1659619081 C#CC(=O)N1C=C(C)C(=O)N(C2=C3CCC4C5=C(C=CC(=C35)C3=C(O)C(O)=C(O)C=C32)CCC4[NH3+])C1=O
265 516.1765265921 CC(=CN(C=O)C(=O)C#CO)C(=O)N=C1C2=CC(O)=C(O)C(=O)C2=C2C=CC3CCC([NH3+])C4CCC1=C2C34 Intermediate Fragment 
266 516.1765265921 CC1=CN(C(=O)C#CO)C(=O)N(C2=C(C)C(C(=O)C(O)=C=O)=C3C=CC4CCC([NH3+])C5CCC2=C3C45)C1=O Intermediate Fragment 
267 514.1608765281 CC1=CN(C(=O)C#CO)C(=O)N(C2=C3CCC4C5=C(C=CC(=C35)C3=C(O)C(O)=C(O)C=C32)CCC4[NH3+])C1=O
268 560.2027413401 CC1=CN(C(=C=CO)OC#CO)C(=O)N(C2=C3CCC4C([NH3+])CCC5CCC(=C3C54)C3=C(O)C(O)=C(O)C=C32)C1=O Intermediate Fragment 
269 530.1921766561 C=C(OC#CO)N1C=C(C)C(=O)N(C2=C3CCC4C([NH3+])CCC5C=CC(=C3C54)C3=C(O)C(O)=C(O)C=C32)C1=O
270 560.2027413401 CC=C(O)N(C(=O)N(C)C1C=C(O)C(=C=O)O1)C1=C2CCC3C4=C(C=CC(=C24)C2=C(O)C(O)=C(O)C=C21)CCC3[NH3+] Intermediate Fragment 
271 506.1921766561 C[NH+](C(O)=NC1=C2CCC3C(N)CCC4C=CC(=C2C43)C2=C(O)C(O)=C(O)C=C12)C1C=C(O)C(=C=O)O1
272 560.2027413401 CC=CN(C(=O)N(C=O)C1=C2CCC3C([NH3+])CCC4C=CC(=C2C43)C2=C(O)C(O)=C(O)C=C21)C1C=C(O)C(=C=O)O1 Intermediate Fragment 
273 532.2078267201 CC#C[NH+](C(O)=NC1=C2CCC3C(N)CCC4CCC(=C2C43)C2=C(O)C(O)=C(O)C=C12)C1C=C(O)C(=C=O)O1
274 560.2027413401 CC(C=O)=CN(C(O)=NC1=C2CCC3C([NH3+])CCC4C=CC(=C2C43)C2=C(O)C(O)=C(O)C=C12)C1C=C(O)C(=C=O)O1 Intermediate Fragment 
275 560.2027413401 CC(=CN(C=O)C1C=C(O)C(=C=O)O1)C(=O)N=C1C2=CC(O)=C(O)C(=O)C2=C2CCC3CCC([NH3+])C4CCC1=C2C34 Intermediate Fragment 
276 407.1965337641 C=C(C)C(=O)[NH+]=C1C2=CC(O)=C(O)C(=O)C2=C2CCC3CCC(N)C4CCC1=C2C34
277 405.1808837001 C=C(C)C(=O)[NH+]=C1C2=CC(O)=C(O)C(=O)C2=C2C=CC3CCC(N)C4CCC1=C2C34
278 403.1652336361 C=C(C)C(=O)[NH+]=C1C2=CC(O)=C(O)C(=O)C2=C2C=CC3=C4C2=C1CCC4C(N)CC3
279 401.1495835721 C=C(C)C(=O)[NH+]=C1C(=C)C(C(=O)C(O)=C=O)=C2C=CC3=C4C(=CCC1=C24)C(N)CC3 Intermediate Fragment 
280 341.1284542041 C=C(C)C(=O)[NH+]=C1C(=C)C(C=O)=C2C=CC3=C4C(=CCC1=C24)C(=N)C=C3
281 71.0491412641 C=C(C)C=[OH+]
282 381.1233688241 [CH+]=C(C)C(=O)N=C1C2=CC=C(O)C(=O)C2=C2C=CC3=C4C(=CCC1=C24)C(N)=CC3
283 399.1339335081 C=C(C)C(=O)[NH+]=C1C(=C)C(C(=O)C(O)=C=O)=C2C=CC3=C4C(=CCC1=C24)C(N)=CC3 Intermediate Fragment 
284 399.1339335081 C=C(C)C(=O)[NH+]=C1C(=C=C(O)C=O)C(C=O)=C2C=CC3=C4C(=CCC1=C24)C(N)=CC3 Intermediate Fragment 
285 399.1339335081 C=C(C)C(=O)[NH+]=C1C(=C=C(O)C(O)=C=O)C=C2C=CC3=C4C(=CCC1=C24)C(N)=CC3 Intermediate Fragment 
286 160.0604342201 OC=C1OC([NH2+]CO)C=C1O
287 200.0917343481 CCC[NH+](CO)C1C=C(O)C(=C=O)O1
288 226.0709989041 CC(C=O)=C[NH+](CO)C1C=C(O)C(=C=O)O1
289 532.2078267201 CC(=C[NH+]=C1C=C(O)C(=C=O)O1)C(=O)N=C1C2=CC(O)=C(O)C(O)C2=C2CCC3CCC(N)C4CCC1=C2C34
290 514.1972620361 C=C1OC(=[NH+]C=C(C)C(=O)N=C2C3=CC(O)=C(O)C(=O)C3=C3C=CC4CCC(N)C5CCC2=C3C45)C=C1O
291 200.0917343481 CC(CO)C[NH2+]C1C=C(O)C(=C=O)O1
292 202.1073844121 CC(CO)C[NH2+]C1C=C(O)C(=CO)O1
293 514.1972620361 CC(=C[NH+]=C1C=C(O)C(=C=O)O1)C(=O)N=C1C2=CC(O)=C(O)CC2=C2C=CC3CCC(N)C4CCC1=C2C34
294 514.1972620361 CC(=C[NH+]=C1C=C(O)C(=C=O)O1)C(=O)N=C1C2=CC=C(O)C(=O)C2=C2CCC3CCC(N)C4CCC1=C2C34
295 515.1812776241 CC(=C[NH+]=C1C=C(O)C(=C=O)O1)C(=O)N=C1C2=CC(O)=C(O)C(=O)C2=C2CCC3CCCC4CCC1=C2C34
296 514.1972620361 CC(=C[NH+]=C1C=CC(=C=O)O1)C(=O)N=C1C2=CC(O)=C(O)C(=O)C2=C2CCC3CCC(N)C4CCC1=C2C34
297 532.2078267201 C=C([NH+]=C=C(C)C(=O)N=C1C2=CC(O)=C(O)C(=O)C2=C2CCC3CCC(N)C4CCC1=C2C34)OC(=C=O)CO Intermediate Fragment 
298 442.1761326681 C#C[NH+]=C=C(C)C(=O)N=C1C2=CC(O)=C(O)C(=O)C2=C2C=CC3CCC(N)C4CCC1=C2C34
299 532.2078267201 C=C(O)C(=C=O)OC=[NH+]C=C(C)C(=O)N=C1C2=CC(O)=C(O)C(=O)C2=C2CCC3CCC(N)C4CCC1=C2C34 Intermediate Fragment 
300 446.1710472881 CC(=C[NH+]=C=O)C(=O)N=C1C2=CC(O)=C(O)C(=O)C2=C2C=CC3CCC(N)C4CCC1=C2C34
301 532.2078267201 CC(=C[NH+]=C=C=C(O)C(=O)C=O)C(=O)N=C1C2=CC(O)=C(O)C(O)C2=C2CCC3CCC(N)C4CCC1=C2C34 Intermediate Fragment 
302 444.1917827321 C#C[NH+]=C=C(C)C(=O)N=C1C2=CC(O)=C(O)C(=O)C2=C2CCC3CCC(N)C4CCC1=C2C34
303 514.1972620361 CC(=C[NH+]=C=C=C(O)C#CO)C(=O)N=C1C2=CC(O)=C(O)C(=O)C2=C2CCC3CCC(N)C4CCC1=C2C34
304 532.2078267201 CC(=C=[NH+]C(O)=C=C(O)C#CO)C(=O)N=C1C2=CC(O)=C(O)C(O)C2=C2CCC3CCC(N)C4CCC1=C2C34 Intermediate Fragment 
305 460.1866973521 C=C(O)[NH+]=C=C(C)C(=O)N=C1C2=CC(O)=C(O)C(=O)C2=C2C=CC3CCC(N)C4CCC1=C2C34
306 488.1816119721 CC(=C=[NH+]C(=O)C#CO)C(=O)N=C1C2=CC(O)=C(O)C(=O)C2=C2CCC3CCC(N)C4CCC1=C2C34
307 532.2078267201 CC(=C=[NH+]C(=C=CO)OC#CO)C(=O)N=C1C2=CC(O)=C(O)C(O)C2=C2CCC3CCC(N)C4CCC1=C2C34 Intermediate Fragment 
308 532.2078267201 C=C1C(=NC(=O)C(C)=C[NH+]=C2C=C(O)C(=C=O)O2)C2=C3C(=C1C(=O)C(O)=CO)CCC1CCC(N)C(CC2)C31 Intermediate Fragment 
309 472.1866973521 C=C1C(=NC(=O)C(C)=C[NH+]=C2C=C(O)C(=C=O)O2)C2=C3C(=C1C=O)C=CC1CCC(N)C(CC2)C31
310 530.1921766561 CC(=C[NH+]=C1C=C(O)C(=C=O)O1)C(=O)N=C1C2=CC(O)=C(O)C(=O)C2=C2CCC3CCC(N)C4CCC1=C2C34
311 530.1921766561 CC(=C[NH+]=C=C=C(O)C(=O)C=O)C(=O)N=C1C2=CC(O)=C(O)C(=O)C2=C2CCC3CCC(N)C4CCC1=C2C34 Intermediate Fragment 
312 528.1765265921 CC(=C[NH+]=C1C=C(O)C(=C=O)O1)C(=O)N=C1C2=CC(O)=C(O)C(=O)C2=C2C=CC3CCC(N)C4CCC1=C2C34
313 560.2027413401 CC(=CN=C1C=C(O)C(=C=O)O1)C(=O)N(C=O)C1=C2CCC3C([NH3+])CCC4CCC(=C2C43)C2=C(O)C(O)=C(O)C=C21 Intermediate Fragment 
314 560.2027413401 C=C(C)C(=O)N(C(=O)N=C1C=C(O)C(=C=O)O1)C1=C2CCC3C([NH3+])CCC4CCC(=C2C43)C2=C(O)C(O)=C(O)C=C21 Intermediate Fragment 
315 560.2027413401 CC1=CN(C2C=C(O)C(=C=O)O2)C(=O)N(C2=C(C)C(C(=O)C(O)=C=O)=C3CCC4CCC([NH3+])C5CCC2=C3C45)C1=O Intermediate Fragment 
316 532.2078267201 CC1=CN(C2C=C(O)C(=C=O)O2)C(=O)N(C2=C(C)C(C(O)=C=O)=C3CCC4CCC([NH3+])C5CCC2=C3C45)C1=O
317 530.1921766561 CC1=CN(C2C=C(O)C(=C=O)O2)C(=O)N(C2=C(C)C(C(O)=C=O)=C3C=CC4CCC([NH3+])C5CCC2=C3C45)C1=O
318 504.2129121001 CC1=CN(C2C=C(O)C(=C=O)O2)C(=O)N(C2=C(C)C(C=O)=C3CCC4CCC([NH3+])C5CCC2=C3C45)C1=O
319 502.1972620361 CC1=CN(C2C=C(O)C(=C=O)O2)C(=O)N(C2=C(C)C(C=O)=C3C=CC4CCC([NH3+])C5CCC2=C3C45)C1=O
320 484.1866973521 CC1=CN(C2C=C(O)C(=C=O)O2)C(=O)N(C2=C(C)C(C)=C3C=CC4=C5C(=CCC2=C35)C([NH3+])CC4)C1=O
321 502.1972620361 CC1=CN(C(O)=C=C(O)C#CO)C(=O)N(C2=C(C)C(C=O)=C3C=CC4CCC([NH3+])C5CCC2=C3C45)C1=O Intermediate Fragment 
322 500.1816119721 CC1=CN(C2C=C(O)C(=C=O)O2)C(=O)N(C2=C(C)C(C=O)=C3C=CC4=C5C3=C2CCC5C([NH3+])CC4)C1=O
323 390.1812180481 CC1=C(N2C(=O)N=CC(C)C2=O)C2=C3C(=C1C=O)C=CC1=C3C(CC2)C([NH3+])CC1
324 260.1069904881 C=C1C=C2CC=C3C(=[NH2+])C=CC4=C3C2=C(C=C4)C1C=O
325 256.0756903601 [CH+]=C1C=C2CC=C3C(=N)C=CC4=C3C2=C(C=C4)C1=C=O
326 482.1710472881 CC1=CN(C2C=C(O)C(=C=O)O2)C(=O)N(C2=C(C)C(C)=C3C=CC4=C5C(=CCC2=C35)C([NH3+])=CC4)C1=O
327 472.1866973521 CC1=CN(C2C=C(O)C(=C=O)O2)C(=O)N(C2=C(C)C=C3C=CC4=C5C3=C2CCC5C([NH3+])CC4)C1=O
328 470.1710472881 CC1=CN(C2C=C(O)C(=C=O)O2)C(=O)N(C2=C(C)C=C3C=CC4=C5C(=CCC2=C35)C([NH3+])CC4)C1=O
329 500.1816119721 C=C(OC(=C=O)CO)N1C=C(C)C(=O)N(C2=C(C)C(C=O)=C3C=CC4=C5C(=CCC2=C35)C([NH3+])CC4)C1=O Intermediate Fragment 
330 500.1816119721 CC1=CN(C=C=C(O)C(=O)C=O)C(=O)N(C2=C(C)C(C=O)=C3C=CC4=C5C3=C2CCC5C([NH3+])CC4)C1=O Intermediate Fragment 
331 412.1655679841 C#CN1C=C(C)C(=O)N(C2=C(C)C(C=O)=C3C=CC4=C5C(=CCC2=C35)C([NH3+])CC4)C1=O
332 482.1710472881 CC1=CN(C=C=C(O)C#CO)C(=O)N(C2=C(C)C(C=O)=C3C=CC4=C5C(=CCC2=C35)C([NH3+])CC4)C1=O
333 500.1816119721 CC1=CN(C(O)=C=C(O)C#CO)C(=O)N(C2=C(C)C(C=O)=C3C=CC4=C5C3=C2CCC5C([NH3+])CC4)C1=O Intermediate Fragment 
334 428.1604826041 C=C(O)N1C=C(C)C(=O)N(C2=C(C)C(C=O)=C3C=CC4=C5C(=CCC2=C35)C([NH3+])C=C4)C1=O
335 414.1448325401 CC1=CN(C=O)C(=O)N(C2=C(C)C(C=O)=C3C=CC4=C5C(=CCC2=C35)C([NH3+])C=C4)C1=O
336 456.1553972241 CC1=CN(C(=O)C#CO)C(=O)N(C2=C(C)C(C=O)=C3C=CC4=C5C(=CCC2=C35)C([NH3+])CC4)C1=O
337 500.1816119721 C=C1C(=NC(=O)C(C)=CN(C=O)C2C=C(O)C(=C=O)O2)C2=C3C(=C1C=O)C=CC1=C3C(CC2)C([NH3+])CC1 Intermediate Fragment 
338 339.1128041401 C=C(C)C(=O)[NH+]=C1C(=C)C(=C=O)C2=CC=C3C=CC(=N)C4=C3C2=C1C=C4
339 498.1659619081 CC1=CN(C2C=C(O)C(=C=O)O2)C(=O)N(C2=C(C)C(C=O)=C3C=CC4=C5C(=CCC2=C35)C([NH3+])CC4)C1=O
340 480.1553972241 [CH2+]C1=C(N2C(=O)C(C)=CN(C3C=C(O)C(=C=O)O3)C2=O)C2=C3C(=C1C)C=CC1=C3C(=CC2)C(N)=CC1
341 476.2179974801 CC1=CN(C2C=C(O)C(=C=O)O2)C(=O)N(C2=C(C)C=C3CCC4CCC([NH3+])C5CCC2=C3C45)C1=O
342 474.2023474161 CC1=CN(C2C=C(O)C(=C=O)O2)C(=O)N(C2=C(C)C=C3C=CC4CCC([NH3+])C5CCC2=C3C45)C1=O
343 454.1761326681 C=C1OC(N2C=C(C)C(=O)N(C3=C(C)C=C4C=CC5=C6C(=CCC3=C46)C([NH3+])=CC5)C2=O)C=C1O
344 472.1866973521 CC1=CN(C(O)=C=C(O)C#CO)C(=O)N(C2=C(C)C=C3C=CC4=C5C3=C2CCC5C([NH3+])CC4)C1=O Intermediate Fragment 
345 452.1604826041 [CH+]=C1OC(N2C=C(C)C(=O)N(C3=C(C)C=C4C=CC5=C6C(=CCC3=C46)C(N)=CC5)C2=O)C=C1O
346 470.1710472881 CC1=CN(C=C=C(O)C(=O)C=O)C(=O)N(C2=C(C)C=C3C=CC4=C5C(=CCC2=C35)C([NH3+])CC4)C1=O Intermediate Fragment 
347 382.1550033001 C#CN1C=C(C)C(=O)N(C2=C(C)C=C3C=CC4=C5C(=CCC2=C35)C([NH3+])C=C4)C1=O
348 470.1710472881 CC1=CN(C(O)=C=C(O)C#CO)C(=O)N(C2=C(C)C=C3C=CC4=C5C(=CCC2=C35)C([NH3+])CC4)C1=O Intermediate Fragment 
349 384.1342678561 CC1=CN(C=O)C(=O)N(C2=C(C)C=C3C=CC4=C5C(=CCC2=C35)C(=[NH2+])C=C4)C1=O
350 470.1710472881 C=C1C=C2C=CC3=C4C(=CCC(=C24)C1=NC(=O)C(C)=CN(C=O)C1C=C(O)C(=C=O)O1)C([NH3+])CC3 Intermediate Fragment 
351 442.1761326681 C=C1C=C2C=CC3=C4C2=C(CCC4C(N)CC3)C1=NC(=O)C(C)=C[NH+]=C1C=C(O)C(=C=O)O1
352 468.1553972241 CC1=CN(C2C=C(O)C(=C=O)O2)C(=O)N(C2=C(C)C=C3C=CC4=C5C(=CCC2=C35)C([NH3+])=CC4)C1=O
353 450.1448325401 [CH+]=C1OC(N2C=C(C)C(=O)N(C3=C(C)C=C4C=CC5=C6C(=CCC3=C46)C(N)=CC5)C2=O)=CC1=O
354 468.1553972241 CC1=CN(C=C=C(O)C(=O)C=O)C(=O)N(C2=C(C)C=C3C=CC4=C5C(=CCC2=C35)C([NH3+])=CC4)C1=O Intermediate Fragment 
355 468.1553972241 C=C1C=C2C=CC3=C4C(=CCC(=C24)C1=NC(=O)C(C)=CN(C=O)C1C=C(O)C(=C=O)O1)C([NH3+])=CC3 Intermediate Fragment 
356 560.2027413401 CC1=CN(C2C=C(O)C(=C=O)O2)C(=O)N(C2=C(C=CO)C(C(O)=C=O)=C3CCC4CCC([NH3+])C5CCC2=C3C45)C1=O Intermediate Fragment 
357 528.1765265921 CC1=CN(C2C=C(O)C(=C=O)O2)C(=O)N(C2=C(C)C(C(O)=C=O)=C3C=CC4=C5C3=C2CCC5C([NH3+])CC4)C1=O
358 532.2078267201 CC1=CN(C2C=C(O)C(=C=O)O2)C(=O)N(C2=C(C#CO)C(CO)=C3CCC4CCC([NH3+])C5CCC2=C3C45)C1=O
359 414.1448325401 CC1=C(O)N(C2=C(C#CO)C(C=O)=C3C=CC4=C5C(=CCC2=C35)C([NH3+])CC4)C(=O)N=C1
360 530.1921766561 CC1=CN(C2C=C(O)C(=C=O)O2)C(=O)N(C2=C(C#CO)C(C=O)=C3CCC4CCC([NH3+])C5CCC2=C3C45)C1=O
361 500.1816119721 CC1=CN(C2C=C(O)C(=C=O)O2)C(=O)N(C2=C(C#CO)C=C3C=CC4CCC([NH3+])C5CCC2=C3C45)C1=O
362 498.1659619081 CC1=CN(C2C=C(O)C(=C=O)O2)C(=O)N(C2=C(C#CO)C=C3C=CC4=C5C3=C2CCC5C([NH3+])CC4)C1=O
363 560.2027413401 CC1=CN(C2C=C(O)C(=C=O)O2)C(=O)N(C2=C(C=C(O)C=O)C(C=O)=C3CCC4CCC([NH3+])C5CCC2=C3C45)C1=O Intermediate Fragment 
364 484.1503118441 CC1=CN(C2C=C(O)C(=C=O)O2)C(=O)N(C2=CC(C=O)=C3C=CC4=C5C(=CCC2=C35)C([NH3+])CC4)C1=O
365 560.2027413401 CC1=CN(C2C=C(O)C(=C=O)O2)C(=O)N(C2=C(C=C(O)C(O)=C=O)C=C3CCC4CCC([NH3+])C5CCC2=C3C45)C1=O Intermediate Fragment 
366 454.1397471601 CC1=CN(C2C=C(O)C(=C=O)O2)C(=O)N(C2=CC=C3C=CC4=C5C(=CCC2=C35)C([NH3+])=CC4)C1=O
367 530.1921766561 CC1=CN(C2C=C(O)C(=C=O)O2)C(=O)N(C2=C(C=C(O)C=O)C=C3C=CC4CCC([NH3+])C5CCC2=C3C45)C1=O
368 560.2027413401 C=C(O)C(O)=C(O)C1=C2C=CC3CCC([NH3+])C4CCC(=C2C34)C(N2C(=O)C(C)=CN(C3C=C(O)C(=C=O)O3)C2=O)=C1 Intermediate Fragment 
369 456.1553972241 CC1=CN(C2C=C(O)C(=C=O)O2)C(=O)N(C2=CC=C3C=CC4=C5C(=CCC2=C35)C([NH3+])CC4)C1=O
370 560.2027413401 CCC1=C(N2C(=O)C(C)=CN(C3C=C(O)C(=C=O)O3)C2=O)C2=C(C(O)=C(O)C(O)=C2)C2=C1C1CC([NH3+])CCC1C=C2 Intermediate Fragment 
371 560.2027413401 CCC1C=CC2=C3C(=C(N4C(=O)C(C)=CN(C5C=C(O)C(=C=O)O5)C4=O)C4=CC(O)=C(O)C(O)=C42)CCC(C[NH3+])C31 Intermediate Fragment 
372 560.2027413401 CCC([NH3+])C1CCC2=C(N3C(=O)C(C)=CN(C4C=C(O)C(=C=O)O4)C3=O)C3=CC(O)=C(O)C(O)=C3C3=C2C1CC=C3 Intermediate Fragment 
373 560.2027413401 CC1=CN(C2C=C(O)C(=C=O)O2)C(=O)N(C2=C3CCCC4C3=C(C=CC4CCC[NH3+])C3=C(O)C(O)=C(O)C=C32)C1=O Intermediate Fragment 
374 533.1918423081 CCC1CCC2=C3C(=C(N4C(=O)C(C)=CN(C5C=C(O)C(=C=[OH+])O5)C4=O)C4=CC(O)=C(O)C(O)=C42)CCCC31
375 533.1918423081 CCC1CCC2=C3C(=C(N4C(=O)C(C)=CN(C(O)=C=C(O)C#C[OH2+])C4=O)C4=CC(O)=C(O)C(O)=C42)CCCC31 Intermediate Fragment 
376 531.1761922441 CCC1C=CC2=C3C(=C(N4C(=O)C(C)=CN(C5C=C(O)C(=C=[OH+])O5)C4=O)C4=CC(O)=C(O)C(O)=C42)CCCC31
377 529.1605421801 CCC1=C2CCCC3=C(N4C(=O)C(C)=CN(C5C=C(O)C(=C=[OH+])O5)C4=O)C4=CC(O)=C(O)C(O)=C4C(=C23)C=C1
378 519.1761922441 CC1=CN(C2C=C(O)C(=C=[OH+])O2)C(=O)N(C2=C3CCCC4C3=C(CCC4C)C3=C(O)C(O)=C(O)C=C32)C1=O
379 519.1761922441 CC1=CN(C=C=C(O)C(=O)C=[OH+])C(=O)N(C2=C3CCCC4C3=C(CCC4C)C3=C(O)C(O)=C(O)C=C32)C1=O Intermediate Fragment 
380 519.1761922441 CC1=CN(C(O)=C=C(O)C#C[OH2+])C(=O)N(C2=C3CCCC4C3=C(CCC4C)C3=C(O)C(O)=C(O)C=C32)C1=O Intermediate Fragment 
381 517.1605421801 CC1=CN(C2C=C(O)C(=C=[OH+])O2)C(=O)N(C2=C3CCCC4C3=C(C=CC4C)C3=C(O)C(O)=C(O)C=C32)C1=O
382 515.1448921161 CC1=CN(C2C=C(O)C(=C=[OH+])O2)C(=O)N(C2=C3CCCC4=C(C)C=CC(=C43)C3=C(O)C(O)=C(O)C=C32)C1=O
383 515.1448921161 CC1=CN(C=C=C(O)C(=O)C=[OH+])C(=O)N(C2=C3CCCC4=C(C)C=CC(=C43)C3=C(O)C(O)=C(O)C=C32)C1=O Intermediate Fragment 
384 509.1918423081 CC1=CN(C2C=C(O)C(=C=[OH+])O2)C(=O)N(C2=C3CC(O)C(O)C(O)C3=C3CCCC4CCCC2=C34)C1=O
385 507.1761922441 CC1=CN(C2C=C(O)C(=C=[OH+])O2)C(=O)N(C2=C3C=C(O)C(O)C(O)C3=C3CCCC4CCCC2=C34)C1=O
386 505.1605421801 CC1=CN(C2C=C(O)C(=C=[OH+])O2)C(=O)N(C2=C3CCCC4CCCC(=C34)C3=C(O)C(O)=C(O)C=C32)C1=O
387 389.1131980641 CC1=C([OH2+])N(C2=C3CC=CC4=CC=CC(=C43)C3=C(O)C(O)=C(O)C=C32)C(=O)N=C1
388 503.1448921161 CC1=CN(C2C=C(O)C(=C=[OH+])O2)C(=O)N(C2=C3CCCC4CC=CC(=C34)C3=C(O)C(O)=C(O)C=C32)C1=O
389 501.1292420521 CC1=CN(C2C=C(O)C(=C=[OH+])O2)C(=O)N(C2=C3CCCC4=CC=CC(=C43)C3=C(O)C(O)=C(O)C=C32)C1=O
390 560.2027413401 CC1=CN(C2C=C(O)C(=C=O)O2)C(=O)N(CC2=CC(O)=C(O)C(=O)C2=C2C=CC3CCC([NH3+])C4CCC=C2C34)C1=O Intermediate Fragment 
391 180.0807757401 [NH2+]=C1C=CC2=CC=CC3=CC=CC1=C32
392 558.1870912761 CC1=CN(C2C=C(O)C(=C=O)O2)C(=O)N(C2=C3CCC4C([NH3+])CCC5C=CC(=C3C54)C3=C(O)C(O)=C(O)C=C32)C1=O
