#In-silico ESI-MS/MS [M+H]+ Spectra
#PREDICTED BY CFM-ID 4.0.8
#SMILES=[C@H]1(C[C@@H](O[C@@H]1CO)n1cc(c(=O)n(c1=O)C1CC(OC(O1)CC(O)C)C)C)O
#InChiKey=GCCDQSYRHODFSK-IPFTWKJNSA-N
energy0
127.05020 10.61 24 (3.1222)
159.10157 39.58 7 148 146 147 (8.5787 1.6031 1.2305 0.23293)
267.13393 100.00 32 19 18 112 (29.356 0.040201 0.02319 0.004515)
285.14450 74.29 4 55 91 88 105 113 36 86 87 64 82 97 79 (20.472 0.75734 0.12269 0.11196 0.092585 0.079615 0.071147 0.056072 0.035074 0.03143 0.017709 0.0081567 0.0032237)
383.18128 17.49 182 179 2 188 186 181 189 209 187 12 185 13 14 217 218 (3.1144 1.2009 0.34175 0.16172 0.10514 0.081651 0.068869 0.046302 0.0093662 0.004494 0.0037252 0.0035878 0.0011736 0.0011011 0.00088876)
401.19184 32.31 0 202 229 253 245 303 319 316 251 197 190 299 321 248 247 302 (9.0523 0.2141 0.107 0.054604 0.029495 0.020191 0.0066992 0.0064227 0.0058433 0.0056913 0.0016913 0.0015646 0.0011313 0.00069442 0.00043457 0.00026066)
energy1
45.03349 23.27 125 (4.9519)
69.03349 6.29 238 66 (1.3377 0.00040626)
87.04406 6.04 89 (1.2861)
99.04406 11.82 6 128 122 (1.119 0.96196 0.43455)
101.05971 8.78 144 139 136 137 (1.3374 0.34469 0.11381 0.072956)
125.03455 16.44 23 (3.4986)
127.05020 56.89 24 (12.108)
155.04512 7.76 100 165 (1.4434 0.20831)
159.10157 22.22 7 146 148 147 (3.2407 0.79405 0.65341 0.042024)
174.11247 5.42 63 (1.154)
225.08698 7.34 28 8 154 168 (0.86152 0.43731 0.25876 0.0037016)
227.10263 9.88 29 9 171 212 68 (1.6995 0.32212 0.051919 0.017005 0.011717)
267.13393 71.13 32 112 19 18 (14.471 0.42453 0.14276 0.10051)
269.11320 15.01 35 33 34 (2.3804 0.65122 0.16396)
285.14450 100.00 4 105 97 55 64 113 88 91 36 82 79 87 86 (16.974 1.0959 0.964 0.40528 0.38451 0.28846 0.25066 0.24433 0.18853 0.16085 0.14673 0.14296 0.037939)
313.13941 7.82 200 314 (1.6604 0.0050075)
energy2
43.01784 24.10 133 (2.3164)
45.03349 63.66 125 (6.1183)
53.03858 11.63 311 (1.1176)
55.01784 21.49 235 (2.0656)
55.05423 20.54 149 (1.9745)
57.03349 50.36 130 (4.8403)
57.06988 8.57 312 (0.82378)
59.04914 31.63 129 143 (2.679 0.36118)
71.04914 19.49 239 93 65 (1.0781 0.76475 0.030834)
99.04406 25.81 6 122 128 (1.1963 1.1358 0.14856)
101.05971 9.07 137 136 144 139 (0.37021 0.34741 0.13241 0.021889)
125.03455 44.31 23 (4.2582)
127.05020 47.76 24 (4.5903)
131.08150 7.10 26 (0.68259)
133.09715 16.76 16 (1.6109)
154.08626 6.81 261 (0.65434)
155.04512 14.54 165 100 (1.3835 0.014349)
159.10157 9.34 7 147 146 148 (0.66944 0.099073 0.082386 0.046503)
169.06077 19.11 159 (1.8371)
172.09682 14.61 73 250 (0.76093 0.64305)
174.11247 29.31 63 (2.8167)
197.09207 14.49 109 104 (1.3415 0.051492)
225.08698 35.43 8 154 28 168 (1.7068 0.77361 0.59766 0.327)
227.10263 36.97 212 9 171 29 68 (2.1506 1.0183 0.3261 0.054739 0.0030981)
285.14450 55.57 64 4 36 55 105 97 79 91 82 88 86 87 113 (1.1308 1.098 1.015 0.48473 0.35963 0.35071 0.29786 0.27384 0.1281 0.087081 0.07163 0.023298 0.019839)
287.16015 10.65 3 284 (0.98407 0.039317)
313.13941 100.00 200 314 (9.6001 0.010758)
313.17580 45.40 192 226 (4.2191 0.14409)
329.17071 9.91 196 243 195 (0.46069 0.43926 0.052773)
333.16563 7.83 252 (0.75277)

0 401.1918423081 Cc1cn(C2CC(O)C(C[OH2+])O2)c(=O)n(C2CC(C)OC(CC(C)O)O2)c1=O
1 369.1656275601 CC1=CN(C2C=C(O)CO2)C(=O)N(C2CC(C)OC(CC(C)O)O2)C1=[OH+]
2 383.1812776241 C=C1OC(N2C=C(C)C(=[OH+])N(C3CC(C)OC(CC(C)O)O3)C2O)C=C1O
3 287.1601482561 CC1=C([OH2+])N(C2CC(C)OC(CC(C)O)O2)C(O)N=C1
4 285.1444981921 CC1=C([OH2+])N(C2CC(C)OC(CC(C)O)O2)C(=O)N=C1
5 283.1288481281 CC1=C([OH2+])N(C2=CC(C)OC(CC(C)O)O2)C(=O)N=C1
6 99.0440558841 C=C1OC=CC1[OH2+]
7 159.1015707601 CC([OH2+])CC1OC=CC(C)O1
8 225.0869833161 C=C1OC(N2C=C(C)C(=[OH+])NC2O)C=C1O
9 227.1026333801 C=C1OC(N2C=C(C)C([OH2+])NC2O)C=C1O
10 365.1707129401 C=C1OC(N2C=C(C)C(=[OH+])N(C3CC(C)OC(CCC)O3)C2=O)C=C1O
11 365.1707129401 C=C1C=CC(N2C=C(C)C(=[OH+])N(C3CC(C)OC(CC(C)O)O3)C2=O)O1
12 383.1812776241 CC(=O)C(O)=C=CN1C=C(C)C(=[OH+])N(C2CC(C)OC(CC(C)O)O2)C1O Intermediate Fragment 
13 383.1812776241 C=C1OC(N(C=O)C=C(C)C(=[OH+])NC2CC(C)OC(CC(C)O)O2)C=C1O Intermediate Fragment 
14 383.1812776241 C=C1OC(=NC=C(C)C(=[OH+])N(CO)C2CC(C)OC(CC(C)O)O2)C=C1O Intermediate Fragment 
15 291.1914483841 CC(O)CC1OC(C)CC(N2C(O)NCC(C)C2[OH2+])O1
16 133.0971540761 CC1CNC(O)NC1[OH2+]
17 289.1757983201 CC(O)CC1OC(C)CC(N2C(O)N=CC(C)C2[OH2+])O1
18 267.1339335081 CC1=CN(C2=CC(C)OC(CC(C)O)O2)C(=[OH+])N=C1
19 267.1339335081 CC1=C([OH2+])N(C2=CC(C)OC(=CC(C)O)O2)CN=C1
20 157.0859206961 CC([OH2+])C=C1OC=CC(C)O1
21 155.0702706321 CC([OH2+])=C=C1OC=CC(C)O1
22 153.0546205681 C=C1C=COC(=C=C(C)[OH2+])O1
23 125.0345538201 [CH2+]C1=C(O)N=C(O)N=C1
24 127.0502038841 CC1=C([OH2+])N=C(O)N=C1
25 129.0658539481 CC1=C([OH2+])NC(O)N=C1
26 131.0815040121 CC1C=NC(O)NC1[OH2+]
27 61.0647913281 CC(C)[OH2+]
28 225.0869833161 CC1=C([OH2+])N(C2=CC(C)OCO2)C(=O)N=C1
29 227.1026333801 CC1=C([OH2+])N(C2CC(C)OCO2)C(=O)N=C1
30 47.0491412641 CC[OH2+]
31 239.1026333801 CC1=C([OH2+])N(C2=CC(C)OC(C)O2)C(=O)N=C1
32 267.1339335081 CCCC1OC(N2C(=O)N=CC(C)=C2[OH2+])=CC(C)O1
33 269.1131980641 CC1=C([OH2+])N(C2=CC(C)OC(CCO)O2)C(=O)N=C1
34 269.1131980641 CC1=C([OH2+])N(C2=CCOC(CC(C)O)O2)C(=O)N=C1
35 269.1131980641 CC(O)CC1OC(N2C(=O)N=CC=C2[OH2+])=CC(C)O1
36 285.1444981921 CC(=C=N)C(=[OH+])N(C=O)C1CC(C)OC(CC(C)O)O1 Intermediate Fragment 
37 268.1179490961 C=C(C)C(=O)[NH+](C=O)C1=CC(C)OC(=CC(C)O)O1
38 258.1335991601 CC=C(O)[NH+](C=O)C1=CC(C)OC(CC(C)O)O1
39 256.1179490961 CC=C(O)[NH+](C=O)C1=CC(C)OC(=CC(C)O)O1
40 254.1022990321 CC=C(O)[NH+](C=O)C1=CC(C)OC(=C=C(C)O)O1
41 234.1335991601 CC(O)CC1OC(C)CC([NH+](C=O)CO)O1
42 232.1179490961 CC(O)CC1OC(C)CC([NH+](C=O)C=O)O1
43 228.0866489681 CC(O)C=C1OC([NH+](C=O)C=O)=CC(C)O1
44 226.0709989041 CC(O)=C=C1OC([NH+](C=O)C=O)=CC(C)O1
45 56.0494756121 CCC#[NH+]
46 204.1230344761 CC(O)CC1OC(C)CC([NH+]=CO)O1
47 202.1073844121 CC(O)CC1OC(C)CC([NH+]=C=O)O1
48 200.0917343481 CC(O)CC1OC([NH+]=C=O)=CC(C)O1
49 198.0760842841 CC(O)C=C1OC([NH+]=C=O)=CC(C)O1
50 84.0443902321 CC(C#[NH+])=CO
51 253.1182834441 CC1=CC(=NC(O)=C(C)C#[NH+])OC(CC(C)O)O1
52 255.1339335081 CC(C#[NH+])=C(O)N=C1CC(C)OC(CC(C)O)O1
53 257.1495835721 CC(C#[NH+])=C(O)NC1CC(C)OC(CC(C)O)O1
54 283.1288481281 CC(C#[NH+])=C(O)N(C=O)C1=CC(C)OC(CC(C)O)O1
55 285.1444981921 CC(=C=NC=O)C(=[OH+])NC1CC(C)OC(CC(C)O)O1 Intermediate Fragment 
56 242.1386845401 C=C(C)C(=O)[NH+]=C1CC(C)OC(CC(C)O)O1
57 240.1230344761 C=C(C)C(=O)[NH+]=C1C=C(C)OC(CC(C)O)O1
58 238.1073844121 C=C(C)C(=O)[NH+]=C1C=C(C)OC(=CC(C)O)O1
59 228.1230344761 CC=C(O)[NH+]=C1C=C(C)OC(CC(C)O)O1
60 226.1073844121 CC=C(O)[NH+]=C1C=C(C)OC(=CC(C)O)O1
61 224.0917343481 CC=C(O)[NH+]=C1C=C(C)OC(=C=C(C)O)O1
62 176.1281198561 CC(O)CC1OC(C)CC([NH3+])O1
63 174.1124697921 CC(O)CC1OC(=[NH2+])CC(C)O1
64 285.1444981921 CC(=C=NC(O)=NC1CC(C)OC(CC(C)O)O1)C=[OH+] Intermediate Fragment 
65 71.0491412641 C=C(C)C=[OH+]
66 69.0334912001 C=C(C)C#[O+]
67 217.1182834441 CC(O)CC1OC(N=C([NH3+])O)=CC(C)O1
68 227.1026333801 C=[NH+]C(O)=NC1=CC(C)OC(=CC(C)O)O1
69 253.1182834441 CC=C=[NH+]C(O)=NC1=CC(C)OC(=CC(C)O)O1
70 255.1339335081 CC=C=[NH+]C(O)=NC1=CC(C)OC(CC(C)O)O1
71 257.1495835721 CC=C=[NH+]C(O)=NC1CC(C)OC(CC(C)O)O1
72 170.0811696641 CC1=CC(=[NH2+])OC(=CC(C)O)O1
73 172.0968197281 CC1=CC(=[NH2+])OC(CC(C)O)O1
74 90.0913404241 CC(C[NH3+])CO
75 88.0756903601 CC(C=[NH2+])CO
76 86.0600402961 CC(C#[NH+])CO
77 196.0604342201 CC(O)=C=C1OC([NH+]=C=O)=CC(C)O1
78 283.1288481281 CC(=C=[NH+]C(O)=NC1=CC(C)OC(CC(C)O)O1)C=O
79 285.1444981921 CC=C=NC(=O)N(C=[OH+])C1CC(C)OC(CC(C)O)O1 Intermediate Fragment 
80 257.1131980641 C=[NH+]C(=O)N(C=O)C1=CC(C)OC(CC(C)O)O1
81 230.1022990321 CC(O)CC1OC([NH+](C=O)C=O)=CC(C)O1
82 285.1444981921 C=NC(=O)N(C([OH2+])=CC)C1=CC(C)OC(CC(C)O)O1 Intermediate Fragment 
83 231.1339335081 C=[NH+]C(O)=NC1CC(C)OC(CC(C)O)O1
84 229.1182834441 C=[NH+]C(O)=NC1=CC(C)OC(CC(C)O)O1
85 230.1386845401 CC=C(O)[NH+]=C1CC(C)OC(CC(C)O)O1
86 285.1444981921 C=C(C)C(=[OH+])N(C(N)=O)C1=CC(C)OC(CC(C)O)O1 Intermediate Fragment 
87 285.1444981921 C=C(OC(CC(C)O)OCC)N1C(=O)N=CC(C)=C1[OH2+] Intermediate Fragment 
88 285.1444981921 CCC=C(OC(O)CC(C)O)N1C(=O)N=CC(C)=C1[OH2+] Intermediate Fragment 
89 87.0440558841 CC(O)C=C=[OH+]
90 89.0597059481 CC(O)CC=[OH+]
91 285.1444981921 CC1=C([OH2+])N(C(=CC(C)O)OCCC(C)O)C(=O)N=C1 Intermediate Fragment 
92 213.0869833161 CC1=C([OH2+])N(C(O)=CC(C)O)C(=O)N=C1
93 71.0491412641 C#CC(C)[OH2+]
94 73.0647913281 C=CC(C)[OH2+]
95 75.0804413921 CCC(C)[OH2+]
96 195.0764186321 CC1=C([OH2+])N(C#CC(C)O)C(=O)N=C1
97 285.1444981921 CC1=C([OH2+])N(C(O)=CC(C)OCCC(C)O)C(=O)N=C1 Intermediate Fragment 
98 131.1066561401 C=C(C)[OH+]CCC(C)O
99 153.0294684401 CC1=C(O)N(C#[O+])C(=O)N=C1
100 155.0451185041 CC1=C([OH2+])N(C=O)C(=O)N=C1
101 117.0910060761 CC[OH+]C=CC(C)O
102 115.0753560121 CC[OH+]C#CC(C)O
103 195.0764186321 CC=C=C(O)N1C(=O)N=CC(C)=C1[OH2+]
104 197.0920686961 CCC=C(O)N1C(=O)N=CC(C)=C1[OH2+]
105 285.1444981921 CC1=C([OH2+])N(C=CC(C)OC(O)CC(C)O)C(=O)N=C1 Intermediate Fragment 
106 137.0345538201 C=C1C=NC(=O)N([CH2+])C1=O
107 105.0546205681 CC(O)CC(O)=[OH+]
108 179.0815040121 CCC#CN1C(=O)N=CC(C)=C1[OH2+]
109 197.0920686961 CC1=C([OH2+])N(C=CC(C)O)C(=O)N=C1
110 199.1077187601 CC1=C([OH2+])N(CCC(C)O)C(=O)N=C1
111 201.1233688241 CC1=C([OH2+])N(CCC(C)O)C(O)N=C1
112 267.1339335081 CC1=C([OH2+])N(C#CC(C)OCCC(C)O)C(=O)N=C1
113 285.1444981921 C=C(C)OC(CC(C)O)OCN1C(=O)N=CC(C)=C1[OH2+] Intermediate Fragment 
114 265.1182834441 CCC=C1OC(N2C(=O)N=CC(C)=C2[OH2+])=CC(C)O1
115 283.1288481281 CC(=C=C(O)N1C(=O)N=CC(C)=C1[OH2+])OCCC(C)O Intermediate Fragment 
116 111.0076703761 O=C1C=COC1=C=[OH+]
117 113.0233204401 OC1C=COC1=C=[OH+]
118 115.0389705041 OC1C=COC1=C[OH2+]
119 115.0389705041 C=C=C(O)C(=O)C[OH2+] Intermediate Fragment 
120 115.0389705041 O=C=C=C(O)CC[OH2+] Intermediate Fragment 
121 117.0546205681 OC1C=COC1C[OH2+]
122 99.0440558841 [OH2+]C=C1C=CCO1
123 117.0546205681 C=COC(=C[OH2+])CO Intermediate Fragment 
124 91.0389705041 OCC(=[OH+])CO
125 45.0334912001 C=C[OH2+]
126 117.0546205681 C=C=C(O)C(O)C[OH2+] Intermediate Fragment 
127 29.0385765801 C=[CH3+]
128 99.0440558841 C=C=C(O)C=C[OH2+]
129 59.0491412641 CC=C[OH2+]
130 57.0334912001 CC#C[OH2+]
131 61.0284058201 OCC=[OH+]
132 117.0546205681 OC=C=C(O)CC[OH2+] Intermediate Fragment 
133 43.0178411361 C#C[OH2+]
134 117.0546205681 OC=C=COCC[OH2+] Intermediate Fragment 
135 119.0702706321 OC1CCOC1C[OH2+]
136 101.0597059481 CC1OCC=C1[OH2+]
137 101.0597059481 [OH2+]CC1C=CCO1
138 119.0702706321 OCC=C(O)CC[OH2+] Intermediate Fragment 
139 101.0597059481 C=C=C(O)CC[OH2+]
140 161.1172208241 CC([OH2+])CC1OCCC(C)O1
141 143.1066561401 CC[CH3+]C1OC=CC(C)O1
142 161.1172208241 CC(O)C=COCCC(C)[OH2+] Intermediate Fragment 
143 59.0491412641 C=C(C)[OH2+]
144 101.0597059481 [CH4+]C1C=COCO1
145 141.0910060761 CC[CH2+]=C1OC=CC(C)O1
146 159.1015707601 CC(=C=CO)OCCC(C)[OH2+] Intermediate Fragment 
147 159.1015707601 CC(O)=C=COCCC(C)[OH2+] Intermediate Fragment 
148 159.1015707601 CC=C=COC(O)CC(C)[OH2+] Intermediate Fragment 
149 55.0542266441 [CH2+]#CCC
150 139.0753560121 CC=[CH+]=C1OC=CC(C)O1
151 241.0818979361 CC1=CN(C2C=C(O)C(=C=[OH+])O2)C(O)NC1O
152 243.0975480001 CC1CN(C2C=C(O)C(=C=[OH+])O2)C(O)NC1O
153 227.0662478721 OC1=CC(N2C=CC(O)NC2O)OC1=C=[OH+]
154 225.0869833161 CC1=CN(C2C=CC(=C=[OH+])O2)C(O)NC1O
155 243.0975480001 C=C(OC(=C=[OH+])CO)N1C=C(C)C(O)NC1O Intermediate Fragment 
156 243.0975480001 CC1CN(C=C=C(O)C(=O)C=[OH+])C(O)NC1O Intermediate Fragment 
157 243.0975480001 CC1CN(C(O)=C=C(O)C#C[OH2+])C(O)NC1O Intermediate Fragment 
158 173.0920686961 C=C([OH2+])N1C=C(C)C(O)NC1O
159 169.0607685681 C=C([OH2+])N1C=C(C)C(=O)N=C1O
160 167.0451185041 [CH+]=C(O)N1C=C(C)C(=O)N=C1O
161 73.0284058201 OCC#C[OH2+]
162 75.0440558841 OCC=C[OH2+]
163 159.0764186321 CC1=CN(C=[OH+])C(O)NC1O
164 157.0607685681 CC1=CN(C=[OH+])C(O)NC1=O
165 155.0451185041 CC1=CN(C=[OH+])C(O)=NC1=O
166 153.0294684401 CC1=CN(C#[O+])C(O)=NC1=O
167 91.0753560121 CC(O)CC[OH2+]
168 225.0869833161 CC1=CN(C=C=C(O)C#C[OH2+])C(O)NC1O
169 199.0713332521 CC1=CN(C(=[OH+])C#CO)C(O)NC1O
170 245.1131980641 CC1CN(C2C=C(O)C(=C[OH2+])O2)C(O)NC1O
171 227.1026333801 CC1CN(C2C=CC(=C=[OH+])O2)C(O)NC1O
172 245.1131980641 CC1CN(C=C=C(O)C(=O)C[OH2+])C(O)NC1O Intermediate Fragment 
173 245.1131980641 CC1CN(C(O)=C=C(O)C=C[OH2+])C(O)NC1O Intermediate Fragment 
174 247.1288481281 CC1CN(C2C=C(O)C(C[OH2+])O2)C(O)NC1O
175 247.1288481281 CC1CN(C=C=C(O)C(O)C[OH2+])C(O)NC1O Intermediate Fragment 
176 249.1444981921 CC1CN(C2CC(O)C(C[OH2+])O2)C(O)NC1O
177 249.1444981921 CC1CN(CC=C(O)C(O)C[OH2+])C(O)NC1O Intermediate Fragment 
178 341.1343274321 CC1=CN(C2C=C(O)C(=C=[OH+])O2)C(O)N(C2CC(C)OCO2)C1O
179 383.1812776241 CCCC1OC(C)CC(N2C(O)C(C)=CN(C3C=C(O)C(=C=[OH+])O3)C2O)O1
180 269.1495835721 CCCC1OC(C)CC(N2C(=O)N=CC(C)=C2[OH2+])O1
181 383.1812776241 CCCC1OC(C)CC(N2C(O)C(C)=CN(C=C=C(O)C(=O)C=[OH+])C2O)O1 Intermediate Fragment 
182 383.1812776241 CC1=CN(C2C=CC(=C=[OH+])O2)C(O)N(C2CC(C)OC(CC(C)O)O2)C1O
183 353.1707129401 CC1=CN(C2C=CCO2)C(=O)N(C2CC(C)OC(CC(C)O)O2)C1=[OH+]
184 365.1707129401 CCCC1OC(C)CC(N2C(=O)C(C)=CN(C3C=CC(=C=[OH+])O3)C2O)O1
185 383.1812776241 C=C(OC(C)=C=[OH+])N1C=C(C)C(=O)N(C2CC(C)OC(CC(C)O)O2)C1O Intermediate Fragment 
186 383.1812776241 CC1=CN(C=C=CC(=O)C=[OH+])C(O)N(C2CC(C)OC(CC(C)O)O2)C1O Intermediate Fragment 
187 383.1812776241 CC(=CN=C1C=CC(=C=[OH+])O1)C(O)N(CO)C1CC(C)OC(CC(C)O)O1 Intermediate Fragment 
188 383.1812776241 CCCC(OC(O)CC(C)O)N1C(=O)C(C)=CN(C2C=CC(=C=[OH+])O2)C1O Intermediate Fragment 
189 383.1812776241 CC1=CN(C2C=CC(=C=[OH+])O2)C(O)N(C(O)CC(C)OCCC(C)O)C1=O Intermediate Fragment 
190 401.1918423081 C=C(OC(=C=[OH+])CO)N1C=C(C)C(O)N(C2CC(C)OC(CC(C)O)O2)C1O Intermediate Fragment 
191 311.1601482561 C#CN1C=C(C)C(=[OH+])N(C2CC(C)OC(CC(C)O)O2)C1O
192 313.1757983201 C#CN1C=C(C)C([OH2+])N(C2CC(C)OC(CC(C)O)O2)C1O
193 327.1550628761 C=C([OH2+])N1C=C(C)C(=O)N(C2CC(C)OC(CC(C)O)O2)C1=O
194 327.1550628761 C=C([OH2+])N(C=O)C=C(C)C(=O)N=C1CC(C)OC(CC(C)O)O1 Intermediate Fragment 
195 329.1707129401 C=C([OH2+])N1C=C(C)C(=O)N(C2CC(C)OC(CC(C)O)O2)C1O
196 329.1707129401 C=C([OH2+])N(C=O)C=C(C)C(=O)NC1CC(C)OC(CC(C)O)O1 Intermediate Fragment 
197 401.1918423081 C=C(O)C(=C=[OH+])OCN1C=C(C)C(O)N(C2CC(C)OC(CC(C)O)O2)C1O Intermediate Fragment 
198 297.1444981921 CC1=CN(C)C(=O)N(C2=CC(C)OC(CC(C)O)O2)C1=[OH+]
199 299.1601482561 CC1=CN(C)C(=O)N(C2CC(C)OC(CC(C)O)O2)C1=[OH+]
200 313.1394128121 CC1=CN(C=[OH+])C(=O)N(C2CC(C)OC(CC(C)O)O2)C1=O
201 315.1550628761 CC1=CN(C=[OH+])C(O)N(C2CC(C)OC(CC(C)O)O2)C1=O
202 401.1918423081 CC(O)CC1OC(C)CC(N2C(O)C(C)CN(C=C=C(O)C(=O)C=[OH+])C2O)O1 Intermediate Fragment 
203 317.2070984481 C=CN1CC(C)C([OH2+])N(C2CC(C)OC(CC(C)O)O2)C1O
204 315.1914483841 C#CN1CC(C)C([OH2+])N(C2CC(C)OC(CC(C)O)O2)C1O
205 309.1444981921 C#CN1C=C(C)C(=[OH+])N(C2CC(C)OC(CC(C)O)O2)C1=O
206 89.0233204401 O=CC(=[OH+])CO
207 93.0546205681 OCC([OH2+])CO
208 75.0440558841 CC(=[OH+])CO
209 383.1812776241 CC1=CN(C=C=C(O)C#C[OH2+])C(O)N(C2CC(C)OC(CC(C)O)O2)C1O
210 77.0597059481 OCCC[OH2+]
211 365.1707129401 C#CC(O)=C=CN1C=C(C)C(=[OH+])N(C2CC(C)OC(CC(C)O)O2)C1O
212 227.1026333801 CC1CN(C=C=C(O)C#C[OH2+])C(O)NC1O
213 229.1182834441 CC1CN(C=C=C(O)C=C[OH2+])C(O)NC1O
214 365.1707129401 CC1=CN(CC#CC#C[OH2+])C(O)N(C2CC(C)OC(CC(C)O)O2)C1=O
215 341.1707129401 CC1=CN(CC#CO)C(O)N(C2CC(C)OC(CC(C)O)O2)C1=[OH+]
216 339.1550628761 CC1=CN(CC#CO)C(=O)N(C2CC(C)OC(CC(C)O)O2)C1=[OH+]
217 383.1812776241 CC(C=O)=CN(C=C=C(O)C#C[OH2+])C(O)NC1CC(C)OC(CC(C)O)O1 Intermediate Fragment 
218 383.1812776241 CC1=CN(C=C=C(O)C#C[OH2+])C(O)N(C(O)CC(C)OCCC(C)O)C1=O Intermediate Fragment 
219 345.2020130681 CC(O)CC1OC(C)CC(N2C([OH2+])C(C)CN(CC#CO)C2O)O1
220 343.1863630041 CC1=CN(CC#CO)C(O)N(C2CC(C)OC(CC(C)O)O2)C1[OH2+]
221 325.1757983201 C#CCN1C=C(C)C(=[OH+])N(C2CC(C)OC(CC(C)O)O2)C1O
222 183.0764186321 CC1=CN(CC#CO)C(O)NC1=[OH+]
223 323.1601482561 C#CCN1C=C(C)C(=[OH+])N(C2CC(C)OC(CC(C)O)O2)C1=O
224 341.1707129401 CC(=CN(C=O)CC#CO)C(=[OH+])NC1CC(C)OC(CC(C)O)O1 Intermediate Fragment 
225 140.0706049801 CC#C[NH+](CO)CC#CO
226 313.1757983201 CC(=C[NH+]=CC#CO)C(O)NC1CC(C)OC(CC(C)O)O1
227 321.1444981921 CCCC1OC(N2C(=O)N(CC#CO)C=C(C)C2=[OH+])=CC(C)O1
228 63.0440558841 OCC[OH2+]
229 401.1918423081 CC(O)CC1OC(C)CC(N2C(O)C(C)CN(C(O)=C=C(O)C#C[OH2+])C2O)O1 Intermediate Fragment 
230 333.2020130681 C=C([OH2+])N1CC(C)C(O)N(C2CC(C)OC(CC(C)O)O2)C1O
231 331.1863630041 C=C([OH2+])N1C=C(C)C(O)N(C2CC(C)OC(CC(C)O)O2)C1O
232 325.1394128121 C=C([OH2+])N1C=C(C)C(=O)N(C2=CC(C)OC(CC(C)O)O2)C1=O
233 68.9971056921 [O+]#CC#CO
234 71.0127557561 O=CC#C[OH2+]
235 55.0178411361 C#CC=[OH+]
236 317.1707129401 CC1=CN(C=[OH+])C(O)N(C2CC(C)OC(CC(C)O)O2)C1O
237 311.1237627481 CC1=CN(C=[OH+])C(=O)N(C2=CC(C)OC(CC(C)O)O2)C1=O
238 69.0334912001 C#CC=C[OH2+]
239 71.0491412641 C#CCC[OH2+]
240 359.1812776241 CC(O)CC1OC(C)CC(N2C(O)C(C)CN(C(=[OH+])C#CO)C2O)O1
241 357.1656275601 CC1=CN(C(=[OH+])C#CO)C(O)N(C2CC(C)OC(CC(C)O)O2)C1O
242 357.1656275601 CC(=CN(CO)C(=[OH+])C#CO)C(=O)NC1CC(C)OC(CC(C)O)O1 Intermediate Fragment 
243 329.1707129401 CC(O)CC1OC(C)CC(NC(O)C(C)C=[NH+]C(=O)C#CO)O1
244 355.1499774961 CC1=CN(C(=[OH+])C#CO)C(O)N(C2CC(C)OC(CC(C)O)O2)C1=O
245 401.1918423081 CC(O)CC1OC(C)CC(N2C(O)C(C)CN(C(=C=CO)OC#C[OH2+])C2O)O1 Intermediate Fragment 
246 371.1812776241 C=C([OH+]C#CO)N1C=C(C)C(O)N(C2CC(C)OC(CC(C)O)O2)C1O
247 401.1918423081 CC=C(O)N(C1CC(C)OC(CC(C)O)O1)C(O)N(C)C1C=C(O)C(=C=[OH+])O1 Intermediate Fragment 
248 401.1918423081 CC=CN(C1C=C(O)C(=C=[OH+])O1)C(O)N(CO)C1CC(C)OC(CC(C)O)O1 Intermediate Fragment 
249 373.1969276881 CCC[NH+](C(O)NC1CC(C)OC(CC(C)O)O1)C1C=C(O)C(=C=O)O1
250 172.0968197281 CCC[NH2+]C1C=C(O)C(=CO)O1
251 401.1918423081 CC(=CN(C(O)NC1CC(C)OC(CC(C)O)O1)C1C=C(O)C(=C=[OH+])O1)CO Intermediate Fragment 
252 333.1656275601 CC(O)CC1OC(C)CC(NC(O)[NH2+]C2C=C(O)C(=CO)O2)O1
253 401.1918423081 CC(=CN(CO)C1C=C(O)C(=C=[OH+])O1)C(O)NC1CC(C)OC(CC(C)O)O1 Intermediate Fragment 
254 248.1856347321 CC(O)CC1OC(C)CC([NH2+]C(O)C(C)C)O1
255 246.1699846681 C=C(C)C(O)[NH2+]C1CC(C)OC(CC(C)O)O1
256 244.1543346041 C=C(C)C(=O)[NH2+]C1CC(C)OC(CC(C)O)O1
257 224.1281198561 C=C(C)C(=O)[NH+]=C1C=C(C)OC(CCC)O1
258 242.1386845401 C=C(C)C(=O)[NH+]=C=CC(C)OC(O)CC(C)O Intermediate Fragment 
259 242.1386845401 C=C(C)C(=O)[NH+]=C(O)C=C(C)OCCC(C)O Intermediate Fragment 
260 242.1386845401 C=C(C)C(=O)[NH+]=C(C=C(C)O)OCCC(C)O Intermediate Fragment 
261 154.0862550441 C=C(C)C(=O)[NH+]=C=CC(C)O
262 240.1230344761 C=C(C)C(=O)[NH+]=C(O)C=C(C)OC=CC(C)O Intermediate Fragment 
263 160.0604342201 OC=C1OC([NH2+]CO)C=C1O
264 196.0604342201 CC#C[NH+](CO)C1C=C(O)C(=C=O)O1
265 198.0760842841 CC=C[NH+](CO)C1C=C(O)C(=C=O)O1
266 200.0917343481 CCC[NH+](CO)C1C=C(O)C(=C=O)O1
267 84.0443902321 CC=C=[NH+]C=O
268 200.0917343481 CCC[NH+](CO)C(O)=C=C(O)C#CO Intermediate Fragment 
269 202.1073844121 CCC[NH+](CO)C1C=C(O)C(=CO)O1
270 202.1073844121 CCC[NH+](CO)C(O)=C=C(O)C=CO Intermediate Fragment 
271 204.1230344761 CCC[NH+](CO)C1C=C(O)C(CO)O1
272 373.1969276881 CC(O)CC1OC(C)CC(NC(O)C(C)C[NH2+]C2C=C(O)C(=C=O)O2)O1
273 343.1863630041 CC(=C[NH+]=C1C=C(O)CO1)C(O)NC1CC(C)OC(CC(C)O)O1
274 355.1863630041 C=C1OC(=[NH+]C=C(C)C(O)NC2CC(C)OC(CC(C)O)O2)C=C1O
275 202.1073844121 CC(CO)C[NH2+]C1C=C(O)C(=CO)O1
276 355.1863630041 CC(O)CC1OC(C)CC(NC(O)C(C)C[NH+]=C2C=CC(=C=O)O2)O1
277 373.1969276881 C=C([NH+]=CC(C)C(O)NC1CC(C)OC(CC(C)O)O1)OC(=C=O)CO Intermediate Fragment 
278 283.1652336361 C#C[NH+]=C=C(C)C(O)NC1CC(C)OC(CC(C)O)O1
279 299.1601482561 C=C(O)[NH+]=C=C(C)C(=O)NC1CC(C)OC(CC(C)O)O1
280 373.1969276881 C=C(O)C(=C=O)OC=[NH+]CC(C)C(O)NC1CC(C)OC(CC(C)O)O1 Intermediate Fragment 
281 373.1969276881 CC(O)CC1OC(C)CC(NC(O)C(C)C[NH2+]C=C=C(O)C(=O)C=O)O1 Intermediate Fragment 
282 373.1969276881 CC(O)CC1OC(C)CC(NC(O)C(C)C[NH2+]C(O)=C=C(O)C#CO)O1 Intermediate Fragment 
283 301.1757983201 C=C(O)[NH+]=C=C(C)C(O)NC1CC(C)OC(CC(C)O)O1
284 287.1601482561 CC(=C[NH+]=C=O)C(O)NC1CC(C)OC(CC(C)O)O1
285 283.1288481281 CC(=C[NH+]=C=O)C(=O)N=C1CC(C)OC(CC(C)O)O1
286 355.1863630041 CC(O)CC1OC(C)CC(NC(O)C(C)C[NH+]=C=C=C(O)C#CO)O1
287 327.1550628761 CC(=C=[NH+]C(=O)C#CO)C(O)NC1CC(C)OC(CC(C)O)O1
288 373.1969276881 CC(O)CC1OC(C)CC(NC(O)C(C)C[NH2+]C(=C=CO)OC#CO)O1 Intermediate Fragment 
289 373.1969276881 CC(O)CCOC(CC(C)O)NC(O)C(C)C[NH+]=C1C=C(O)C(=C=O)O1 Intermediate Fragment 
290 373.1969276881 CC(O)CC(O)OC(C)CCNC(O)C(C)C[NH+]=C1C=C(O)C(=C=O)O1 Intermediate Fragment 
291 371.1812776241 CC(O)CC1OC(C)CC(NC(O)C(C)C[NH+]=C2C=C(O)C(=C=O)O2)O1
292 371.1812776241 C=C([NH+]=C=C(C)C(O)NC1CC(C)OC(CC(C)O)O1)OC(=C=O)CO Intermediate Fragment 
293 371.1812776241 CC(O)CC1OC(C)CC(NC(O)C(C)C[NH+]=C=C=C(O)C(=O)C=O)O1 Intermediate Fragment 
294 371.1812776241 CC(O)CC1OC(C)CC(NC(O)C(C)C=[NH+]C(O)=C=C(O)C#CO)O1 Intermediate Fragment 
295 371.1812776241 CC(O)CC1OC(C)CC(NC(O)C(C)C=[NH+]C(=C=CO)OC#CO)O1 Intermediate Fragment 
296 371.1812776241 CCCC(NC(O)C(C)=C[NH+]=C1C=C(O)C(=C=O)O1)OC(O)CC(C)O Intermediate Fragment 
297 371.1812776241 CC(=C[NH+]=C1C=C(O)C(=C=O)O1)C(O)NC(O)CC(C)OCCC(C)O Intermediate Fragment 
298 369.1656275601 CC(=C[NH+]=C1C=C(O)C(=C=O)O1)C(O)NC1CC(C)OC(CC(C)O)O1
299 401.1918423081 CC(O)CC1OC(C)CC(N(CO)C(O)C(C)CN=C2C=C(O)C(=C=[OH+])O2)O1 Intermediate Fragment 
300 276.1805493521 C=C(C)C(O)[NH+](CO)C1CC(C)OC(CC(C)O)O1
301 270.1335991601 C=C(C)C(=O)[NH+](C=O)C1=CC(C)OC(CC(C)O)O1
302 401.1918423081 CC(O)CC1OC(C)CC(N(C(O)N=C2C=C(O)C(=C=[OH+])O2)C(O)C(C)C)O1 Intermediate Fragment 
303 401.1918423081 CC1=CN(C2C=C(O)C(=C=[OH+])O2)C(O)N(C(CC(C)O)OCCC(C)O)C1O Intermediate Fragment 
304 343.1499774961 CC1=CN(C2C=C(O)C(=C=[OH+])O2)C(O)N(COCCC(C)O)C1O
305 331.1499774961 CC(O)CC(O)N1C(O)C(C)CN(C2C=C(O)C(=C=[OH+])O2)C1O
306 331.1499774961 CC(O)CC(O)N1C(O)C(C)CN(C(O)=C=C(O)C#C[OH2+])C1O Intermediate Fragment 
307 329.1343274321 CC1=CN(C2C=C(O)C(=C=[OH+])O2)C(O)N(C(O)CC(C)O)C1O
308 329.1343274321 CC1=CN(C=C=C(O)C(=O)C=[OH+])C(O)N(C(O)CC(C)O)C1O Intermediate Fragment 
309 329.1343274321 CC1=CN(C(O)=C=C(O)C#C[OH2+])C(O)N(C(O)CC(C)O)C1O Intermediate Fragment 
310 329.1343274321 CC(=CN(CO)C1C=C(O)C(=C=[OH+])O1)C(=O)NC(O)CC(C)O Intermediate Fragment 
311 53.0385765801 C=CC#[CH2+]
312 57.0698767081 CCC=[CH3+]
313 315.1550628761 CC(O)CCN1C(O)C(C)CN(C2C=C(O)C(=C=[OH+])O2)C1O
314 313.1394128121 CC1=CN(C2C=C(O)C(=C=[OH+])O2)C(O)N(CCC(C)O)C1O
315 311.1237627481 CC1=CN(C2C=C(O)C(=C=[OH+])O2)C(O)N(CCC(C)O)C1=O
316 401.1918423081 CC1=CN(C2C=C(O)C(=C=[OH+])O2)C(O)N(C(O)CC(C)OCCC(C)O)C1O Intermediate Fragment 
317 269.0768125561 CC1=CN(C2C=C(O)C(=C=[OH+])O2)C(O)N(CO)C1=O
318 273.1081126841 CC1CN(C2C=C(O)C(=C=[OH+])O2)C(O)N(CO)C1O
319 401.1918423081 CC1=CN(C2C=C(O)C(=C=[OH+])O2)C(O)N(CCC(C)OC(O)CC(C)O)C1O Intermediate Fragment 
320 253.0818979361 CC1=CN(C2C=C(O)C(=C=[OH+])O2)C(O)N(C)C1=O
321 401.1918423081 CC1=CN(C2C=C(O)C(=C=[OH+])O2)C(O)N(COC(CC(C)O)OC(C)C)C1O Intermediate Fragment 
322 399.1761922441 CC1=CN(C2C=C(O)C(=C=[OH+])O2)C(O)N(C2CC(C)OC(CC(C)O)O2)C1O
