#In-silico ESI-MS/MS [M+H]+ Spectra
#PREDICTED BY CFM-ID 4.0.8
#SMILES=[C@H]1(C[C@@H](O[C@@H]1CO)n1cc(c(=O)n(c1=O)C(=O)O)C)O
#InChiKey=IIRPPRYRAMZPMR-BWZBUEFSSA-N
energy0
125.03455 61.56 22 (17.451)
153.02947 100.00 26 (28.35)
171.04003 97.84 5 27 48 40 59 56 58 (26.483 0.56173 0.28872 0.16115 0.15588 0.046028 0.04119)
269.07681 23.76 100 102 3 101 109 108 110 144 112 157 13 12 161 153 154 (3.2983 2.6505 0.34861 0.17258 0.12847 0.099624 0.013285 0.013257 0.0065365 0.0018764 0.0018329 0.0010732 0.00026154 0.00022384 0.00010933)
energy1
125.03455 32.47 22 (13.354)
127.05020 45.63 23 (18.769)
153.02947 100.00 26 (41.133)
155.04512 8.66 24 98 279 (3.0998 0.46296 0.00032948)
171.04003 8.97 5 58 40 56 48 27 59 (3.2002 0.11369 0.10531 0.09967 0.080484 0.079835 0.0090957)
energy2
39.02293 21.33 249 (2.1667)
41.03858 100.00 60 (10.16)
43.05423 31.54 242 (3.2048)
45.03349 21.47 75 (2.1815)
56.04948 14.62 34 (1.4858)
57.03349 26.02 79 (2.6434)
61.02841 9.76 80 (0.99199)
71.04914 16.68 193 244 194 (0.73806 0.54138 0.41548)
73.02841 9.15 140 95 (0.67889 0.25116)
82.02874 9.21 45 37 215 (0.6249 0.16668 0.14466)
84.04439 30.76 46 38 248 (1.6508 1.0611 0.41397)
99.04406 11.62 72 71 77 (0.55978 0.54266 0.077963)
110.02365 7.69 47 189 252 (0.38449 0.38351 0.013332)
125.03455 65.88 22 (6.6932)
127.05020 28.79 23 (2.9255)
128.03422 27.34 41 271 (2.773 0.0050179)
128.07060 10.90 220 219 (0.71218 0.3951)
153.06585 29.14 115 (2.9604)
155.04512 21.60 98 24 279 (1.8937 0.29363 0.0075817)
169.06077 9.58 93 276 (0.9509 0.022702)
170.08117 9.70 230 (0.98593)
171.04003 40.17 5 48 27 40 56 58 59 (1.0706 0.94404 0.89171 0.86703 0.22481 0.043403 0.039432)
183.04003 13.16 124 128 286 (0.6756 0.62464 0.036594)
183.07642 19.60 163 (1.9914)
185.05568 7.82 125 119 (0.43529 0.35916)
198.07608 20.63 225 238 (2.002 0.093861)
199.03495 41.89 190 188 187 129 (1.5863 1.4846 0.78033 0.40507)
199.07133 54.80 116 199 294 (5.5399 0.022037 0.0064573)
200.09173 35.07 224 237 236 (3.5447 0.017814 0.000592)
225.08698 16.00 9 90 99 (1.1239 0.36441 0.13767)

0 287.0873772401 Cc1cn(C2CC(O)C(C[OH2+])O2)c(=O)n(C(=O)O)c1=O
1 255.0611624921 CC1=CN(C2C=C(O)CO2)C(=O)N(C(=O)O)C1=[OH+]
2 257.0768125561 CC1=CN(C2C=C(O)CO2)C(=O)N(C(O)O)C1=[OH+]
3 269.0768125561 C=C1OC(N2C=C(C)C(=[OH+])N(C(O)O)C2=O)C=C1O
4 173.0556831881 CC1C=NC(=O)N(C(O)O)C1=[OH+]
5 171.0400331241 CC1C=NC(=O)N(C(=O)O)C1=[OH+]
6 101.0597059481 CC1OC=CC1[OH2+]
7 221.0556831881 [CH+]=C1OC(N2C=C(C)C(=O)N=C2O)C=C1O
8 223.0713332521 C=C1OC(N2C=C(C)C(=[OH+])N=C2O)C=C1O
9 225.0869833161 C=C1OC(N2C=C(C)C(=[OH+])NC2O)C=C1O
10 251.0662478721 C=C1OC(N2C=C(C)C(=[OH+])N(C=O)C2=O)C=C1O
11 251.0662478721 C=C1C=CC(N2C=C(C)C(=[OH+])N(C(=O)O)C2=O)O1
12 269.0768125561 C=C1OC(N(C=O)C=C(C)C(=[OH+])N=C(O)O)C=C1O Intermediate Fragment 
13 269.0768125561 C=C1OC(=NC=C(C)C(=[OH+])N(C=O)C(O)O)C=C1O Intermediate Fragment 
14 177.0869833161 CC1C=NC(O)N(C(O)O)C1[OH2+]
15 129.0658539481 CC1=C([OH2+])NC(O)N=C1
16 131.0815040121 CC1C=NC(O)NC1[OH2+]
17 133.0971540761 CC1CNC(O)NC1[OH2+]
18 177.0869833161 CC(=C=NCO)C([OH2+])NC(O)O Intermediate Fragment 
19 130.0498695361 C=C(C)C(=O)[NH+]=C(O)O
20 177.0869833161 CC(=C=NC(O)NC(O)O)C[OH2+] Intermediate Fragment 
21 175.0713332521 CC1=C([OH2+])N(C(O)O)C(O)N=C1
22 125.0345538201 [CH2+]C1=C(O)N=C(O)N=C1
23 127.0502038841 CC1=C([OH2+])N=C(O)N=C1
24 155.0451185041 CC1=C([OH2+])N(C=O)C(=O)N=C1
25 123.0189037561 [CH+]=C1C=NC(O)=NC1=O
26 153.0294684401 CC1=C(O)N(C#[O+])C(=O)N=C1
27 171.0400331241 CC(=C=N)C(=[OH+])N(C=O)C(=O)O Intermediate Fragment 
28 144.0291340921 C=CC(=O)[NH+](C=O)C(=O)O
29 139.9978339641 C#CC(=O)[N+](=C=O)C(=O)O
30 118.0134840281 O=C[NH+](C=O)C(=O)O
31 115.9978339641 O=C=[N+](C=O)C(=O)O
32 52.0181754841 C#CC#[NH+]
33 54.0338255481 C=CC#[NH+]
34 56.0494756121 CCC#[NH+]
35 90.0185694081 O=C=[NH+]C(O)O
36 80.0130901041 [CH2+]C(=C=O)C#N
37 82.0287401681 CC(=C=O)C#[NH+]
38 84.0443902321 CC(C#[NH+])=CO
39 143.0451185041 CC(C#[NH+])C(=O)N=C(O)O
40 171.0400331241 CC(=C=NC=O)C(=[OH+])N=C(O)O Intermediate Fragment 
41 128.0342194721 [CH+]=C(C)C(=O)N=C(O)O
42 116.0342194721 C=CC(=O)[NH+]=C(O)O
43 114.0185694081 C#CC(=O)[NH+]=C(O)O
44 80.0130901041 C=C=C=NC#[O+]
45 82.0287401681 C=C=C=[NH+]C=O
46 84.0443902321 CC=C=[NH+]C=O
47 110.0236547881 CC(=C=NC=O)C#[O+]
48 171.0400331241 CC(=C=NC(O)=NC(=O)O)C=[OH+] Intermediate Fragment 
49 115.0138183761 C#[N+]C(O)=NC(=O)O
50 117.0294684401 C=[NH+]C(O)=NC(=O)O
51 139.0138183761 [CH+]=C=C=NC(O)=NC(=O)O
52 141.0294684401 C=C=C=[NH+]C(O)=NC(=O)O
53 143.0451185041 CC=C=[NH+]C(O)=NC(=O)O
54 62.0236547881 [NH2+]=C(O)O
55 88.0029193441 O=C=[NH+]C(=O)O
56 171.0400331241 CC=C=NC(=O)N(C=[OH+])C(=O)O Intermediate Fragment 
57 131.0087329961 NC(=O)N(C#[O+])C(=O)O
58 171.0400331241 C=C=C([OH2+])N(C(=O)O)C(=O)N=C Intermediate Fragment 
59 171.0400331241 C=C([CH2+])C(=O)N(C(N)=O)C(=O)O Intermediate Fragment 
60 41.0385765801 [CH2+]#CC
61 169.0243830601 [CH2+]C1=C(O)N(C(=O)O)C(=O)N=C1
62 151.0138183761 C=C1C=NC(=O)N(C#[O+])C1=O
63 111.0076703761 O=C1C=COC1=C=[OH+]
64 113.0233204401 OC1C=COC1=C=[OH+]
65 115.0389705041 OC1C=COC1=C[OH2+]
66 87.0440558841 [OH2+]C1C=COC1
67 115.0389705041 C=C=C(O)C(=O)C[OH2+] Intermediate Fragment 
68 115.0389705041 O=C=C=C(O)CC[OH2+] Intermediate Fragment 
69 117.0546205681 OC1C=COC1C[OH2+]
70 89.0597059481 [OH2+]C1CCOC1
71 99.0440558841 C=C1OCC=C1[OH2+]
72 99.0440558841 [OH2+]C=C1C=CCO1
73 117.0546205681 C=COC(=C[OH2+])CO Intermediate Fragment 
74 91.0389705041 OCC(=[OH+])CO
75 45.0334912001 C=C[OH2+]
76 117.0546205681 C=C=C(O)C(O)C[OH2+] Intermediate Fragment 
77 99.0440558841 C=C=C(O)C=C[OH2+]
78 59.0491412641 CC=C[OH2+]
79 57.0334912001 CC#C[OH2+]
80 61.0284058201 OCC=[OH+]
81 117.0546205681 OC=C=C(O)CC[OH2+] Intermediate Fragment 
82 89.0597059481 C=C(O)CC[OH2+]
83 117.0546205681 OC=C=COCC[OH2+] Intermediate Fragment 
84 239.0662478721 CC1=CN(C2C=C(O)C(=C=[OH+])O2)C(O)NC1=O
85 211.0713332521 CC1=CN(C2=CC(O)CO2)C(O)=NC1=[OH+]
86 239.0662478721 CC1=CN(C=C=C(O)C(=O)C=[OH+])C(O)NC1=O Intermediate Fragment 
87 241.0818979361 CC1=CN(C2C=C(O)C(=C=[OH+])O2)C(O)NC1O
88 241.0818979361 CC1=CN(C=C=C(O)C(=O)C=[OH+])C(O)NC1O Intermediate Fragment 
89 243.0975480001 CC1CN(C2C=C(O)C(=C=[OH+])O2)C(O)NC1O
90 225.0869833161 CC1=CN(C2C=CC(=C=[OH+])O2)C(O)NC1O
91 243.0975480001 CC1CN(C=C=C(O)C(=O)C=[OH+])C(O)NC1O Intermediate Fragment 
92 243.0975480001 CC1CN(C(O)=C=C(O)C#C[OH2+])C(O)NC1O Intermediate Fragment 
93 169.0607685681 C=C([OH2+])N1C=C(C)C(=O)N=C1O
94 167.0451185041 [CH+]=C(O)N1C=C(C)C(=O)N=C1O
95 73.0284058201 OCC#C[OH2+]
96 75.0440558841 OCC=C[OH2+]
97 157.0607685681 CC1=CN(C=[OH+])C(O)NC1=O
98 155.0451185041 CC1=CN(C=[OH+])C(O)=NC1=O
99 225.0869833161 CC1=CN(C=C=C(O)C#C[OH2+])C(O)NC1O
100 269.0768125561 CC1=CN(C2C=C(O)C(=C=[OH+])O2)C(O)N(CO)C1=O
101 269.0768125561 CC1=CN(C=C=C(O)C(=O)C=[OH+])C(O)N(CO)C1=O Intermediate Fragment 
102 269.0768125561 CC1=CN(C2C=CC(=C=[OH+])O2)C(O)N(C(O)O)C1=O
103 239.0662478721 CC1=CN(C2C=CCO2)C(=O)N(C(=O)O)C1=[OH+]
104 101.0597059481 [OH2+]CC1CC=CO1
105 221.0556831881 CC1=CN(C2C=CC(=C=[OH+])O2)C(O)=NC1=O
106 223.0713332521 CC1=CN(C2C=CC(=C=[OH+])O2)C(O)NC1=O
107 251.0662478721 CC1=CN(C2C=CC(=C=[OH+])O2)C(=O)N(CO)C1=O
108 269.0768125561 CC1=CN(C=C=CC(=O)C=[OH+])C(O)N(C(O)O)C1=O Intermediate Fragment 
109 269.0768125561 CC(C=O)=CN(C(O)=NC(O)O)C1C=CC(=C=[OH+])O1 Intermediate Fragment 
110 269.0768125561 CC(=CN(C=O)C1C=CC(=C=[OH+])O1)C(=O)NC(O)O Intermediate Fragment 
111 182.0811696641 CC=C[NH+](CO)C1C=CC(=C=O)O1
112 269.0768125561 CC(=CN=C1C=CC(=C=[OH+])O1)C(=O)N(CO)C(O)O Intermediate Fragment 
113 287.0873772401 C=C(OC(=C=[OH+])CO)N1C=C(C)C(=O)N(C(O)O)C1O Intermediate Fragment 
114 197.0556831881 C#CN1C=C(C)C(=[OH+])N(C(O)O)C1=O
115 153.0658539481 C#CN1C=C(C)C(=[OH+])NC1O
116 199.0713332521 C#CN1C=C(C)C(=[OH+])N(C(O)O)C1O
117 213.0505978081 C=C([OH2+])N1C=C(C)C(=O)N(C(=O)O)C1=O
118 213.0505978081 C=C(O)N(C#[O+])C=C(C)C(=O)N=C(O)O Intermediate Fragment 
119 185.0556831881 C=C(O)[NH+]=C=C(C)C(=O)N=C(O)O
120 215.0662478721 C=C([OH2+])N1C=C(C)C(=O)N(C(O)O)C1=O
121 197.0556831881 C=C([OH2+])N1C=C(C)C(=O)N(C=O)C1=O
122 215.0662478721 C=C([OH2+])N(C=O)C=C(C)C(=O)N=C(O)O Intermediate Fragment 
123 287.0873772401 C=C(O)C(=C=[OH+])OCN1C=C(C)C(=O)N(C(O)O)C1O Intermediate Fragment 
124 183.0400331241 [CH2+]N1C=C(C)C(=O)N(C(=O)O)C1=O
125 185.0556831881 CC1=CN(C)C(=O)N(C(=O)O)C1=[OH+]
126 87.0440558841 C=C(O)C=C[OH2+]
127 201.0505978081 CC1=CN(C=[OH+])C(=O)N(C(O)O)C1=O
128 183.0400331241 CC1=CN(C=[OH+])C(=O)N(C=O)C1=O
129 199.0349477441 CC1=CN(C=[OH+])C(=O)N(C(=O)O)C1=O
130 287.0873772401 CC1=CN(C=C=C(O)C(=O)C=[OH+])C(O)N(C(O)O)C1O Intermediate Fragment 
131 203.1026333801 C#CN1CC(C)C([OH2+])N(C(O)O)C1O
132 203.1026333801 C#CN(C=C(C)C[OH2+])C(O)NC(O)O Intermediate Fragment 
133 201.0869833161 C#CN1C=C(C)C([OH2+])N(C(O)O)C1O
134 195.0400331241 C#CN1C=C(C)C(=[OH+])N(C(=O)O)C1=O
135 195.0400331241 C#CN=C=C(C)C(=[OH+])N(C=O)C(=O)O Intermediate Fragment 
136 87.0076703761 O=CC(=[OH+])C=O
137 89.0233204401 O=CC(=[OH+])CO
138 71.0127557561 O=CC#C[OH2+]
139 71.0127557561 CC(=O)C#[O+]
140 73.0284058201 CC(=[OH+])C=O
141 93.0546205681 OCC([OH2+])CO
142 75.0440558841 CC(=[OH+])CO
143 187.0713332521 CC1=CN(C)C(=O)N(C(O)O)C1=[OH+]
144 269.0768125561 CC1=CN(C=C=C(O)C#C[OH2+])C(O)N(C(O)O)C1=O
145 251.0662478721 C#CC(O)=C=CN1C=C(C)C(=[OH+])N(C(O)O)C1=O
146 101.0597059481 C=C=C(O)CC[OH2+]
147 223.0713332521 CC1=CN(C=C=C(O)C#C[OH2+])C(O)NC1=O
148 251.0662478721 CC1=CN(C=C=C(O)C#C[OH2+])C(=O)N(CO)C1=O
149 251.0662478721 CC1=CN(CC#CC#C[OH2+])C(=O)N(C(O)O)C1=O
150 227.0662478721 CC1=CN(CC#CO)C(=O)N(C(O)O)C1=[OH+]
151 225.0505978081 CC1=CN(CC#CO)C(=O)N(C(=O)O)C1=[OH+]
152 223.0349477441 CC1=CN([CH+]C#CO)C(=O)N(C(=O)O)C1=O
153 269.0768125561 CC(=CN=C=C=C(O)C#C[OH2+])C(=O)N(CO)C(O)O Intermediate Fragment 
154 269.0768125561 CC(=CN(C=O)C=C=C(O)C#C[OH2+])C(=O)NC(O)O Intermediate Fragment 
155 182.0811696641 CC=C[NH+](C=C=C(O)C#CO)CO
156 241.0818979361 CC(=C[NH+]=C=C=C(O)C#CO)C(O)NC(O)O
157 269.0768125561 CC(C=O)=CN(C=C=C(O)C#C[OH2+])C(O)=NC(O)O Intermediate Fragment 
158 241.0818979361 CC#C[NH+](C=C=C(O)C#CO)C(O)NC(O)O
159 182.0811696641 CC(CO)C[NH+]=C=C=C(O)C#CO
160 180.0655196001 CC(=C[NH+]=C=C=C(O)C#CO)CO
161 269.0768125561 CC=CN(C=C=C(O)C#C[OH2+])C(=O)N(C=O)C(O)O Intermediate Fragment 
162 231.0975480001 CC1=CN(CC#CO)C(O)N(C(O)O)C1[OH2+]
163 183.0764186321 CC1=CN(CC#CO)C(O)NC1=[OH+]
164 229.0818979361 CC1=CN(CC#CO)C(O)N(C(O)O)C1=[OH+]
165 211.0713332521 CC1=CN(CC#CO)C(=O)N(CO)C1=[OH+]
166 211.0713332521 C#CCN1C=C(C)C(=[OH+])N(C(O)O)C1=O
167 229.0818979361 CC(=CN(C=O)CC#CO)C(=[OH+])NC(O)O Intermediate Fragment 
168 209.0556831881 CC1=CN(CC#CO)C(=O)N(C=O)C1=[OH+]
169 209.0556831881 C#CCN1C=C(C)C(=[OH+])N(C(=O)O)C1=O
170 227.0662478721 CC(=CN=CC#CO)C(=[OH+])N(C=O)C(O)O Intermediate Fragment 
171 156.0291340921 C=C(C)C(=O)[N+](=C=O)C(=O)O
172 110.0600402961 CC=C[NH+]=CC#CO
173 227.0662478721 CC(=CN(C=O)CC#CO)C(=[OH+])N=C(O)O Intermediate Fragment 
174 140.0706049801 CC#C[NH+](CO)CC#CO
175 227.0662478721 CC=CN(CC#CO)C(=O)N(C=[OH+])C(=O)O Intermediate Fragment 
176 207.0400331241 CC1=CN(CC#CO)C(=O)N(C#[O+])C1=O
177 225.0505978081 CC(=CN=CC#CO)C(=[OH+])N(C=O)C(=O)O Intermediate Fragment 
178 63.0440558841 OCC[OH2+]
179 285.0717271761 CC1=CN(C=C=C(O)C(=[OH+])C=O)C(O)N(C(O)O)C1=O
180 287.0873772401 CC1=CN(C(O)=C=C(O)C#C[OH2+])C(O)N(C(O)O)C1O Intermediate Fragment 
181 219.0975480001 C=C([OH2+])N1C=C(C)C(O)N(C(O)O)C1O
182 217.0818979361 C=C([OH2+])N1C=C(C)C(=O)N(C(O)O)C1O
183 211.0349477441 [CH+]=C(O)N1C=C(C)C(=O)N(C(=O)O)C1=O
184 68.9971056921 [O+]#CC#CO
185 203.0662478721 CC1=CN(C=[OH+])C(O)N(C(O)O)C1=O
186 181.0243830601 CC1=CN(C#[O+])C(=O)N(C=O)C1=O
187 199.0349477441 CC(=CN=C=[OH+])C(=O)N(C=O)C(=O)O Intermediate Fragment 
188 199.0349477441 CC(=CN(C#[O+])C=O)C(=O)N=C(O)O Intermediate Fragment 
189 110.0236547881 CC#CN(C#[O+])C=O
190 199.0349477441 C=C=CN(C=[OH+])C(=O)N(C=O)C(=O)O Intermediate Fragment 
191 197.0192976801 CC1=CN(C#[O+])C(=O)N(C(=O)O)C1=O
192 197.0192976801 CC(=CN=C=O)C(=O)N(C#[O+])C(=O)O Intermediate Fragment 
193 71.0491412641 C=CC(=C)[OH2+]
194 71.0491412641 C#CCC[OH2+]
195 91.0753560121 CC(O)CC[OH2+]
196 73.0647913281 C=C([OH2+])CC
197 245.0768125561 CC1=CN(C(=[OH+])C#CO)C(O)N(C(O)O)C1O
198 243.0611624921 CC1=CN(C(=[OH+])C#CO)C(O)N(C(O)O)C1=O
199 199.0713332521 CC1=CN(C(=[OH+])C#CO)C(O)NC1O
200 243.0611624921 CC(=CN(C=O)C(=[OH+])C#CO)C(=O)NC(O)O Intermediate Fragment 
201 241.0455124281 CC1=CN(C(=[OH+])C#CO)C(=O)N(C(O)O)C1=O
202 287.0873772401 CC1=CN(C(=C=CO)OC#C[OH2+])C(O)N(C(O)O)C1O Intermediate Fragment 
203 257.0768125561 C=C([OH+]C#CO)N1C=C(C)C(=O)N(C(O)O)C1O
204 287.0873772401 CC=C(O)N(C(=O)N(C)C1C=C(O)C(=C=[OH+])O1)C(O)O Intermediate Fragment 
205 261.0717271761 C[NH+](C1C=C(O)C(=C=O)O1)C(O)N(C=O)C(O)O
206 233.0768125561 C[NH+](C(O)NC(O)O)C1C=C(O)C(=C=O)O1
207 172.0604342201 C[NH+](CO)C1C=C(O)C(=C=O)O1
208 146.0811696641 C[NH2+]C1C=C(O)C(CO)O1
209 233.0768125561 C[NH+](C=C=C(O)C(=O)C=O)C(O)NC(O)O Intermediate Fragment 
210 231.0611624921 C[NH+](C(O)=NC(O)O)C1C=C(O)C(=C=O)O1
211 229.0455124281 C[NH+](C(O)=NC(=O)O)C1C=C(O)C(=C=O)O1
212 174.0760842841 C[NH+](CO)C1C=C(O)C(=CO)O1
213 144.0655196001 C[NH2+]C1C=C(O)C(=CO)O1
214 172.0604342201 C[NH+](C=C=C(O)C(=O)C=O)CO Intermediate Fragment 
215 82.0287401681 C#C[N+](=C)C=O
216 170.0447841561 C[NH+](C=O)C1C=C(O)C(=C=O)O1
217 55.0178411361 C=C=C=[OH+]
218 148.0968197281 C[NH2+]C1CC(O)C(CO)O1
219 128.0706049801 C=C1OC([NH2+]C)C=C1O
220 128.0706049801 C[NH2+]C1C=CC(=CO)O1
221 142.0134840281 C#CC(=O)[NH+](C=O)C(=O)O
222 98.0236547881 C=CC(=O)[NH+]=C=O
223 287.0873772401 CC=CN(C1C=C(O)C(=C=[OH+])O1)C(O)N(C=O)C(O)O Intermediate Fragment 
224 200.0917343481 CCC[NH+](CO)C1C=C(O)C(=C=O)O1
225 198.0760842841 CC=C[NH+](CO)C1C=C(O)C(=C=O)O1
226 172.0968197281 CCC[NH2+]C1C=C(O)C(=CO)O1
227 130.0498695361 [NH3+]C1C=C(O)C(=CO)O1
228 142.0498695361 C[NH2+]C1C=C(O)C(=C=O)O1
229 172.0968197281 CCC[NH2+]C(O)=C=C(O)C=CO Intermediate Fragment 
230 170.0811696641 CCC[NH2+]C1C=C(O)C(=C=O)O1
231 168.0655196001 CCC[NH+]=C1C=C(O)C(=C=O)O1
232 72.0080047241 O=C=[NH+]C=O
233 287.0873772401 CC(C=O)=CN(C(O)NC(O)O)C1C=C(O)C(=C=[OH+])O1 Intermediate Fragment 
234 259.0924626201 CC=C[NH+](C(O)NC(O)O)C1C=C(O)C(=C=O)O1
235 226.0709989041 CC(C=O)=C[NH+](CO)C1C=C(O)C(=C=O)O1
236 200.0917343481 CC(CO)C[NH2+]C1C=C(O)C(=C=O)O1
237 200.0917343481 CC(CO)C[NH2+]C(O)=C=C(O)C#CO Intermediate Fragment 
238 198.0760842841 CC(CO)C[NH+]=C1C=C(O)C(=C=O)O1
239 196.0604342201 CC(=C[NH+]=C1C=C(O)C(=C=O)O1)CO
240 287.0873772401 CC(=CN(CO)C1C=C(O)C(=C=[OH+])O1)C(=O)NC(O)O Intermediate Fragment 
241 134.0811696641 C=C(C)C(O)[NH2+]C(O)O
242 43.0542266441 CC=[CH3+]
243 45.0698767081 CC[CH4+]
244 71.0491412641 C=C(C)C=[OH+]
245 73.0647913281 C=C(C)C[OH2+]
246 132.0655196001 C=C(C)C(=O)[NH2+]C(O)O
247 69.0334912001 C=C(C)C#[O+]
248 84.0443902321 [CH+]=C(C)C(N)=O
249 39.0229265161 [C+]#CC
250 112.0393048521 C=C(C)C(=O)[NH+]=C=O
251 112.0029193441 [C+]#CC(=O)N=C(O)O
252 110.0236547881 [CH+]=C(C)C(=O)N=C=O
253 156.0291340921 O=C=C1OC(=[NH+]CO)C=C1O
254 158.0447841561 O=C=C1OC([NH2+]CO)C=C1O
255 120.0655196001 CCC(=O)[NH2+]C(O)O
256 118.0498695361 CCC(=O)[NH+]=C(O)O
257 194.0447841561 CC#C[NH+](C=O)C1C=C(O)C(=C=O)O1
258 168.0291340921 C=[N+](C=O)C1C=C(O)C(=C=O)O1
259 166.0498695361 CC=C[NH+]=C1C=C(O)C(=C=O)O1
260 196.0604342201 CC#C[NH+](CO)C1C=C(O)C(=C=O)O1
261 86.0600402961 CC=C=[NH+]CO
262 196.0604342201 CC#C[NH+](C=C=C(O)C(=O)C=O)CO Intermediate Fragment 
263 110.0600402961 C#C[NH+](C#CC)CO
264 108.0443902321 C#C[NH+](C#CC)C=O
265 224.0553488401 CC(C=O)=C[NH+](C=O)C1C=C(O)C(=C=O)O1
266 259.0924626201 CC(C[NH+]=C1C=C(O)C(=C=O)O1)C(O)NC(O)O
267 229.0818979361 CC(=C[NH+]=C1C=C(O)CO1)C(=O)NC(O)O
268 241.0818979361 C=C1OC(=[NH+]C=C(C)C(=O)NC(O)O)C=C1O
269 149.0920686961 CC(C=[NH2+])C(O)NC(O)O
270 145.0607685681 CC(C#[NH+])=C(O)NC(O)O
271 128.0342194721 [NH3+]C1C=C(O)C(=C=O)O1
272 140.0342194721 C[NH+]=C1C=C(O)C(=C=O)O1
273 215.1026333801 CC(C[NH2+]C1C=C(O)C(=C=O)O1)C(N)O
274 241.0818979361 CC(=C[NH+]=C1C=CC(=C=O)O1)C(O)NC(O)O
275 259.0924626201 C=C([NH+]=C=C(C)C(O)NC(O)O)OC(=C=O)CO Intermediate Fragment 
276 169.0607685681 C#C[NH+]=C=C(C)C(=O)NC(O)O
277 187.0713332521 C=C(O)[NH+]=C=C(C)C(=O)NC(O)O
278 259.0924626201 C=C(O)C(=C=O)OC=[NH+]C=C(C)C(O)NC(O)O Intermediate Fragment 
279 155.0451185041 C=[N+]=C=C(C)C(=O)N=C(O)O
280 157.0607685681 C=[NH+]C=C(C)C(=O)N=C(O)O
281 173.0556831881 CC(=C[NH+]=C=O)C(=O)NC(O)O
282 259.0924626201 CC(C[NH+]=C=C=C(O)C(=O)C=O)C(O)NC(O)O Intermediate Fragment 
283 259.0924626201 CC(C=[NH+]C(O)=C=C(O)C#CO)C(O)NC(O)O Intermediate Fragment 
284 191.1026333801 C=C(O)[NH+]=CC(C)C(O)NC(O)O
285 189.0869833161 C=C(O)[NH+]=C=C(C)C(O)NC(O)O
286 183.0400331241 [CH+]=C(O)N=C=C(C)C(=O)N=C(O)O
287 175.0713332521 CC(=C[NH+]=C=O)C(O)NC(O)O
288 169.0243830601 CC(=C=[N+]=C=O)C(=O)N=C(O)O
289 217.0818979361 CC(C=[NH+]C(=O)C#CO)C(O)NC(O)O
290 215.0662478721 CC(=C=[NH+]C(=O)C#CO)C(O)NC(O)O
291 213.0505978081 CC(=C=[NH+]C(=O)C#CO)C(=O)NC(O)O
292 47.0491412641 CC[OH2+]
293 259.0924626201 CC(C=[NH+]C(=C=CO)OC#CO)C(O)NC(O)O Intermediate Fragment 
294 199.0713332521 CC(=C[NH+]=CC#CO)C(=O)NC(O)O
295 257.0768125561 CC(=C[NH+]=C1C=C(O)C(=C=O)O1)C(O)NC(O)O
296 147.0764186321 CC(C#[NH+])C(O)NC(O)O
297 257.0768125561 CC(=C[NH+]=C=C=C(O)C(=O)C=O)C(O)NC(O)O Intermediate Fragment 
298 257.0768125561 CC(=C=[NH+]C(O)=C=C(O)C#CO)C(O)NC(O)O Intermediate Fragment 
299 257.0768125561 CC(=C=[NH+]C(=C=CO)OC#CO)C(O)NC(O)O Intermediate Fragment 
300 255.0611624921 CC(=C[NH+]=C1C=C(O)C(=C=O)O1)C(=O)NC(O)O
301 287.0873772401 CC(=CN=C1C=C(O)C(=C=[OH+])O1)C(O)N(CO)C(O)O Intermediate Fragment 
302 162.0760842841 C=C(C)C(=O)[NH+](CO)C(O)O
303 158.0447841561 C=C(C)C(=O)[NH+](C=O)C(=O)O
304 287.0873772401 C=C(C)C(O)N(C(O)O)C(O)N=C1C=C(O)C(=C=[OH+])O1 Intermediate Fragment 
