#In-silico ESI-MS/MS [M+H]+ Spectra
#PREDICTED BY CFM-ID 4.0.8
#SMILES=O1C(CO)C(CC1N1C=CC2=NC(C(N2C1=O)CC(=O)CCCCC)O)O
#InChiKey=ILUMYSOWGVTRFO-UHFFFAOYSA-N
energy0
266.14992 85.30 2 67 54 58 60 62 53 64 61 59 (33.844 0.51248 0.045038 0.028851 0.015378 0.011913 0.010272 0.0073998 0.0070183 0.0015707)
364.18670 19.75 16 115 5 130 117 171 133 15 118 17 18 119 175 19 (2.9605 2.9265 1.2033 0.54437 0.16295 0.086264 0.035567 0.026443 0.020156 0.017312 0.00046086 0.00028239 0.00021555 0.00021075)
382.19726 100.00 0 185 134 177 206 267 184 180 239 240 252 205 (38.718 0.71382 0.46124 0.26705 0.11229 0.076497 0.03958 0.022236 0.012039 0.0039257 0.0015889 7.4979e-05)
energy1
43.01784 4.77 98 (1.0074)
45.03349 3.40 90 (0.71708)
57.03349 3.58 84 106 (0.71067 0.045597)
71.08553 5.23 38 (1.1031)
85.06479 4.15 103 (0.87689)
97.10118 7.75 97 (1.6369)
99.04406 8.56 79 7 76 (1.1059 0.60519 0.095306)
99.08044 3.74 31 104 (0.58537 0.20402)
113.09609 5.20 9 (1.0971)
115.11174 9.14 8 (1.9297)
152.04545 7.01 27 (1.479)
164.04545 12.13 32 (2.5604)
166.06110 17.33 23 (3.6595)
168.07675 12.92 33 (2.7282)
194.05602 3.41 40 (0.72028)
222.08732 4.30 49 (0.90753)
238.15500 6.59 57 68 (1.3577 0.032826)
248.13935 61.12 36 52 24 (6.5608 6.2944 0.049039)
250.15500 20.86 116 132 (2.9866 1.4171)
264.13427 6.81 72 (1.4379)
266.14992 100.00 2 67 54 62 64 58 53 60 59 61 (17.532 1.7451 0.75042 0.60736 0.22292 0.10701 0.079848 0.035514 0.023606 0.0077698)
290.14992 4.06 149 181 (0.68209 0.17452)
292.16557 9.26 147 146 (1.4452 0.51026)
308.16048 10.62 140 152 150 151 229 (2.029 0.10567 0.070245 0.037292 0.00052181)
310.17613 3.67 145 148 (0.6855 0.089379)
320.16048 5.65 138 174 188 (1.0106 0.1654 0.016862)
322.17613 11.88 173 136 (1.9667 0.54068)
346.17613 11.38 11 14 131 172 (1.0719 0.80227 0.487 0.041668)
364.18670 10.66 5 115 130 171 16 117 18 133 175 15 17 118 19 119 (0.89994 0.44976 0.25292 0.22572 0.0969 0.078131 0.05948 0.048895 0.04333 0.042245 0.021313 0.015655 0.011706 0.0036746)
382.19726 5.34 0 134 180 185 206 177 252 240 184 267 239 205 (0.49125 0.42194 0.085014 0.059184 0.022486 0.019667 0.0082982 0.0080317 0.0070731 0.0026484 0.00077547 2.0017e-05)
energy2
43.01784 48.92 98 (2.9366)
43.05423 16.07 93 (0.96467)
45.03349 85.77 90 (5.1482)
55.05423 27.75 99 (1.6657)
57.03349 44.73 84 106 (2.6586 0.026458)
57.06988 17.80 92 (1.0683)
59.04914 15.91 83 100 (0.92607 0.029016)
69.06988 26.52 39 (1.5921)
71.04914 40.83 101 169 (2.0564 0.39443)
95.08553 56.73 105 (3.405)
97.10118 55.19 97 (3.3128)
99.08044 30.73 31 104 (1.4606 0.38396)
113.09609 19.89 9 (1.1937)
115.11174 31.18 8 (1.8717)
125.09609 41.46 66 (2.4884)
140.04545 26.68 247 (1.6013)
164.04545 35.05 32 (2.1039)
166.06110 100.00 23 (6.0024)
168.07675 24.59 33 (1.476)
196.07167 26.77 41 (1.6071)
236.13935 18.97 65 (1.1388)
248.13935 49.46 36 52 24 (1.533 1.1653 0.27063)
266.14992 53.33 67 2 64 62 61 60 54 59 53 58 (1.3486 1.1573 0.2524 0.10155 0.082134 0.063799 0.062088 0.059879 0.046937 0.026674)
282.18122 15.16 230 197 (0.67589 0.23405)
290.14992 16.26 181 149 (0.89327 0.082825)
292.16557 45.54 147 146 (2.028 0.7052)
294.18122 46.93 182 (2.8168)
296.19687 30.45 183 (1.8279)
322.17613 39.64 173 136 (2.3559 0.023418)
324.19178 18.61 179 (1.1171)

0 382.1972620361 CCCCCC(=O)CC1C(O)N=C2C=CN(C3CC(O)C(C[OH2+])O3)C(=O)N21
1 350.1710472881 CCCCCC(O)CC1=C(O)N=C2C=CN(C3=CC(O)=CO3)C([OH2+])N21
2 266.1499179201 CCCCCC(O)CC1C(O)=NC2=CC=NC(=[OH+])N21
3 352.1866973521 CCCCCC(O)CC1C(O)N=C2C=CN(C3=CC(O)=CO3)C([OH2+])N21
4 354.2023474161 CCCCCC(O)CC1C(O)NC2C=CN(C3=CC(O)=CO3)C([OH2+])N21
5 364.1866973521 C=C1OC(N2C=CC3=NC(O)=C(CC(O)CCCCC)N3C2[OH2+])C=C1O
6 268.1655679841 CCCCCC(O)CC1C(O)=NC2=CC=NC([OH2+])N21
7 99.0440558841 C=C1OC=CC1[OH2+]
8 115.1117415201 C=C([OH2+])CCCCC
9 113.0960914561 C=C([OH2+])C=CCCC
10 266.1135324121 C=C1OC(N2C=CC3=NC(O)C(C)N3C2[OH2+])C=C1O
11 346.1761326681 C=C1OC(N2C=CC3=NC(O)=C(CCCCCCC)N3C2=[OH+])C=C1O
12 294.1084470321 C=C1OC(N2C=CC3=NC(O)=C(CCO)N3C2[OH2+])C=C1O
13 296.1240970961 C=C1OC(N2C=CC3=NC(O)C(CCO)N3C2[OH2+])C=C1O
14 346.1761326681 C=C1C=CC(N2C=CC3=NC(O)=C(CC(O)CCCCC)N3C2=[OH+])O1
15 364.1866973521 C#COC(=C=CO)N1C=CC2=NC(O)C(CC(O)CCCCC)N2C1[OH2+] Intermediate Fragment 
16 364.1866973521 C=C(CO)OC(=C)N1C=CC2=NC(O)=C(CC(O)CCCCC)N2C1=[OH+] Intermediate Fragment 
17 364.1866973521 CCCCCC(O)CC1=C(O)N=C2C=CN(C=C=C(O)C(C)=O)C([OH2+])N21 Intermediate Fragment 
18 364.1866973521 C=C1OC(N2C=CC(=NC(O)=CCC(O)CCCCC)N=C2[OH2+])C=C1O Intermediate Fragment 
19 364.1866973521 C=C1OC(N2C=CC(=NCO)N(C=CC(O)CCCCC)C2=[OH+])C=C1O Intermediate Fragment 
20 272.1968681121 CCCCCC(O)CC1C(O)NC2CC=NC([OH2+])N21
21 117.1273915841 CCCCCC(C)[OH2+]
22 270.1812180481 CCCCCC(O)CC1C(O)NC2=CC=NC([OH2+])N21
23 166.0611029161 CC1C(O)=NC2=CC=NC(=[OH+])N21
24 248.1393532361 CCCCCC([OH2+])=C=C1C(O)=NC2=CC=NCN12
25 111.0804413921 C=C([OH2+])C#CCCC
26 107.0491412641 C=C([OH2+])C#CC#CC
27 152.0454528521 OC1=NC2=CC=NC(=[OH+])N2C1
28 154.0611029161 OC1=NC2=CC=NC([OH2+])N2C1
29 103.1117415201 CCCCCC[OH2+]
30 101.0960914561 CCCCCC=[OH+]
31 99.0804413921 CCCCC=C=[OH+]
32 164.0454528521 C=C1C(O)=NC2=CC=NC(=[OH+])N12
33 168.0767529801 CC1C(O)=NC2=CC=NC([OH2+])N21
34 170.0924030441 CC1C(O)NC2=CC=NC([OH2+])N21
35 174.1237031721 CC1C(O)NC2CCNC([OH2+])N21
36 248.1393532361 CCCCCCC=C1C(O)=NC2=CC=NC(=[OH+])N21
37 73.1011768361 CCCC[CH4+]
38 71.0855267721 CCCC=[CH3+]
39 69.0698767081 [CH2+]#CCCC
40 194.0560175361 OCC=C1C(O)=NC2=CC=NC(=[OH+])N21
41 196.0716676001 OCCC1C(O)=NC2=CC=NC(=[OH+])N21
42 198.0873176641 OCCC1C(O)=NC2=CC=NC([OH2+])N21
43 200.1029677281 OCCC1C(O)NC2=CC=NC([OH2+])N21
44 202.1186177921 OCCC1C(O)NC2CC=NC([OH2+])N21
45 208.0716676001 CC(O)C=C1C(O)=NC2=CC=NC(=[OH+])N21
46 210.0873176641 CC(O)CC1C(O)=NC2=CC=NC(=[OH+])N21
47 212.1029677281 CC(O)CC1C(O)=NC2=CC=NC([OH2+])N21
48 214.1186177921 CC(O)CC1C(O)NC2=CC=NC([OH2+])N21
49 222.0873176641 CCC(O)C=C1C(O)=NC2=CC=NC(=[OH+])N21
50 224.1029677281 CCC(O)CC1C(O)=NC2=CC=NC(=[OH+])N21
51 236.1029677281 CCCC(O)C=C1C(O)=NC2=CC=NC(=[OH+])N21
52 248.1393532361 CCCCCC(O)C=C1C=NC2=CC=NC(=[OH+])N12
53 266.1499179201 CCCCCC(O)CC1C(O)=NC(=C=C=N)N1C=[OH+] Intermediate Fragment 
54 266.1499179201 CCCCCC(O)CC1=NC(=C=C=NC[OH2+])N=C1O Intermediate Fragment 
55 223.1441042681 C#CC1=NC(O)=C(CC([OH2+])CCCCC)N1
56 221.1284542041 C#CC1=NC(O)=C(C=C([OH2+])CCCCC)N1
57 238.1550033001 CCCCCC(O)CC1NC(=CC#[NH+])N=C1O
58 266.1499179201 C=C=NC(=[OH+])N1C=NC(O)=C1CC(O)CCCCC Intermediate Fragment 
59 266.1499179201 C=NC(=[OH+])N1C(=C)N=C(O)C1=CC(O)CCCCC Intermediate Fragment 
60 266.1499179201 C=C=C1N=C(O)C(=CC(O)CCCCC)N1C(N)=[OH+] Intermediate Fragment 
61 266.1499179201 CCCCCC(O)C=C(C(=N)O)N1C=CC=NC1=[OH+] Intermediate Fragment 
62 266.1499179201 CCCCCC(O)C=CC(O)=NC1=CC=NC([OH2+])=N1 Intermediate Fragment 
63 155.1066561401 CCCCCC([OH2+])=CC#CO
64 266.1499179201 CCCCCC(O)C=CN1C(=[OH+])N=CC=C1N=CO Intermediate Fragment 
65 236.1393532361 CCCCCC(O)C#CN1C(=O)N=CC=C1[NH3+]
66 125.0960914561 C#CC(=[OH+])CCCCC
67 266.1499179201 CCCCCC(O)=CC(=CO)N1C(=[OH+])N=CC=C1N Intermediate Fragment 
68 238.1550033001 CCCCCC(O)C=CN1C(=O)N=CC=C1[NH3+]
69 234.1237031721 CCCCCC(=O)C#CN1C(=O)N=CC=C1[NH3+]
70 151.0753560121 CCCC#CC([OH2+])=CC#CO
71 153.0910060761 CCCC=CC([OH2+])=CC#CO
72 264.1342678561 CCCC=CC(O)=CC(=CO)N1C(=O)N=CC=C1[NH3+]
73 246.1237031721 CCCCCC=C=C1C(O)=NC2=CC=NC(=[OH+])N12
74 115.0389705041 OC1CCOC1=C=[OH+]
75 117.0546205681 OC1CCOC1=C[OH2+]
76 99.0440558841 [OH+]=C=C1CCCO1
77 117.0546205681 OCCC(O)C#C[OH2+] Intermediate Fragment 
78 89.0597059481 CC(O)C=C[OH2+]
79 99.0440558841 CC=C(O)C#C[OH2+]
80 117.0546205681 OCCCOC#C[OH2+] Intermediate Fragment 
81 117.0546205681 CCOC(=C=[OH+])CO Intermediate Fragment 
82 117.0546205681 CCC(O)C(=O)C=[OH+] Intermediate Fragment 
83 59.0491412641 CC=C[OH2+]
84 57.0334912001 CC#C[OH2+]
85 61.0284058201 OCC=[OH+]
86 119.0702706321 OC1CCOC1C[OH2+]
87 101.0597059481 C=C1OCCC1[OH2+]
88 101.0597059481 [OH2+]C=C1CCCO1
89 119.0702706321 OCCC(O)C=C[OH2+] Intermediate Fragment 
90 45.0334912001 C=C[OH2+]
91 99.1168269001 CCCCCC=[CH3+]
92 57.0698767081 CCC=[CH3+]
93 43.0542266441 CC=[CH3+]
94 75.0804413921 CCC(C)[OH2+]
95 87.0804413921 C=C([OH2+])CCC
96 101.0960914561 C=C([OH2+])CCCC
97 97.1011768361 [CH2+]#CCCCCC
98 43.0178411361 C#C[OH2+]
99 55.0542266441 [CH2+]#CCC
100 59.0491412641 C=C(C)[OH2+]
101 71.0491412641 C=CC(=C)[OH2+]
102 73.0647913281 C=C([OH2+])CC
103 85.0647913281 C=C([OH2+])C=CC
104 99.0804413921 C=C([OH2+])C=CCC
105 95.0855267721 [CH2+]#CC=CCCC
106 57.0334912001 [CH+]=C(C)O
107 83.0491412641 C=C([OH2+])C#CC
108 97.0647913281 C=C([OH2+])C#CCC
109 93.0698767081 [CH2+]#CC#CCCC
110 270.1084470321 OC1=CC(N2CCC3NC(O)CN3C2O)OC1=C=[OH+]
111 280.0927969681 CC1C(O)N=C2C=CN(C3C=C(O)C(=C=[OH+])O3)C(O)N21
112 282.1084470321 CC1C(O)NC2C=CN(C3C=C(O)C(=C=[OH+])O3)C(O)N21
113 284.1240970961 CC1C(O)NC2CCN(C3C=C(O)C(=C=[OH+])O3)C(O)N21
114 290.1710472881 CC1C(O)NC2CCN(C3CC(O)C(C[OH2+])O3)C(O)N21
115 364.1866973521 CCCCCCCC1C(O)N=C2C=CN(C3C=C(O)C(=C=[OH+])O3)C(O)N21
116 250.1550033001 CCCCCCCC1C(O)=NC2=CC=NC(=[OH+])N21
117 364.1866973521 CCCCCCCC1C(O)N=C2C=CN(C=C=C(O)C(=O)C=[OH+])C(O)N21 Intermediate Fragment 
118 364.1866973521 CCCCCCCC=C(O)N=C1C=CN(C2C=C(O)C(=C=[OH+])O2)C(O)N1 Intermediate Fragment 
119 364.1866973521 CCCCCCCCN1C(=O)N(C2C=C(O)C(=C=[OH+])O2)C=CC1=NCO Intermediate Fragment 
120 41.0385765801 [CH2+]#CC
121 310.1033616521 OCCC1C(O)N=C2C=CN(C3C=C(O)C(=C=[OH+])O3)C(O)N21
122 310.1033616521 O=C(C=[OH+])C(O)=C=CN1C=CC2=NC(O)C(CCO)N2C1O Intermediate Fragment 
123 312.1190117161 OCCC1C(O)NC2C=CN(C3C=C(O)C(=C=[OH+])O3)C(O)N21
124 314.1346617801 OCCC1C(O)NC2CCN(C3C=C(O)C(=C=[OH+])O3)C(O)N21
125 316.1503118441 OCCC1C(O)NC2CCN(C3CC(O)C(=C=[OH+])O3)C(O)N21
126 318.1659619081 OCCC1C(O)NC2CCN(C3CC(O)C(=C[OH2+])O3)C(O)N21
127 324.1190117161 CC(O)CC1C(O)N=C2C=CN(C3C=C(O)C(=C=[OH+])O3)C(O)N21
128 330.1659619081 CC(O)CC1C(O)NC2CCN(C3CC(O)C(=C=[OH+])O3)C(O)N21
129 332.1816119721 CC(O)CC1C(O)NC2CCN(C3CC(O)C(=C[OH2+])O3)C(O)N21
130 364.1866973521 CCCCCC(O)CC1CN=C2C=CN(C3C=C(O)C(=C=[OH+])O3)C(O)N21
131 346.1761326681 C=C1OC(N2C=CC3=NC=C(CC(O)CCCCC)N3C2=[OH+])C=C1O
132 250.1550033001 CCCCCC(O)CC1C=NC2=CC=NC(=[OH+])N21
133 364.1866973521 CCCCCC(O)CC1CN=C2C=CN(C=C=C(O)C(=O)C=[OH+])C(O)N21 Intermediate Fragment 
134 382.1972620361 CCCCCC(O)CC1C(O)NC2C=CN(C(O)=C=C(O)C#C[OH2+])C(O)N21 Intermediate Fragment 
135 340.1866973521 CCCCCC(O)CC1C(O)N=C2C=CN(C([OH2+])C#CO)C(O)N21
136 322.1761326681 C#CC([OH2+])N1C=CC2=NC(O)=C(CC(O)CCCCC)N2C1O
137 338.1710472881 CCCCCC(O)CC1=C(O)N=C2C=CN(C([OH2+])C#CO)C(O)N21
138 320.1604826041 C#CC([OH2+])N1C=CC2=NC(O)=C(CC(O)CCCCC)N2C1=O
139 336.1553972241 CCCCCC(O)CC1=C(O)N=C2C=CN(C([OH2+])C#CO)C(=O)N21
140 308.1604826041 C=C([OH2+])N1C=CC2=NC(O)=C(CC(O)CCCCC)N2C1=O
141 318.1448325401 C#CC([OH2+])N1C=CC2=NC(O)=C(C=C(O)CCCCC)N2C1=O
142 47.0491412641 CC[OH2+]
143 314.2074327961 C=C([OH2+])N1C=CC2NC(O)C(CC(O)CCCCC)N2C1O
144 312.1917827321 C=C([OH2+])N1C=CC2=NC(O)C(CC(O)CCCCC)N2C1O
145 310.1761326681 C=C([OH2+])N1C=CC2=NC(O)=C(CC(O)CCCCC)N2C1O
146 292.1655679841 C=C([OH2+])N1C=CC2=NC(O)=C(CCCCCCC)N2C1=O
147 292.1655679841 C#CN1C=CC2=NC(O)=C(CC(O)CCCCC)N2C1[OH2+]
148 310.1761326681 C=C([OH2+])N1C=CC(=N)N(C(=CO)CC(O)CCCCC)C1=O Intermediate Fragment 
149 290.1499179201 C=C([OH2+])N1C=CC2=NC(O)=C(C=CCCCCC)N2C1=O
150 308.1604826041 C=C([OH2+])N(C=O)C=C=C1N=C(O)C(CC(O)CCCCC)=N1 Intermediate Fragment 
151 308.1604826041 C=C([OH2+])N1C=CC(=NCO)N(C#CC(O)CCCCC)C1=O Intermediate Fragment 
152 308.1604826041 C=C([OH2+])N1C=CC(=N)N(C(C=C(O)CCCCC)=CO)C1=O Intermediate Fragment 
153 306.1448325401 C=C([OH2+])N1C=CC2=NC(O)=C(C=C(O)CCCCC)N2C1=O
154 68.9971056921 [O+]#CC#CO
155 71.0127557561 O=CC#C[OH2+]
156 73.0284058201 OCC#C[OH2+]
157 55.0178411361 C#CC=[OH+]
158 75.0440558841 OCC=C[OH2+]
159 77.0597059481 OCCC[OH2+]
160 298.1761326681 CCCCCC(O)CC1=C(O)N=C2C=CN(C[OH2+])C(O)N21
161 296.1604826041 CCCCCC(O)CC1=C(O)N=C2C=CN(C[OH2+])C(=O)N21
162 278.1499179201 CCCCCC=CC1=C(O)N=C2C=CN(C[OH2+])C(=O)N21
163 278.1499179201 CCCCCC(O)=CC1=C(O)N=C2C=CN(C)C(=[OH+])N21
164 294.1448325401 CCCCCC(O)=CC1=C(O)N=C2C=CN(C[OH2+])C(=O)N21
165 294.1448325401 CCCC=CC(O)=CC(=CO)N1C(=N)C=CN(C[OH2+])C1=O Intermediate Fragment 
166 292.1291824761 CCCC=CC(O)=CC1=C(O)N=C2C=CN(C[OH2+])C(=O)N21
167 87.0440558841 CC(O)C#C[OH2+]
168 69.0334912001 C=CC#C[OH2+]
169 71.0491412641 CCC#C[OH2+]
170 91.0753560121 CC(O)CC[OH2+]
171 364.1866973521 CCCCCC(O)CC1C(O)N=C2C=CN(C=C=C(O)C#C[OH2+])C(O)N21
172 346.1761326681 C#CC(O)=C=CN1C=CC2=NC(O)=C(CC(O)CCCCC)N2C1[OH2+]
173 322.1761326681 CCCCCC(O)CC1=C(O)N=C2C=CN(CC#CO)C([OH2+])N21
174 320.1604826041 CCCCCC(O)CC1=C(O)N=C2C=CN(CC#CO)C(=[OH+])N21
175 364.1866973521 CCCCCC(O)CC=C(O)N=C1C=CN(C=C=C(O)C#C[OH2+])C(O)N1 Intermediate Fragment 
176 380.1816119721 CCCCCC(O)CC1C(O)N=C2C=CN(C([OH2+])=C=C(O)C#CO)C(O)N21
177 382.1972620361 CCCCCC(O)CC1C(O)NC2C=CN(C(=C=CO)OC#C[OH2+])C(O)N21 Intermediate Fragment 
178 352.1866973521 C=C([OH+]C#CO)N1C=CC2=NC(O)C(CC(O)CCCCC)N2C1O
179 324.1917827321 CCCCCC(O)CC1C(O)N=C2C=CN(CC#CO)C([OH2+])N21
180 382.1972620361 C=C(OC(=C=[OH+])CO)N1C=CC2=NC(O)C(CC(O)CCCCC)N2C1O Intermediate Fragment 
181 290.1499179201 C#CN1C=CC2=NC(O)=C(CC(O)CCCCC)N2C1=[OH+]
182 294.1812180481 C#CN1C=CC2=NC(O)C(CC(O)CCCCC)N2C1[OH2+]
183 296.1968681121 C#CN1C=CC2NC(O)C(CC(O)CCCCC)N2C1[OH2+]
184 382.1972620361 C=C(O)C(=C=[OH+])OCN1C=CC2=NC(O)C(CC(O)CCCCC)N2C1O Intermediate Fragment 
185 382.1972620361 CCCCCC(O)CC1C(O)NC2C=CN(C=C=C(O)C(=O)C=[OH+])C(O)N21 Intermediate Fragment 
186 326.2074327961 CCCCCC(O)CC1C(O)NC2C=CN(CC#CO)C([OH2+])N21
187 302.1499179201 CCCCCC=CC1=C(O)N=C2C=CN(CC#CO)C(=[OH+])N21
188 320.1604826041 CCCCCC(O)C=C=C(O)N=C1C=CN(CC#CO)C([OH2+])=N1 Intermediate Fragment 
189 59.0127557561 O=C=C[OH2+]
190 63.0440558841 OCC[OH2+]
191 298.2125181761 C#CN1CCC2NC(O)C(CC(O)CCCCC)N2C1[OH2+]
192 89.0233204401 O=CC(=[OH+])CO
193 71.0127557561 CC(=O)C#[O+]
194 91.0389705041 OCC(=[OH+])CO
195 93.0546205681 OCC([OH2+])CO
196 284.1968681121 CCCCCC(O)CC1C(O)N=C2C=CN(C)C([OH2+])N21
197 282.1812180481 CCCCCC(O)CC1=C(O)N=C2C=CN(C)C([OH2+])N21
198 280.1655679841 CCCCCC(O)CC1=C(O)N=C2C=CN(C)C(=[OH+])N21
199 262.1550033001 CCCCCC=CC1=C(O)N=C2C=CN(C)C(=[OH+])N21
200 276.1342678561 CCCC=CC(O)=CC1=C(O)N=C2C=CN(C)C(=[OH+])N21
201 180.0767529801 C=C1C(O)N=C2C=CN(C)C(=[OH+])N12
202 258.1237031721 CCCC=CC#CC1=C(O)N=C2C=CN(C)C(=[OH+])N21
203 105.0546205681 CC(O)C(=[OH+])CO
204 380.1816119721 CCCCCC(O)CC1C(O)N=C2C=CN(C=C=C(O)C(=[OH+])C=O)C(O)N21
205 382.1972620361 C=C1N=C(O)C(CC(O)CCCCC)N1C(O)N(C)C1C=C(O)C(=C=[OH+])O1 Intermediate Fragment 
206 382.1972620361 CCCCCC(O)CC1NC(=C=CN(CO)C2C=C(O)C(=C=[OH+])O2)NC1O Intermediate Fragment 
207 229.1910544601 C=CC1NC(O)C(CC([OH2+])CCCCC)N1
208 227.1754043961 C#CC1NC(O)C(CC([OH2+])CCCCC)N1
209 225.1597543321 C#CC1=NC(O)C(CC([OH2+])CCCCC)N1
210 160.0604342201 O=C=C1OC([NH2+]CO)CC1O
211 160.0604342201 OC#CC(O)=CC(O)[NH2+]CO Intermediate Fragment 
212 162.0760842841 OC=C1OC([NH2+]CO)CC1O
213 144.0655196001 C=C1OC([NH2+]CO)C=C1O
214 209.1284542041 C=C1N=C(O)C(C=C([OH2+])CCCCC)=N1
215 197.1284542041 CCCCCC([OH2+])=CC1=C(O)N=CN1
216 195.1128041401 CCCC=CC([OH2+])=CC1=C(O)N=CN1
217 180.0291340921 C#C[NH+](C=O)C1C=C(O)C(=C=O)O1
218 182.0447841561 C#C[NH+](CO)C1C=C(O)C(=C=O)O1
219 184.0604342201 C=C[NH+](CO)C1C=C(O)C(=C=O)O1
220 186.0760842841 CC[NH+](CO)C1C=C(O)C(=C=O)O1
221 70.0287401681 C=C=[NH+]C=O
222 186.0760842841 CC[NH+](CO)C(O)=C=C(O)C#CO Intermediate Fragment 
223 186.0760842841 CC[NH+](C=C=C(O)C(=O)C=O)CO Intermediate Fragment 
224 354.2023474161 CCCCCC(O)CC1NC(CC[NH+]=C2C=C(O)C(=C=O)O2)NC1O
225 336.1917827321 C=C1OC(=[NH+]C#CC2NC(O)C(CC(O)CCCCC)N2)C=C1O
226 336.1917827321 CCCCCCCC1NC(C=C[NH+]=C2C=C(O)C(=C=O)O2)NC1O
227 336.1917827321 CCCCCC(O)CC1NC(C=C[NH+]=C2C=CC(=C=O)O2)NC1O
228 354.2023474161 CCCCCC(O)CC1NC(CC=[NH+]C(O)=C=C(O)C#CO)NC1O Intermediate Fragment 
229 308.1604826041 CCCCCC(O)CC1NC(C#C[NH+]=C(O)C#CO)=NC1O
230 282.1812180481 C=C(O)[NH+]=C=C=C1NC(O)C(CC(O)CCCCC)N1
231 280.1655679841 C=C(O)[NH+]=C=C=C1N=C(O)C(CC(O)CCCCC)N1
232 336.1917827321 CCCCCC(O)CC1NC(C=C[NH+]=C=C=C(O)C#CO)NC1O
233 352.1866973521 CCCCCC(O)CC1NC(C=C=[NH+]C(O)=C=C(O)C#CO)NC1O
234 354.2023474161 CCCCCC(O)CC1NC(CC=[NH+]C(=C=CO)OC#CO)NC1O Intermediate Fragment 
235 354.2023474161 C=C([NH+]=C=CC1NC(O)C(CC(O)CCCCC)N1)OC(=C=O)CO Intermediate Fragment 
236 354.2023474161 C=C(O)C(=C=O)OC=[NH+]C=CC1NC(O)C(CC(O)CCCCC)N1 Intermediate Fragment 
237 354.2023474161 CCCCCC(O)CC1NC(CC[NH+]=C=C=C(O)C(=O)C=O)NC1O Intermediate Fragment 
238 350.1710472881 CCCCCC(O)CC1NC(C#C[NH+]=C2C=C(O)C(=C=O)O2)NC1O
239 382.1972620361 CCCCCC(O)CC1C(O)NC(C=CN=C2C=C(O)C(=C=[OH+])O2)N1CO Intermediate Fragment 
240 382.1972620361 CCCCCC(O)CCC(O)N=C1C=CN(C2C=C(O)C(=C=[OH+])O2)C(O)N1 Intermediate Fragment 
241 211.0713332521 OC1C=C(N2C=CCNC2O)OC1=C=[OH+]
242 211.0713332521 O=C(C=[OH+])C(O)=C=CN1C=CCNC1O Intermediate Fragment 
243 226.0822322841 [NH3+]C1C=CN(C2C=C(O)C(=C=O)O2)C(O)N1
244 228.0978823481 [NH3+]C1CCN(C2C=C(O)C(=C=O)O2)C(O)N1
245 127.1117415201 C#CC([OH2+])CCCCC
246 254.0771469041 O=C=C1OC(N2C=CC(=[NH+]CO)NC2O)C=C1O
247 140.0454528521 OC=[NH+]C1=CC=NC(O)=N1
248 256.0927969681 O=C=C1OC(N2C=CC([NH2+]CO)NC2O)C=C1O
249 258.1084470321 O=C=C1OC(N2CCC([NH2+]CO)NC2O)C=C1O
250 260.1240970961 O=C=C1OC(N2CCC([NH2+]CO)NC2O)CC1O
251 262.1397471601 OC=C1OC(N2CCC([NH2+]CO)NC2O)CC1O
252 382.1972620361 CCCCCC(O)CCN1C(=NCO)C=CN(C2C=C(O)C(=C=[OH+])O2)C1O Intermediate Fragment 
253 350.1710472881 CCCCCC(O)CCN1C(=[NH2+])C=CN(C2C=C(O)C(=C=O)O2)C1=O
254 352.1866973521 CCCCCC(O)CCN1C(=[NH2+])C=CN(C2C=C(O)C(=C=O)O2)C1O
255 238.0822322841 CN1C(=[NH2+])C=CN(C2C=C(O)C(=C=O)O2)C1O
256 334.1761326681 CCCCCCCCN1C(=[NH2+])C=CN(C2C=C(O)C(=C=O)O2)C1=O
257 352.1866973521 CCCCCC(O)CCN1C(=[NH2+])C=CN(C(O)=C=C(O)C#CO)C1O Intermediate Fragment 
258 352.1866973521 CCCCCC(O)CCN1C(=[NH2+])C=CN(C=C=C(O)C(=O)C=O)C1O Intermediate Fragment 
259 352.1866973521 CCCCCC(O)CC=NC([NH3+])=C=CN(CO)C1C=C(O)C(=C=O)O1 Intermediate Fragment 
260 142.1226405521 CCCCCC(O)CC#[NH+]
261 354.2023474161 CCCCCC(O)CCN1C([NH3+])C=CN(C2C=C(O)C(=C=O)O2)C1O
262 336.1917827321 CCCCCCCCN1C(=[NH2+])C=CN(C2C=C(O)C(=C=O)O2)C1O
263 123.0804413921 C#CC(=[OH+])C=CCCC
264 129.1273915841 C=CC([OH2+])CCCCC
265 131.1430416481 CCCCCC([OH2+])CC
266 113.1324769641 CCCCCCC=[CH3+]
267 382.1972620361 CCCCCC(O)CC(CO)N1C(=N)C=CN(C2C=C(O)C(=C=[OH+])O2)C1O Intermediate Fragment 
268 232.1291824761 [NH3+]C1CCN(C2CC(O)C(=CO)O2)C(O)N1
269 230.1135324121 [NH3+]C1CCN(C2CC(O)C(=C=O)O2)C(O)N1
270 157.1223062041 CCCCCC([OH2+])CC#CO
271 139.1117415201 CCCCCC=CC#C[OH2+]
272 159.1379562681 CCCCCC([OH2+])CC=CO
