#In-silico ESI-MS/MS [M+H]+ Spectra
#PREDICTED BY CFM-ID 4.0.8
#SMILES=[nH]1c(nc2c(c1=O)ncn2[C@@H]1O[C@H](CO)[C@@H](C1)O)Nc1cc(ccc1NC)/N=N/c1ccccc1
#InChiKey=QCVRITCQJDDARR-CUWRHIHESA-N
energy0
361.15198 100.00 20 57 48 59 77 83 66 90 64 67 72 82 91 89 87 61 88 81 (84.598 0.10811 0.10808 0.091336 0.066775 0.054034 0.052889 0.037515 0.026732 0.026575 0.021964 0.017839 0.01312 0.012365 0.010983 0.0063713 0.0036701 0.0027919)
energy1
253.08324 58.67 36 (16.919)
255.09889 99.00 37 (28.549)
257.11454 14.00 38 (4.038)
268.09413 14.99 41 (4.3235)
361.15198 100.00 20 48 91 57 72 66 77 87 61 82 90 88 89 64 67 59 81 83 (27.191 0.68617 0.3385 0.12779 0.11727 0.079044 0.066756 0.046084 0.036339 0.02409 0.024009 0.022072 0.018089 0.016893 0.014785 0.014738 0.0081203 0.0048289)
energy2
47.04914 7.61 228 (0.95929)
57.03349 38.28 12 (4.8287)
59.04914 9.05 11 (1.141)
73.02841 10.24 221 (1.2921)
79.05423 9.90 44 (1.2491)
81.06988 10.46 43 (1.3191)
92.04948 19.69 168 166 170 (1.3188 1.0072 0.15743)
94.06513 8.58 40 167 165 169 (0.70472 0.1991 0.15547 0.023452)
105.04472 9.32 35 (1.1755)
107.06037 8.69 34 140 (0.78867 0.3078)
119.06037 11.44 117 (1.4431)
121.07602 41.58 111 (5.2447)
123.09167 36.64 109 (4.6214)
136.08692 9.12 112 (1.1504)
144.06552 9.67 207 (1.2202)
145.07602 7.44 84 (0.93813)
211.09782 10.60 116 (1.337)
225.11347 29.80 128 23 (2.3183 1.441)
227.12912 52.51 22 127 124 120 131 130 129 (5.8692 0.22854 0.20412 0.13352 0.11646 0.048335 0.022612)
233.17607 7.42 107 (0.93542)
255.09889 32.54 37 (4.104)
257.11454 26.22 38 (3.3071)
270.10978 7.50 172 (0.94557)
344.12543 7.37 71 49 63 78 (0.81611 0.068414 0.029926 0.014722)
345.12068 6.98 31 75 (0.819 0.061012)
353.13566 9.66 148 102 146 (0.56325 0.41679 0.23855)
355.15131 14.69 158 154 103 (0.82468 0.56876 0.45905)
361.15198 100.00 72 20 48 91 61 83 77 67 57 89 64 82 59 88 90 87 66 81 (5.1378 2.4537 1.3444 0.77782 0.47699 0.44494 0.32049 0.29426 0.19517 0.18949 0.17808 0.15123 0.14635 0.13334 0.1112 0.1065 0.10553 0.045563)
387.16763 13.71 216 (1.7295)
423.15238 6.92 264 (0.87223)

0 477.1993277001 CNc1ccc(N=Nc2ccccc2)cc1[NH2+]c1nc2c(ncn2C2CC(O)C(CO)O2)c(=O)[nH]1
1 459.1887630161 CN=C1C=CC(N=NC2CCCCC2)=CC1=[NH+]C1=NC=C2N=CN(C3C=C(O)C(=C=O)O3)C2=N1
2 345.1570689641 CN=C1C=CC(N=NC2=CC=CCC2)=CC1=[NH+]C1=NC=C2N=CNC2=N1
3 119.0702706321 OC1CCOC1C[OH2+]
4 119.0702706321 O=CCC(O)CC[OH2+] Intermediate Fragment 
5 117.0546205681 OC1CCOC1=C[OH2+]
6 89.0597059481 [OH2+]C1CCOC1
7 99.0440558841 C=C1OCC=C1[OH2+]
8 99.0440558841 [OH+]=C=C1CCCO1
9 117.0546205681 CCC(O)C(=O)C=[OH+] Intermediate Fragment 
10 99.0440558841 CC=C(O)C#C[OH2+]
11 59.0491412641 CC=C[OH2+]
12 57.0334912001 CC#C[OH2+]
13 61.0284058201 OCC=[OH+]
14 117.0546205681 O=CCC(O)C=C[OH2+] Intermediate Fragment 
15 89.0597059481 CC(O)C=C[OH2+]
16 117.0546205681 OCCCOC#C[OH2+] Intermediate Fragment 
17 117.0546205681 CCOC(=C=[OH+])CO Intermediate Fragment 
18 115.0389705041 OC1CCOC1=C=[OH+]
19 359.1363335201 CN=C1C=CC(N=NC2=CC=CC=C2)=CC1=[NH+]C1=NC(O)=C2N=CNC2=N1
20 361.1519835841 CN=C1C=CC(N=NC2=CC=CCC2)=CC1=[NH+]C1=NC(O)=C2N=CNC2=N1
21 343.1414189001 CN=C1C=CC(N=NC2=CC=CC=C2)=CC1=[NH+]C1=NC=C2N=CNC2=N1
22 227.1291229001 CN=C1C=CC(N=NC2=CC=CCC2)=CC1=[NH2+]
23 225.1134728361 CN=C1C=CC(N=NC2=CC=CC=C2)=CC1=[NH2+]
24 223.0978227721 C=[N+]=C1C=CC(N=NC2=CC=CC=C2)=CC1=N
25 150.0410361681 [NH3+]C1=NC(=O)C2=NC=NC2=N1
26 152.0566862321 [NH3+]C1=NC(=O)C2=NCNC2=N1
27 154.0723362961 [NH3+]C1=NC(=O)C2NCNC2=N1
28 330.1097844241 O=C1N=C([NH+]=C2C=C(N=NC3=CC=CC=C3)C=CC2)N=C2N=CN=C12
29 332.1254344881 O=C1N=C([NH+]=C2C=C(N=NC3=CC=CCC3)C=CC2)N=C2N=CN=C12
30 334.1410845521 O=C1N=C([NH+]=C2C=C(N=NC3=CCCCC3)C=CC2)N=C2N=CN=C12
31 345.1206834561 N=C1C=CC(N=NC2=CC=CC=C2)=CC1=[NH+]C1=NC(O)=C2N=CNC2=N1
32 111.0916747721 [NH2+]=NC1=CCCCC1
33 109.0760247081 [NH2+]=NC1=CC=CCC1
34 107.0603746441 [NH2+]=NC1=CC=CC=C1
35 105.0447245801 N#[N+]C1=CC=CC=C1
36 253.0832353281 CN=C1C=CC=CC1=[NH+]C1=NC(=O)C2=NC=NC2=N1
37 255.0988853921 CNC1C=CC=CC1=[NH+]C1=NC(=O)C2=NC=NC2=N1
38 257.1145354561 CNC1CCC=CC1=[NH+]C1=NC(=O)C2=NC=NC2=N1
39 96.0807757401 [NH2+]=C1C=CCCC1
40 94.0651256761 [NH2+]=C1C=CC=CC1
41 268.0941343601 CN=C1C=CC(N)=CC1=[NH+]C1=NC(=O)C2=NC=NC2=N1
42 83.0855267721 C1=[CH2+]CCCC1
43 81.0698767081 C1=CCC[CH2+]=C1
44 79.0542266441 C1=CC=[CH2+]C=C1
45 279.0737332641 C=[N+]=C1C=CC(N=N)=CC1=NC1=NC(=O)C2=NC=NC2=N1
46 281.0893833281 CN=C1C=CC(N=N)=CC1=[NH+]C1=NC(=O)C2=NC=NC2=N1
47 283.1050333921 CN=C1C=CC(NN)=CC1=[NH+]C1=NC(=O)C2=NC=NC2=N1
48 361.1519835841 CN=C1C=CC(N=NC2=CC=CCC2)=CC1=[NH+]C(=N)N=C1NC=NC1=C=O Intermediate Fragment 
49 344.1254344881 C=NC1=CC=C(N=NC2=CC=CC=C2)C=C1N=C=[NH+]C1=C(C=O)N=CN1
50 250.1087218041 CN=C1C=CC(N=NC2=CC=CC=C2)=CC1=NC#[NH+]
51 252.1243718681 CN=C1C=CC(N=NC2=CC=CCC2)=CC1=NC#[NH+]
52 254.1400219321 CN=C1C=CC(N=NC2=CCCCC2)=CC1=NC#[NH+]
53 267.1352709001 CN=C1C=CC(N=NC2=CC=CC=C2)=CC1=NC(N)=[NH2+]
54 331.1414189001 CN=C1C=CC(N=NC2=CC=CC=C2)=CC1=NC(=[NH2+])N=C1C=NC=N1
55 333.1570689641 CN=C1C=CC(N=NC2=CC=CCC2)=CC1=NC(=[NH2+])N=C1C=NC=N1
56 359.1363335201 CN=C1C=CC(N=NC2=CC=CC=C2)=CC1=NC(=[NH2+])N=C1NC=NC1=C=O
57 361.1519835841 CN=C1C=CC(N=NC2=CC=CCC2)=CC1=[NH+]C(N=C1C=NC=N1)=NC=O Intermediate Fragment 
58 316.1305198681 C=NC1=CC=C(N=NC2=CC=CC=C2)C=C1N=C=[NH+]C1=CN=CN1
59 361.1519835841 CN=C1C=CC(N=NC2=CC=CC=C2)=CC1=[NH+]C(N)=NC(=O)C1=CNC=N1 Intermediate Fragment 
60 359.1363335201 C=[N+]=C1C=CC(N=NC2=CC=CC=C2)=CC1=NC(N)=NC(=O)C1=CNC=N1
61 361.1519835841 C=NC1=CC=C(N=NC2=CC=CCC2)C=C1[NH+]=C=NC(O)=C1N=CNC1=N Intermediate Fragment 
62 237.1134728361 C=NC1=CC=C(N=NC2=CC=CC=C2)C=C1[NH+]=C
63 344.1254344881 C=NC1=CC=C(N=NC2=CC=CC=C2)C=C1N=C=[NH+]C(=O)C1=CNC=N1
64 361.1519835841 C=NC1=CC=C(N=NC2=CC=CCC2)C=C1[NH+]=C=NC1=C(C(N)=O)N=CN1 Intermediate Fragment 
65 318.1461699321 C=NC1=CC=C(N=NC2=CC=CCC2)C=C1N=C=[NH+]C1=CN=CN1
66 361.1519835841 CN=C1C=CC(N=NC2=CC=CCC2)=CC1=[NH+]C1=NC(O)=CC(N=C=N)=N1 Intermediate Fragment 
67 361.1519835841 CN=C1C=CC(N=NC2=CC=CCC2)=CC1=[NH+]C1=NC(O)=C(N=C=N)C=N1 Intermediate Fragment 
68 317.1145354561 C=[N+]=C1C=CC(N=NC2=CC=CC=C2)=CC1=NC1=NC(O)=CC=N1
69 319.1301855201 CN=C1C=CC(N=NC2=CC=CC=C2)=CC1=[NH+]C1=NC(O)=CC=N1
70 334.1410845521 CN=C1C=CC(N=NC2=CC=CCC2)=CC1=NC1=NC(=O)C(=[NH2+])C=N1
71 344.1254344881 C#[N+]C1=C(O)N=C(N=C2C=C(N=NC3=CC=CC=C3)C=CC2=NC)N=C1
72 361.1519835841 C=NC1=C(O)N=C([NH+]=C2C=C(N=NC3=CC=CC=C3)C=CC2=NC)N=C1N Intermediate Fragment 
73 332.1254344881 C=[N+]=C1C=CC(N=NC2=CC=CC=C2)=CC1=NC1=NC(O)=CC(N)=N1
74 334.1410845521 CN=C1C=CC(N=NC2=CC=CC=C2)=CC1=NC1=NC(O)=CC([NH3+])=N1
75 345.1206834561 C=[N+]=C1C=CC(N=NC2=CC=CC=C2)=CC1=NC1=NC(=O)C(=N)C(N)=N1
76 359.1363335201 C#[N+]C1=C(O)N=C(N=C2C=C(N=NC3=CC=CC=C3)C=CC2=NC)N=C1N
77 361.1519835841 C=NC1=NC([NH+]=C2C=C(N=NC3=CC=CC=C3)C=CC2=NC)=NC(O)=C1N Intermediate Fragment 
78 344.1254344881 C=NC1=NC(N=C2C=C(N=NC3=CC=CC=C3)C=CC2=[N+]=C)=NC(O)=C1
79 332.1254344881 CN=C1C=CC(N=NC2=CC=CC=C2)=CC1=NC1=NC(=O)C(=[NH2+])C=N1
80 330.1097844241 C=[N+]=C1C=CC(N=NC2=CC=CC=C2)=CC1=NC1=NC(=O)C(=N)C=N1
81 361.1519835841 C=NC(=C=C=C=NN=C1C=CCCC1)C(C)=[NH+]C1=NC(O)=C2N=CNC2=N1 Intermediate Fragment 
82 361.1519835841 C=C=C(N=C)C(C=C=NN=C1C=CCCC1)=[NH+]C1=NC(O)=C2N=CNC2=N1 Intermediate Fragment 
83 361.1519835841 C=CC(=CC(C=NC)=[NH+]C1=NC(O)=C2N=CNC2=N1)N=NC1=CC=CC=C1 Intermediate Fragment 
84 145.0760247081 CC#C[NH+]=NC1=CC=CC=C1
85 320.1254344881 C#CC(=C=C=[NH+]C1=NC(O)=C2N=CNC2=N1)N=NC1=CCCCC1
86 318.1097844241 C#CC(=C=C=[NH+]C1=NC(O)=C2N=CNC2=N1)N=NC1=CC=CCC1
87 361.1519835841 CN=C=C=CC(=C=C=[NH+]C1=NC(O)=C2N=CNC2=N1)N=NC1=CCCCC1 Intermediate Fragment 
88 361.1519835841 C=NC(=C=CC(=C)N=NC1=CC=CCC1)C=[NH+]C1=NC(O)=C2N=CNC2=N1 Intermediate Fragment 
89 361.1519835841 C=C=CCC(=C)N=NC1=CC(=[NH+]C2=NC(O)=C3N=CNC3=N2)C(=NC)C=C1 Intermediate Fragment 
90 361.1519835841 C=C=C(CC=C)N=NC1=CC(=[NH+]C2=NC(O)=C3N=CNC3=N2)C(=NC)C=C1 Intermediate Fragment 
91 361.1519835841 CCC=C=C=CN=NC1=CC(=[NH+]C2=NC(O)=C3N=CNC3=N2)C(=NC)C=C1 Intermediate Fragment 
92 293.0893833281 C=[N+]=C1C=CC(N=NC)=CC1=NC1=NC(=O)C2=NC=NC2=N1
93 295.1050333921 CN=NC1=CC(=[NH+]C2=NC(=O)C3=NC=NC3=N2)C(=NC)C=C1
94 363.1676336481 CN=C1C=CC(N=NC2=CCCCC2)=CC1=[NH+]C1=NC(O)=C2N=CNC2=N1
95 365.1832837121 CN=C1C=CC(N=NC2CCCCC2)=CC1=[NH+]C1=NC(O)=C2N=CNC2=N1
96 367.1989337761 CN=C1C=CC(NNC2CCCCC2)=CC1=[NH+]C1=NC(O)=C2N=CNC2=N1
97 445.1731129521 CN=C1C=CC(N=NC2=CC=CCC2)=CC1=[NH+]C1=NC(O)=C2N=CN(C3CC(O)=CO3)C2=N1
98 447.1887630161 CN=C1C=CC(N=NC2=CCCCC2)=CC1=[NH+]C1=NC(O)=C2N=CN(C3CC(O)=CO3)C2=N1
99 449.2044130801 CN=C1C=CC(N=NC2CCCCC2)=CC1=[NH+]C1=NC(O)=C2N=CN(C3CC(O)=CO3)C2=N1
100 459.1887630161 C=C1OC(N2C=NC3=C(O)N=C([NH+]=C4C=C(N=NC5=CCCCC5)C=CC4=NC)N=C32)C=C1O
101 441.1781983321 C=C1C=CC(N2C=NC3=C(O)N=C([NH+]=C4C=C(N=NC5=CC=CCC5)C=CC4=NC)N=C32)O1
102 353.1356648241 C=C1OC(N2C=NC3=C(O)N=C([NH+]=C4C=CC=CC4NC)N=C32)C=C1O
103 355.1513148881 C=C1OC(N2C=NC3=C(O)N=C([NH+]=C4C=CCCC4NC)N=C32)C=C1O
104 459.1887630161 CN=C1C=CC(N=NC2=CC=CCC2)=CC1=[NH+]C1=NC(O)=C2N=CN(CC=C(O)C(C)=O)C2=N1 Intermediate Fragment 
105 459.1887630161 C=C(C=O)OC(C)N1C=NC2=C(O)N=C([NH+]=C3C=C(N=NC4=CC=CCC4)C=CC3=NC)N=C21 Intermediate Fragment 
106 459.1887630161 C#COC(C=C=O)N1C=NC2=C(O)N=C([NH+]=C3C=C(N=NC4CCCCC4)C=CC3=NC)N=C21 Intermediate Fragment 
107 233.1760730921 CN=C1C=CC(NNC2CCCCC2)=CC1=[NH2+]
108 231.1604230281 CN=C1C=CC(N=NC2CCCCC2)=CC1=[NH2+]
109 123.0916747721 CNC1C=CC=CC1=[NH2+]
110 229.1447729641 CN=C1C=CC(N=NC2=CCCCC2)=CC1=[NH2+]
111 121.0760247081 CN=C1C=CC=CC1=[NH2+]
112 136.0869237401 CN=C1C=CC(N)=CC1=[NH2+]
113 210.1025738041 C=[NH+]C1=CC=C(N=NC2=CC=CC=C2)C=C1
114 198.1025738041 N=C1CC=CC(=[N+]=NC2=CC=CC=C2)C1
115 200.1182238681 [NH2+]=C1CC=CC(N=NC2=CC=CC=C2)C1
116 211.0978227721 N=C1C=CC(N=NC2=CC=CC=C2)=CC1=[NH2+]
117 119.0603746441 C=[N+]=C1C=CC=CC1=N
118 134.0712736761 C=[N+]=C1C=CC(N)=CC1=N
119 149.0821727081 CN=C1C=CC(N=N)=CC1=[NH2+]
120 227.1291229001 CN=C=C=CC(=CC#[NH+])N=NC1=CCCCC1 Intermediate Fragment 
121 200.1182238681 C=C(C#CC=[NH+]C)N=NC1=CC=CCC1
122 184.0869237401 C#CC(=CC#[NH+])N=NC1=CC=CCC1
123 186.1025738041 C#CC(=CC#[NH+])N=NC1=CCCCC1
124 227.1291229001 C=CC(=CC(=[NH2+])C=NC)N=NC1=CC=CC=C1 Intermediate Fragment 
125 143.0603746441 [CH2+]C#CN=NC1=CC=CC=C1
126 201.1134728361 CN=CC(=[NH2+])C#CN=NC1=CC=CCC1
127 227.1291229001 C=C=C(N=C)C(=[NH2+])C=C=NN=C1C=CCCC1 Intermediate Fragment 
128 225.1134728361 C#CC(=NC)C(=[NH2+])C#CN=NC1=CC=CCC1
129 227.1291229001 C=NC(=C=C=C=NN=C1C=CCCC1)C(C)=[NH2+] Intermediate Fragment 
130 227.1291229001 C=NC(=C=CC(=C)N=NC1=CCCCC1)C#[NH+] Intermediate Fragment 
131 227.1291229001 CCC=C=C=CN=NC1=CC(=[NH2+])C(=NC)C=C1 Intermediate Fragment 
132 266.0883802841 [NH3+]C1=NC(O)=C2N=CN(C3CC(O)C(=CO)O3)C2=N1
133 268.1040303481 [NH3+]C1=NC(O)=C2N=CN(C3CC(O)C(CO)O3)C2=N1
134 268.1040303481 [NH3+]C1=NC(O)=C2N=CN(C(=O)CC(O)CCO)C2=N1 Intermediate Fragment 
135 446.1571285401 O=C=C1OC(N2C=NC3=C(O)N=C([NH+]=C4C=C(N=NC5=CCCCC5)C=CC4)N=C32)C=C1O
136 448.1727786041 O=C=C1OC(N2C=NC3=C(O)N=C([NH+]=C4C=C(N=NC5CCCCC5)C=CC4)N=C32)C=C1O
137 450.1884286681 O=C=C1OC(N2C=NC3=C(O)N=C([NH+]=C4C=C(NNC5CCCCC5)C=CC4)N=C32)C=C1O
138 461.1680275721 N=C1C=CC(N=NC2CCCCC2)=CC1=[NH+]C1=NC(O)=C2N=CN(C3C=C(O)C(=C=O)O3)C2=N1
139 347.1363335201 N=C1C=CC(N=NC2=CCCCC2)=CC1=[NH+]C1=NC(=O)C2=NC=NC2=N1
140 107.0603746441 C=C=C=C=CCN=[NH2+] Intermediate Fragment 
141 65.0385765801 [CH2+]#CC#CC
142 365.0992793161 CN=C1C=CC=CC1=[NH+]C1=NC(O)=C2N=CN(C3C=C(O)C(=C=O)O3)C2=N1
143 367.1149293801 CNC1C=CC=CC1=[NH+]C1=NC(O)=C2N=CN(C3C=C(O)C(=C=O)O3)C2=N1
144 369.1305794441 CNC1CCC=CC1=[NH+]C1=NC(O)=C2N=CN(C3C=C(O)C(=C=O)O3)C2=N1
145 371.1462295081 CNC1CCCCC1=[NH+]C1=NC(O)=C2N=CN(C3C=C(O)C(=C=O)O3)C2=N1
146 353.1356648241 CNC1CCC=CC1=[NH+]C1=NC(O)=C2N=CN(C3C=CC(=C=O)O3)C2=N1
147 371.1462295081 CNC1CCC=CC1=[NH+]C1=NC(O)=C2N=CN(CC=C(O)C(=O)C=O)C2=N1 Intermediate Fragment 
148 353.1356648241 CNC1C=CC=CC1=[NH+]C1=NC(O)=C2N=CN(CC=C(O)C#CO)C2=N1
149 371.1462295081 CNC1CCC=CC1=[NH+]C1=NC(O)=C2N=CN(C(C)OC(=C=O)C=O)C2=N1 Intermediate Fragment 
150 371.1462295081 CNC1CCCCC1=[NH+]C1=NC(O)=C2N=CN(C(=O)C=C(O)C#CO)C2=N1 Intermediate Fragment 
151 371.1462295081 C=CC(=[NH+]C1=NC(O)=C2N=CN(C3C=C(O)C(=C=O)O3)C2=N1)C(CC)NC Intermediate Fragment 
152 371.1462295081 CNCCCCC=C=[NH+]C1=NC(O)=C2N=CN(C3C=C(O)C(=C=O)O3)C2=N1 Intermediate Fragment 
153 373.1618795721 CNC1CCCCC1[NH2+]C1=NC(O)=C2N=CN(C3C=C(O)C(=C=O)O3)C2=N1
154 355.1513148881 CNC1CCCCC1=[NH+]C1=NC(O)=C2N=CN(C3C=CC(=C=O)O3)C2=N1
155 373.1618795721 CNC1CCCCC1=[NH+]C1=NC(O)=C2N=CN(C(C)OC(=C=O)C=O)C2=N1 Intermediate Fragment 
156 299.1251001401 CNC1C=CC=CC1=[NH+]C1=NC(O)=C2N=CN(C(C)=O)C2=N1
157 373.1618795721 CNC1CCCCC1[NH2+]C1=NC(O)=C2N=CN(C(=O)C=C(O)C#CO)C2=N1 Intermediate Fragment 
158 355.1513148881 CNC1CCC=CC1=[NH+]C1=NC(O)=C2N=CN(CC=C(O)C#CO)C2=N1
159 331.1513148881 CNC1CCCCC1[NH2+]C1=NC(O)=C2N=CN(C(=O)C#CO)C2=N1
160 329.1356648241 CNC1CCCCC1=[NH+]C1=NC(O)=C2N=CN(C(=O)C#CO)C2=N1
161 75.0440558841 OCC=C[OH2+]
162 373.1618795721 CNCCCCCC=[NH+]C1=NC(O)=C2N=CN(C3C=C(O)C(=C=O)O3)C2=N1 Intermediate Fragment 
163 98.0964258041 [NH2+]=C1CCCCC1
164 98.0964258041 CCCCCC#[NH+] Intermediate Fragment 
165 94.0651256761 CCC=C=CC#[NH+] Intermediate Fragment 
166 92.0494756121 CC=CC#CC#[NH+]
167 94.0651256761 C=C=C=CC(C)=[NH2+] Intermediate Fragment 
168 92.0494756121 C#CC#CC(C)=[NH2+]
169 94.0651256761 C=C=CC(=[NH2+])C=C Intermediate Fragment 
170 92.0494756121 C#CCC(=[NH2+])C#C
171 382.1258284121 CNC1C=CC(N)=CC1=[NH+]C1=NC(O)=C2N=CN(C3C=C(O)C(=C=O)O3)C2=N1
172 270.1097844241 CNC1C=CC(N)=CC1=[NH+]C1=NC(=O)C2=NC=NC2=N1
173 384.1414784761 CNC1CCC(N)=CC1=[NH+]C1=NC(O)=C2N=CN(C3C=C(O)C(=C=O)O3)C2=N1
174 366.1309137921 C=C1OC(N2C=NC3=C(O)N=C([NH+]=C4C=C(N)C=CC4=NC)N=C32)C=C1O
175 384.1414784761 CNC1C=CC(N)=CC1=[NH+]C1=NC(O)=C2N=CN(CC=C(O)C(=O)C=O)C2=N1 Intermediate Fragment 
176 384.1414784761 CNC1CCC(N)=CC1=[NH+]C1=NC(O)=C2N=CN(C(=O)C=C(O)C#CO)C2=N1 Intermediate Fragment 
177 85.1011768361 C1CC[CH3+]CC1
178 85.1011768361 CC=[CH2+]CCC Intermediate Fragment 
179 393.1054273161 CN=C1C=CC(N=N)=CC1=[NH+]C1=NC(O)=C2N=CN(C3C=C(O)C(=C=O)O3)C2=N1
180 395.1210773801 CN=C1C=CC(NN)=CC1=[NH+]C1=NC(O)=C2N=CN(C3C=C(O)C(=C=O)O3)C2=N1
181 397.1367274441 CNC1C=CC(NN)=CC1=[NH+]C1=NC(O)=C2N=CN(C3C=C(O)C(=C=O)O3)C2=N1
182 399.1523775081 CNC1CCC(NN)=CC1=[NH+]C1=NC(O)=C2N=CN(C3C=C(O)C(=C=O)O3)C2=N1
183 477.1993277001 CN=C1C=CC(NNC2CCCCC2)=CC1=[NH+]C(=N)N=C1C(=C=O)N=CN1C1C=C(O)C(=C=O)O1 Intermediate Fragment 
184 460.1727786041 C=NC1=CC=C(N=NC2CCCCC2)C=C1N=C=[NH+]C1=C(C=O)N=CN1C1C=C(O)C(=C=O)O1
185 226.0822322841 [NH2+]=C1C(=C=O)N=CN1C1CC(O)C(CO)O1
186 449.2044130801 CN=C1C=CC(N=NC2CCCCC2)=CC1=NC(=[NH2+])N=C1C=NCN1C1C=C(O)C(=C=O)O1
187 449.2044130801 CN=C1C=CC(N=NC2CCCCC2)=CC1=NC(=[NH2+])N=C1C=NCN1C(=O)C=C(O)C#CO Intermediate Fragment 
188 477.1993277001 CN=C1C=CC(N=NC2CCCCC2)=CC1=[NH+]C(=NC=O)N=C1C=NCN1C1C=C(O)C(=C=O)O1 Intermediate Fragment 
189 434.1935140481 C=NC1=CC=C(NNC2CCCCC2)C=C1N=C=[NH+]C1=CN=CN1C1C=C(O)C(=C=O)O1
190 432.1778639841 C=NC1=CC=C(N=NC2CCCCC2)C=C1N=C=[NH+]C1=CN=CN1C1C=C(O)C(=C=O)O1
191 430.1622139201 C=NC1=CC=C(N=NC2=CCCCC2)C=C1N=C=[NH+]C1=CN=CN1C1C=C(O)C(=C=O)O1
192 183.0764186321 OC1CC(N2C=CN=C2)OC1=C[OH2+]
193 181.0607685681 OC1CC(N2C=CN=C2)OC1=C=[OH+]
194 447.1887630161 CN=C1C=CC(N=NC2=CCCCC2)=CC1=NC(=[NH2+])N=C1C=NCN1C1C=C(O)C(=C=O)O1
195 477.1993277001 CN=C1C=CC(N=NC2CCCCC2)=CC1=[NH+]C(N)=NC(=O)C1=CN(C2C=C(O)C(=C=O)O2)C=N1 Intermediate Fragment 
196 477.1993277001 C=NC1=CC=C(NNC2CCCCC2)C=C1[NH+]=C=NC(O)=C1N=CN(C2C=C(O)C(=C=O)O2)C1=N Intermediate Fragment 
197 477.1993277001 C=NC1=CC=C(NNC2CCCCC2)C=C1[NH+]=C=NC1=C(C(N)=O)N=CN1C1C=C(O)C(=C=O)O1 Intermediate Fragment 
198 477.1993277001 CN=C1C=CC(N=NC2CCCCC2)=CC1=[NH+]C1=NC(O)=CC(N(C=N)C2C=C(O)C(=C=O)O2)=N1 Intermediate Fragment 
199 450.1884286681 CN=C1C=CC(NNC2CCCCC2)=CC1=NC1=NC(O)=CC([NH+]=C2C=C(O)C(=C=O)O2)=N1
200 450.1884286681 CN=C1C=CC(N=NC2CCCCC2)=CC1=NC1=NC(O)=CC([NH+]=C(O)C=C(O)C#CO)=N1 Intermediate Fragment 
201 321.1458355841 CN=C1C=CC(N=NC2=CC=CCC2)=CC1=[NH+]C1=NC(O)=CC=N1
202 159.0764186321 [NH+]#CNC1CC(O)C(CO)O1
203 142.0498695361 C=[NH+]C1CC(O)C(=C=O)O1
204 159.0764186321 [NH+]#CN=C(O)CC(O)CCO Intermediate Fragment 
205 159.0764186321 CC(O)C(CO)OC=NC#[NH+] Intermediate Fragment 
206 161.0920686961 [NH2+]=CNC1CC(O)C(CO)O1
207 144.0655196001 C=[NH+]C1CC(O)C(=CO)O1
208 477.1993277001 CN=C1C=CC(NNC2CCCCC2)=CC1=[NH+]C1=NC(O)=C(N=C=NC2C=C(O)C(=C=O)O2)C=N1 Intermediate Fragment 
209 477.1993277001 C=NC1=C(O)N=C([NH+]=C2C=C(NNC3CCCCC3)C=CC2=NC)N=C1N=C1C=C(O)C(=C=O)O1 Intermediate Fragment 
210 477.1993277001 CN=C1C=CC(N=NC2CCCCC2)=CC1=[NH+]C1=NC(O)=C2N=CN(CC=C(O)C(=O)C=O)C2=N1 Intermediate Fragment 
211 459.1887630161 CN=C1C=CC(N=NC2=CCCCC2)=CC1=[NH+]C1=NC(O)=C2N=CN(CC=C(O)C#CO)C2=N1
212 421.2094984601 CN=C1C=CC(NNC2CCCCC2)=CC1=[NH+]C1=NC(O)=C2N=CN(CC#CO)C2=N1
213 419.1938483961 CN=C1C=CC(N=NC2CCCCC2)=CC1=[NH+]C1=NC(O)=C2N=CN(CC#CO)C2=N1
214 417.1781983321 CN=C1C=CC(N=NC2=CCCCC2)=CC1=[NH+]C1=NC(O)=C2N=CN(CC#CO)C2=N1
215 415.1625482681 CN=C1C=CC(N=NC2=CC=CCC2)=CC1=[NH+]C1=NC(O)=C2N=CN(CC#CO)C2=N1
216 387.1676336481 CCN1C=NC2=C(O)N=C([NH+]=C3C=C(N=NC4=CC=CC=C4)C=CC3=NC)N=C21
217 389.1832837121 CCN1C=NC2=C(O)N=C([NH+]=C3C=C(N=NC4=CC=CCC4)C=CC3=NC)N=C21
218 385.1519835841 C=CN1C=NC2=C(O)N=C([NH+]=C3C=C(N=NC4=CC=CC=C4)C=CC3=NC)N=C21
219 477.1993277001 C=C(O)C(=C=O)OCN1C=NC2=C(O)N=C([NH+]=C3C=C(N=NC4CCCCC4)C=CC3=NC)N=C21 Intermediate Fragment 
220 477.1993277001 CN=C1C=CC(N=NC2CCCCC2)=CC1=[NH+]C1=NC(O)=C2N=CN(C(C)OC(=C=O)C=O)C2=N1 Intermediate Fragment 
221 73.0284058201 OCC#C[OH2+]
222 403.1625482681 CN=C1C=CC(N=NC2=CC=CCC2)=CC1=[NH+]C1=NC(O)=C2N=CN(C(C)=O)C2=N1
223 405.1781983321 CN=C1C=CC(N=NC2=CCCCC2)=CC1=[NH+]C1=NC(O)=C2N=CN(C(C)=O)C2=N1
224 407.1938483961 CN=C1C=CC(N=NC2CCCCC2)=CC1=[NH+]C1=NC(O)=C2N=CN(C(C)=O)C2=N1
225 409.2094984601 CN=C1C=CC(NNC2CCCCC2)=CC1=[NH+]C1=NC(O)=C2N=CN(C(C)=O)C2=N1
226 449.2044130801 CN=C1C=CC(N=NC2CCCCC2)=CC1=[NH+]C1=NC(O)=C2N=CN(C(C)OC#CO)C2=N1
227 477.1993277001 CN=C1C=CC(NNC2CCCCC2)=CC1=[NH+]C1=NC(O)=C2N=CN(C(C=C=O)OC#CO)C2=N1 Intermediate Fragment 
228 47.0491412641 CC[OH2+]
229 433.1731129521 CN=C1C=CC(N=NC2CCCCC2)=CC1=[NH+]C1=NC(O)=C2N=CN(C(=O)C#CO)C2=N1
230 435.1887630161 CN=C1C=CC(NNC2CCCCC2)=CC1=[NH+]C1=NC(O)=C2N=CN(C(=O)C#CO)C2=N1
231 435.1887630161 CN=C1C=CC(N=NC2CCCCC2)=CC1=[NH+]C1=NC(O)=C2N=CN(COC#CO)C2=N1
232 433.1731129521 CN=C1C=CC(N=NC2=CCCCC2)=CC1=[NH+]C1=NC(O)=C2N=CN(COC#CO)C2=N1
233 477.1993277001 CN=C1C=CC(NNC2CCCCC2)=CC1=[NH+]C1=NC(O)=C2N=CN(C(=O)C=C(O)C#CO)C2=N1 Intermediate Fragment 
234 431.1574628881 CN=C1C=CC(N=NC2=CCCCC2)=CC1=[NH+]C1=NC(O)=C2N=CN(C(=O)C#CO)C2=N1
235 45.0334912001 C=C[OH2+]
236 401.1468982041 CN=C1C=CC(N=NC2=CC=CC=C2)=CC1=[NH+]C1=NC(O)=C2N=CN(C(C)=O)C2=N1
237 68.9971056921 [O+]#CC#CO
238 71.0127557561 O=CC#C[OH2+]
239 43.0178411361 C#C[OH2+]
240 77.0597059481 OCCC[OH2+]
241 393.1781983321 CN=C1C=CC(N=NC2CCCCC2)=CC1=[NH+]C1=NC(O)=C2N=CN(C=O)C2=N1
242 391.1625482681 CN=C1C=CC(N=NC2=CCCCC2)=CC1=[NH+]C1=NC(O)=C2N=CN(C=O)C2=N1
243 373.1519835841 CN=C1C=CC(N=NC2=CC=CC=C2)=CC1=[NH+]C1=NC(O)=C2N=CN(C)C2=N1
244 389.1468982041 CN=C1C=CC(N=NC2=CC=CCC2)=CC1=[NH+]C1=NC(O)=C2N=CN(C=O)C2=N1
245 387.1312481401 CN=C1C=CC(N=NC2=CC=CC=C2)=CC1=[NH+]C1=NC(O)=C2N=CN(C=O)C2=N1
246 87.0440558841 CC(O)C#C[OH2+]
247 71.0491412641 C#CC(C)[OH2+]
248 71.0491412641 CCC#C[OH2+]
249 91.0753560121 CC(O)CC[OH2+]
250 73.0647913281 C=CC(C)[OH2+]
251 477.1993277001 C=NC(=C=C=CNNC1CCCCC1)C(C)=[NH+]C1=NC(O)=C2N=CN(C3C=C(O)C(=C=O)O3)C2=N1 Intermediate Fragment 
252 477.1993277001 C=C=C(N=C)C(C=CNNC1CCCCC1)=[NH+]C1=NC(O)=C2N=CN(C3C=C(O)C(=C=O)O3)C2=N1 Intermediate Fragment 
253 477.1993277001 C=CC(=CC(C=NC)=[NH+]C1=NC(O)=C2N=CN(C3C=C(O)C(=C=O)O3)C2=N1)N=NC1CCCCC1 Intermediate Fragment 
254 451.1836776361 CN=CC(C#CNNC1CCCCC1)=[NH+]C1=NC(O)=C2N=CN(C3C=C(O)C(=C=O)O3)C2=N1
255 335.1363335201 CN=CC(C#CN=NC1=CC=CCC1)=[NH+]C1=NC(O)=C2N=CNC2=N1
256 436.1727786041 C=CC(=C=C=[NH+]C1=NC(O)=C2N=CN(C3C=C(O)C(=C=O)O3)C2=N1)NNC1CCCCC1
257 436.1727786041 C=CC(=C=C=[NH+]C1=NC(O)=C2N=CN(C(=O)C=C(O)C#CO)C2=N1)NNC1CCCCC1 Intermediate Fragment 
258 434.1571285401 C#CC(=C=C=[NH+]C1=NC(O)=C2N=CN(C3C=C(O)C(=C=O)O3)C2=N1)NNC1CCCCC1
259 432.1414784761 C#CC(=C=C=[NH+]C1=NC(O)=C2N=CN(C3C=C(O)C(=C=O)O3)C2=N1)N=NC1CCCCC1
260 477.1993277001 CNC=C=CC(=C=C=[NH+]C1=NC(O)=C2N=CN(C3C=C(O)C(=C=O)O3)C2=N1)NNC1CCCCC1 Intermediate Fragment 
261 477.1993277001 C=NC(=C=CC(=C)NNC1CCCCC1)C=[NH+]C1=NC(O)=C2N=CN(C3C=C(O)C(=C=O)O3)C2=N1 Intermediate Fragment 
262 347.1462295081 CCC(C[NH2+]C1=NC(O)=C2N=CN(C3C=C(O)C(=C=O)O3)C2=N1)NC
263 477.1993277001 CCCCC(C)N=NC1=CC(=[NH+]C2=NC(O)=C3N=CN(C4C=C(O)C(=C=O)O4)C3=N2)C(=NC)C=C1 Intermediate Fragment 
264 423.1523775081 CCNNC1=CC(=[NH+]C2=NC(O)=C3N=CN(C4C=C(O)C(=C=O)O4)C3=N2)C(=NC)C=C1
265 477.1993277001 CCCC(CC)N=NC1=CC(=[NH+]C2=NC(O)=C3N=CN(C4C=C(O)C(=C=O)O4)C3=N2)C(=NC)C=C1 Intermediate Fragment 
266 477.1993277001 CCCCCCN=NC1=CC(=[NH+]C2=NC(O)=C3N=CN(C4C=C(O)C(=C=O)O4)C3=N2)C(=NC)C=C1 Intermediate Fragment 
