#In-silico ESI-MS/MS [M+H]+ Spectra
#PREDICTED BY CFM-ID 4.0.8
#SMILES=[nH]1c(nc2c(c1=O)nc(n2[C@@H]1O[C@H](CO)[C@@H](C1)O)Nc1ccc2c3c1ccc1c3c(cc2)ccc1)N
#InChiKey=QBMJHUSBJZIUSS-GUDVDZBRSA-N
energy0
367.13019 33.36 11 24 31 35 18 48 33 50 45 55 51 37 52 54 56 47 57 53 40 (23.209 0.041016 0.031522 0.01719 0.010049 0.0091903 0.0073136 0.0043025 0.0038264 0.0037985 0.0026667 0.0025337 0.0022212 0.0021886 0.0018138 0.0015708 0.00094366 0.0009106 0.00061591)
483.17753 100.00 0 165 130 162 94 193 102 122 123 152 128 150 196 216 205 199 197 198 129 204 213 126 191 208 200 125 192 195 (68.591 0.99005 0.21181 0.093795 0.029124 0.011295 0.01014 0.0092308 0.0086766 0.0074224 0.0061073 0.0056843 0.0046364 0.0040056 0.0035277 0.003368 0.0027029 0.0024552 0.0021045 0.0020132 0.0012888 0.0012587 0.00072944 0.00062229 0.00036238 0.00032465 0.00031961 0.00021655)
energy1
350.10364 5.51 17 19 32 43 (3.0162 0.55392 0.18092 0.026839)
367.13019 100.00 11 24 18 31 48 33 52 35 40 57 50 55 56 54 51 45 37 53 47 (65.773 0.95635 0.56561 0.41972 0.21729 0.12491 0.091938 0.076964 0.070423 0.064233 0.046533 0.042169 0.037418 0.029115 0.0092915 0.008833 0.0078302 0.0064144 0.0024612)
465.16696 4.95 65 131 81 78 1 70 74 83 71 84 (2.5386 0.53062 0.083811 0.082144 0.067119 0.028131 0.022664 0.019964 0.016078 0.0016663)
483.17753 6.97 0 165 130 102 152 122 150 123 162 94 216 193 196 198 128 208 213 204 205 126 195 199 197 200 125 192 129 191 (3.2541 1.1983 0.1666 0.041606 0.035269 0.024214 0.013435 0.012924 0.01079 0.0068126 0.0038849 0.0019682 0.0018676 0.0018381 0.0012881 0.0010848 0.0009386 0.00061671 0.00054108 0.00053185 0.00022523 0.00017971 0.00016856 0.00015991 0.00012266 0.000117 6.0973e-05 5.9232e-05)
energy2
45.03349 8.78 141 (1.9681)
55.01784 4.39 176 (0.98441)
73.06479 3.60 188 187 (0.40698 0.39936)
75.04406 27.43 117 (6.1487)
89.05971 9.18 151 (2.0585)
125.04579 4.33 39 (0.97163)
165.05194 13.59 16 (3.0468)
167.06759 5.17 60 (1.1578)
191.08553 5.62 89 (1.2591)
218.09643 11.60 13 88 (1.9443 0.65716)
350.10364 7.33 17 19 43 32 (1.5926 0.022237 0.016459 0.01184)
365.11454 11.88 10 30 46 49 44 (2.514 0.049287 0.043475 0.036396 0.01959)
367.13019 100.00 11 24 33 18 45 40 37 48 31 35 50 54 47 57 55 51 53 52 56 (12.506 4.0419 1.4123 1.1897 0.56527 0.49621 0.43436 0.41761 0.2586 0.25757 0.13409 0.10219 0.10145 0.096706 0.089929 0.086978 0.085799 0.077741 0.062674)
391.13019 15.88 144 (3.56)
393.14584 42.29 79 (9.4799)
395.12510 6.91 179 180 (0.89991 0.64859)
405.14584 5.79 136 (1.2981)
409.14075 7.55 153 154 (1.0426 0.64892)
413.17205 4.25 157 (0.95241)
415.18770 4.25 158 (0.95241)
423.15640 24.36 76 138 164 139 (2.0636 1.6649 0.87442 0.85863)
439.15131 3.98 82 (0.89251)
447.15640 11.01 132 75 68 66 (1.7736 0.61043 0.061071 0.022486)
453.16696 5.60 63 160 (0.64516 0.60961)
463.15131 4.40 190 (0.98638)
481.16188 8.95 121 194 149 189 (1.558 0.18378 0.17639 0.088086)

0 483.1775296361 Nc1nc2c(nc([NH2+]c3ccc4ccc5cccc6ccc3c4c56)n2C2CC(O)C(CO)O2)c(=O)[nH]1
1 465.1669649521 NC1=NC=C2N=C([NH+]=C3C=CC4=C5C3=CC=C3CCCC(=C35)CC4)N(C3C=C(O)C(=C=O)O3)C2=N1
2 351.1352709001 N=C1N=C2N=C([NH+]=C3C=CC4=C5C3=CC=C3CC=CC(=C35)C=C4)N=C2CN1
3 119.0702706321 OC1CCOC1C[OH2+]
4 117.0546205681 OC1CCOC1=C[OH2+]
5 99.0440558841 C=C1OCC=C1[OH2+]
6 117.0546205681 CCC(O)C(=O)C=[OH+] Intermediate Fragment 
7 99.0440558841 CC=C(O)C#C[OH2+]
8 117.0546205681 O=CCC(O)C=C[OH2+] Intermediate Fragment 
9 115.0389705041 OC1CCOC1=C=[OH+]
10 365.1145354561 NC1=NC(=O)C2=NC([NH+]=C3C=CC4=C5C3=CC=C3CC=CC(=C35)C=C4)=NC2=N1
11 367.1301855201 NC1=NC(=O)C2=NC([NH+]=C3C=CC4=C5C3=CC=C3CCCC(=C35)C=C4)=NC2=N1
12 349.1196208361 N=C1N=CC2=NC([NH+]=C3C=CC4=C5C3=CC=C3CC=CC(=C35)C=C4)=NC2=N1
13 218.0964258041 [NH2+]=C1C=CC2=CC=C3C=CCC4=C3C2=C1C=C4
14 150.0410361681 [NH3+]C1=NC(=O)C2=NC=NC2=N1
15 203.0855267721 C1=CC2=C3C(=C1)C=CC1=CC=[CH2+]C(=C13)C=C2
16 165.0519352001 NC1=NC(=O)C2=NC([NH3+])=NC2=N1
17 350.1036364241 O=C1N=CN=C2N=C([NH+]=C3C=CC4=C5C3=CC=C3CC=CC(=C35)C=C4)N=C12
18 367.1301855201 N=C(N)N=C1NC([NH+]=C2C=CC3=C4C2=CC=C2CC=CC(=C24)C=C3)=NC1=C=O Intermediate Fragment 
19 350.1036364241 N=C=NC1=C(C#[O+])N=C(N=C2C=CC3=C4C2=CC=C2CC=CC(=C24)C=C3)N1
20 325.1083874561 [NH2+]=C1N=C(N=C2C=CC3=C4C2=CC=C2CC=CC(=C24)C=C3)N=C1C=O
21 323.0927373921 N=C1N=C(N=C2C=CC3=C4C2=CC=C2CC=CC(=C24)C=C3)N=C1C#[O+]
22 308.0818383601 [O+]#CC1=NC(=NC2=CC=C3C=CC4=CC=CC5=C4C3=C2C=C5)N=C1
23 339.1352709001 NC(=[NH2+])N=C1C=NC(N=C2C=CC3=C4C2=CC=C2CC=CC(=C24)C=C3)=N1
24 367.1301855201 NC(=NC=O)N=C1C=NC([NH+]=C2C=CC3=C4C2=CC=C2CC=CC(=C24)C=C3)=N1 Intermediate Fragment 
25 324.1243718681 N=C=[NH+]C1C=NC(N=C2C=CC3=C4C2=CC=C2CC=CC(=C24)C=C3)=N1
26 322.1087218041 N=C=[N+]=C1C=NC(N=C2C=CC3=C4C2=CC=C2CC=CC(=C24)C=C3)=N1
27 299.1291229001 [NH2+]=C1C=NC(N=C2C=CC3=C4C2=CC=C2CCCC(=C24)C=C3)=N1
28 297.1134728361 [NH2+]=C1C=NC(N=C2C=CC3=C4C2=CC=C2CC=CC(=C24)C=C3)=N1
29 282.1025738041 C1=CC2=C3C(=CC=C4C(=[N+]=C5N=CC=N5)C=CC(=C43)C=C2)C1
30 365.1145354561 NC(=NC#[O+])N=C1C=NC(N=C2C=CC3=C4C2=CC=C2CC=CC(=C24)C=C3)=N1
31 367.1301855201 NC(N)=NC(=O)C1=NC(=[N+]=C2C=CC3=C4C2=CC=C2CC=CC(=C24)C=C3)N=C1 Intermediate Fragment 
32 350.1036364241 N=C=NC(=O)C1=NC(=[N+]=C2C=CC3=C4C2=CC=C2CC=CC(=C24)C=C3)N=C1
33 367.1301855201 N=C=NC(O)=C1N=C([NH+]=C2C=CC3=C4C2=CC=C2CC=CC(=C24)C=C3)NC1=N Intermediate Fragment 
34 340.1192864881 N=C1N=C(N=C2C=CC3=C4C2=CC=C2CC=CC(=C24)C=C3)N=C1C([NH3+])=O
35 367.1301855201 N=C=NC1=C(C(N)=O)N=C([NH+]=C2C=CC3=C4C2=CC=C2CC=CC(=C24)C=C3)N1 Intermediate Fragment 
36 325.1083874561 NC(=O)C1=NC(=[N+]=C2C=CC3=C4C2=CC=C2CC=CC(=C24)C=C3)N=C1
37 367.1301855201 N=C(N=C1C=NC(N)=NC1=O)[NH+]=C1C=CC2=C3C1=CC=C1CC=CC(=C13)C=C2 Intermediate Fragment 
38 243.0916747721 [NH+]#CN=C1C=CC2=CC=C3C=CCC4=C3C2=C1C=C4
39 125.0457872001 NC1=NC(=O)C(=[NH2+])C=N1
40 367.1301855201 NC1=NC(O)=C(N=C=[NH+]C2=CC=C3C=CC4=CC=CC5=C4C3=C2C=C5)C(N)=N1 Intermediate Fragment 
41 228.0807757401 C#[N+]C1=CC=C2C=CC3=CC=CC4=C3C2=C1C=C4
42 140.0566862321 NC1=NC(=O)C(=[NH2+])C(N)=N1
43 350.1036364241 NC1=NC(=O)C(=[N+]=C=NC2=CC=C3C=CC4=CC=CC5=C4C3=C2C=C5)C=N1
44 365.1145354561 NC1=NC(=O)C(=[N+]=C=NC2=CC=C3C=CC4=CC=CC5=C4C3=C2C=C5)C(N)=N1
45 367.1301855201 N=C1C(=O)N=C(N)N=C1N=C=[NH+]C1=CC=C2CC=C3C=CCC4=C3C2=C1C=C4 Intermediate Fragment 
46 365.1145354561 NC1=NC(=O)C(=[NH2+])C(N=C=NC2=CC=C3C=CC4=CC=CC5=C4C3=C2C=C5)=N1
47 367.1301855201 C=C1C=CC2=CC=CC3=C2C1=C(C(C)=[NH+]C1=NC2=NC(N)=NC(=O)C2=N1)C=C3 Intermediate Fragment 
48 367.1301855201 NC1=NC(O)=C2N=C([NH+]=C=C=C=C3CC=C4C=CCC5=C4C3=CC=C5)NC2=N1 Intermediate Fragment 
49 365.1145354561 NC1=NC(=O)C2=NC([NH+]=C=C=C=C3CC=C4C=CCC5=C4C3=CC=C5)=NC2=N1
50 367.1301855201 C=C1CC=CC2=C1C1=C(C=CC(=[NH+]C3=NC4=NC(N)=NC(=O)C4=N3)C1=C)C=C2 Intermediate Fragment 
51 367.1301855201 C=C=C1C(=[NH+]C2=NC3=NC(N)=NC(=O)C3=N2)C=CC2=C1C1=CCC=CC1=CC2 Intermediate Fragment 
52 367.1301855201 C=C=C1CC=CC2=C1C1=C(C=CC(=[NH+]C3=NC4=NC(N)=NC(=O)C4=N3)C1)C=C2 Intermediate Fragment 
53 367.1301855201 C=CC1=C2C(=CC=C3C2=CC=CC3=[NH+]C2=NC3=NC(N)=NC(=O)C3=N2)CC=C1 Intermediate Fragment 
54 367.1301855201 C=CC1=CC=C2C(=[NH+]C3=NC4=NC(N)=NC(=O)C4=N3)C=CC3=C2C1=C(C)C=C3 Intermediate Fragment 
55 367.1301855201 C=CC1=C2C(C)=CC=C3C(=[NH+]C4=NC5=NC(N)=NC(=O)C5=N4)C=CC(=C32)C=C1 Intermediate Fragment 
56 367.1301855201 C=C=CC1=C2C=CC=C3C(=[NH+]C4=NC5=C(O)N=C(N)N=C5N4)C=CC(=C32)C=C1 Intermediate Fragment 
57 367.1301855201 C=C=CC1=CC=C2C(=[NH+]C3=NC4=C(O)N=C(N)N=C4N3)C=CC3=C2C1=CC=C3 Intermediate Fragment 
58 369.1458355841 NC1=NC(=O)C2=NC([NH+]=C3C=CC4=C5C3=CC=C3CCCC(=C35)CC4)=NC2=N1
59 371.1614856481 NC1=NC(=O)C2=NC([NH+]=C3C=CC4=C5C3=CC=C3CCCC(CC4)C35)=NC2=N1
60 167.0675852641 NC1=NC(=O)C2=NC([NH3+])NC2=N1
61 373.1771357121 NC1=NC(=O)C2=NC([NH+]=C3C=CC4=C5C3=CCC3CCCC(CC4)C53)=NC2=N1
62 451.1513148881 NC1=NC(O)=C2N=C([NH+]=C3C=CC4=C5C3=CC=C3CC=CC(=C35)C=C4)N(C3CC(O)=CO3)C2=N1
63 453.1669649521 NC1=NC(O)=C2N=C([NH+]=C3C=CC4=C5C3=CC=C3CCCC(=C35)C=C4)N(C3CC(O)=CO3)C2=N1
64 455.1826150161 NC1=NC(O)=C2N=C([NH+]=C3C=CC4=C5C3=CC=C3CCCC(=C35)CC4)N(C3CC(O)=CO3)C2=N1
65 465.1669649521 C=C1OC(N2C([NH+]=C3C=CC4=C5C3=CC=C3CCCC(=C35)C=C4)=NC3=C(O)N=C(N)N=C32)C=C1O
66 447.1564002681 C=C1OC(N2C([NH+]=C3C=CC4=C5C3=CC=C3CC=CC(=C35)C=C4)=NC3=CN=C(N)N=C32)C=C1O
67 101.0597059481 C=C1OCCC1[OH2+]
68 447.1564002681 C=C1C=CC(N2C([NH+]=C3C=CC4=C5C3=CC=C3CC=CC(=C35)C=C4)=NC3=C(O)N=C(N)N=C32)O1
69 448.1404158561 C=C1OC(N2C([NH+]=C3C=CC4=C5C3=CC=C3CC=CC(=C35)C=C4)=NC3=C(O)N=CN=C32)C=C1O
70 465.1669649521 C=C1OC(N2C([NH+]=C3C=CC4=C5C3=CC=C3CCCC(=C35)C=C4)=NC(=C=O)C2=NC(=N)N)C=C1O Intermediate Fragment 
71 465.1669649521 C=C1OC(N2C(=NC(N)=NC=O)C=NC2=[NH+]C2=CC=C3CC=C4C=CCC5=C4C3=C2C=C5)C=C1O Intermediate Fragment 
72 422.1611513001 C=C1OC(N2C([NH+]=CN)=CN=C2N=C2C=CC3=C4C2=CC=C2CC=CC(=C24)C=C3)C=C1O
73 395.1502522681 C=C1OC(N2C(=[NH2+])C=NC2=NC2=CC=C3CC=C4C=CCC5=C4C3=C2C=C5)CC1=O
74 465.1669649521 CC(=O)C(O)=CCN1C([NH+]=C2C=CC3=C4C2=CC=C2CC=CC(=C24)C=C3)=NC2=C(O)N=C(N)N=C21 Intermediate Fragment 
75 447.1564002681 C#CC(O)=CCN1C([NH+]=C2C=CC3=C4C2=CC=C2CC=CC(=C24)C=C3)=NC2=C(O)N=C(N)N=C21
76 423.1564002681 NC1=NC(O)=C2N=C([NH+]=C3C=CC4=C5C3=CC=C3CCCC(=C35)C=C4)N(CC#CO)C2=N1
77 421.1407502041 NC1=NC(O)=C2N=C([NH+]=C3C=CC4=C5C3=CC=C3CC=CC(=C35)C=C4)N(CC#CO)C2=N1
78 465.1669649521 C=C(C=O)OC(C)N1C([NH+]=C2C=CC3=C4C2=CC=C2CC=CC(=C24)C=C3)=NC2=C(O)N=C(N)N=C21 Intermediate Fragment 
79 393.1458355841 C=CN1C([NH+]=C2C=CC3=C4C2=CC=C2CC=CC(=C24)C=C3)=NC2=C(O)N=C(N)N=C21
80 395.1614856481 CCN1C([NH+]=C2C=CC3=C4C2=CC=C2CC=CC(=C24)C=C3)=NC2=C(O)N=C(N)N=C21
81 465.1669649521 C#COC(C=C=O)N1C([NH+]=C2C=CC3=C4C2=CC=C2CCCC(=C24)CC3)=NC2=C(O)N=C(N)N=C21 Intermediate Fragment 
82 439.1513148881 NC1=NC(O)=C2N=C([NH+]=C3C=CC4=C5C3=CC=C3CCCC(=C35)CC4)N(C(=O)C#CO)C2=N1
83 465.1669649521 C#CC(O)=CC(=O)N1C([NH+]=C2C=CC3=C4C2=CC=C2CCCC(=C24)CC3)=NC2=C(O)N=C(N)N=C21 Intermediate Fragment 
84 465.1669649521 C=C1OC(N2C([NH+]=C=C=C=C3CC=C4CCCC5=C4C3=CC=C5)=NC3=C(O)N=C(N)N=C32)C=C1O Intermediate Fragment 
85 224.1433759961 [NH2+]=C1C=CC2=C3C1=CC=C1CCCC(CC2)C13
86 222.1277259321 [NH2+]=C1C=CC2=C3C1=CC=C1CCCC(=C13)CC2
87 220.1120758681 [NH2+]=C1C=CC2=CC=C3CCCC4=C3C2=C1C=C4
88 218.0964258041 [NH+]#CC=C=C1CC=C2C=CCC3=C2C1=CC=C3 Intermediate Fragment 
89 191.0855267721 [CH2+]#CC1=C2C=CC=C3CC=CC(=C32)C=C1
90 266.0883802841 [NH3+]C1=NC(O)=C2N=CN(C3CC(O)C(=CO)O3)C2=N1
91 275.0523291241 NC1=NC(O)=C2N=C([NH3+])N(C3=CC(=O)C(=C=O)O3)C2=N1
92 281.0992793161 NC1=NC(O)=C2N=C([NH3+])N(C3CC(O)C(=CO)O3)C2=N1
93 466.1509805401 O=C=C1OC(N2C([NH+]=C3C=CC4=C5C3=CC=C3CCCC(=C35)CC4)=NC3=C(O)N=CN=C32)C=C1O
94 483.1775296361 N=C(N)N=C1C(=C=O)N=C([NH+]=C2C=CC3=C4C2=CC=C2CCCC(CC3)C24)N1C1C=C(O)C(=C=O)O1 Intermediate Fragment 
95 466.1509805401 NC=[NH+]C1=C(C=O)N=C(N=C2C=CC3=C4C2=CC=C2CCCC(=C24)C=C3)N1C1C=C(O)C(=C=O)O1
96 441.1557315721 [NH2+]=C1C(=C=O)N=C(N=C2C=CC3=C4C2=CC=C2CCCC(CC3)C24)N1C1C=C(O)C(=C=O)O1
97 441.1557315721 [NH2+]=C1C(=C=O)N=C(N=C2C=CC3=C4C2=CC=C2CCCC(CC3)C24)N1C(=O)C=C(O)C#CO Intermediate Fragment 
98 424.1291824761 O=C=C1OC(N2C=C(C=O)N=C2[NH+]=C2C=CC3=C4C2=CC=C2CCCC(=C24)C=C3)C=C1O
99 396.1342678561 O=C=C1OC(N2C=CN=C2[NH+]=C2C=CC3=C4C2=CC=C2CCCC(=C24)C=C3)CC1=O
100 424.1291824761 O=CC(=O)C(O)=CCN1C=C(C=O)N=C1[NH+]=C1C=CC2=C3C1=CC=C1CC=CC(=C13)C=C2 Intermediate Fragment 
101 455.1826150161 NC(=[NH2+])N=C1C=NC(=NC2=CC=C3CCC4CCCC5=C4C3=C2C=C5)N1C1C=C(O)C(=C=O)O1
102 483.1775296361 NC(=NC=O)N=C1C=NC(=[NH+]C2=CC=C3CCC4CCCC5=C4C3=C2C=C5)N1C1C=C(O)C(=C=O)O1 Intermediate Fragment 
103 440.1717159841 NC=[NH+]C1=CN=C(N=C2C=CC3=C4C2=CC=C2CCCC(=C24)CC3)N1C1C=C(O)C(=C=O)O1
104 413.1608169521 [NH2+]=C1C=NC(=NC2=CC=C3CCC4CCCC5=C4C3=C2C=C5)N1C1C=C(O)C(=C=O)O1
105 440.1717159841 NC=[NH+]C1=CN=C(N=C2C=CC3=C4C2=CC=C2CCCC(=C24)C=C3)N1CC=C(O)C(=O)C=O Intermediate Fragment 
106 440.1717159841 NC=[NH+]C1=CN=C(N=C2C=CC3=C4C2=CC=C2CCCC(=C24)CC3)N1C(=O)C=C(O)C#CO Intermediate Fragment 
107 438.1560659201 NC=[NH+]C1=CN=C(N=C2C=CC3=C4C2=CC=C2CCCC(=C24)C=C3)N1C1C=C(O)C(=C=O)O1
108 438.1560659201 NC=[NH+]C1=CN=C(N=C2C=CC3=C4C2=CC=C2CC=CC(=C24)C=C3)N1CC=C(O)C(=O)C=O Intermediate Fragment 
109 436.1404158561 NC=[NH+]C1=CN=C(N=C2C=CC3=C4C2=CC=C2CC=CC(=C24)C=C3)N1C1C=C(O)C(=C=O)O1
110 415.1764670161 [NH2+]=C1C=NC(=NC2=CC=C3CCC4CCCC5C=CC2=C3C54)N1C1CC(=O)C(=C=O)O1
111 395.1502522681 [NH2+]=C1C=NC(=NC2=CC=C3CC=C4CCCC5=C4C3=C2C=C5)N1C1C=CC(=C=O)O1
112 413.1608169521 [NH2+]=C1C=NC(=NC2=CC=C3CC=C4CCCC5=C4C3=C2C=C5)N1CC=C(O)C(=O)C=O Intermediate Fragment 
113 413.1608169521 [NH2+]=C1C=NC(=NC2=CC=C3CCC4CCCC5=C4C3=C2C=C5)N1C(=O)C=C(O)C#CO Intermediate Fragment 
114 395.1502522681 [NH2+]=C1C=NC(=NC2=CC=C3CC=C4C=CCC5=C4C3=C2C=C5)N1CC=C(O)C#CO
115 369.1346022041 [NH2+]=C1C=NC(=NC2=CC=C3CC=C4CCCC5=C4C3=C2C=C5)N1C(=O)C#CO
116 339.1240375201 CC(=O)N1C(=[NH2+])C=NC1=NC1=CC=C2C=CC3=CC=CC4=C3C2=C1C=C4
117 75.0440558841 OCC=C[OH2+]
118 411.1451668881 [NH2+]=C1C=NC(=NC2=CC=C3CC=C4CCCC5=C4C3=C2C=C5)N1C1CC(=O)C(=C=O)O1
119 398.1499179201 O=C=C1OC(N2C=CN=C2[NH+]=C2C=CC3=C4C2=CC=C2CCCC(=C24)CC3)CC1=O
120 394.1186177921 O=C=C1OC(N2C=CN=C2[NH+]=C2C=CC3=C4C2=CC=C2CC=CC(=C24)C=C3)CC1=O
121 481.1618795721 NC(N=C1C=NC(=NC2=CC=C3CC=C4CCCC5=C4C3=C2C=C5)N1C1C=C(O)C(=C=O)O1)=[NH+]C=O
122 483.1775296361 NC(N)=NC(=O)C1=CN(C2C=C(O)C(=C=O)O2)C([NH+]=C2C=CC3=C4C2=CC=C2CCCC(=C24)CC3)=N1 Intermediate Fragment 
123 483.1775296361 N=C1C(=C(O)N=CN)N=C([NH+]=C2C=CC3=C4C2=CC=C2CCCC(=C24)CC3)N1C1C=C(O)C(=C=O)O1 Intermediate Fragment 
124 439.1400815081 [NH2+]=C1C(=C=O)N=C(N=C2C=CC3=C4C2=CC=C2CCCC(=C24)CC3)N1C1C=C(O)C(=C=O)O1
125 483.1775296361 N=C([NH+]=C1C=CC2=C3C1=CC=C1CCCC(=C13)CC2)N(C1=NC(N)=NC(O)=C1)C1C=C(O)C(=C=O)O1 Intermediate Fragment 
126 483.1775296361 NC1=NC(O)=C(N=C(N=C2C=C(O)C(=C=O)O2)[NH+]=C2C=CC3=C4C2=CC=C2CCCC(CC3)C24)C=N1 Intermediate Fragment 
127 127.0614372641 NC1=NC(=O)C([NH3+])C=N1
128 483.1775296361 NC1=NC(O)=C(N=C=[NH+]C2=CC=C3CCC4CCCC5C=CC2=C3C54)C(N=C2C=C(O)C(=C=O)O2)=N1 Intermediate Fragment 
129 483.1775296361 NC1=NC(O)=C(N)C(N(C=[NH+]C2=CC=C3CC=C4CCCC5=C4C3=C2C=C5)C2C=C(O)C(=C=O)O2)=N1 Intermediate Fragment 
130 483.1775296361 NC1=NC(O)=C2N=C([NH+]=C3C=CC4=C5C3=CC=C3CCCC(=C35)CC4)N(CC=C(O)C(=O)C=O)C2=N1 Intermediate Fragment 
131 465.1669649521 NC1=NC(O)=C2N=C([NH+]=C3C=CC4=C5C3=CC=C3CCCC(=C35)C=C4)N(CC=C(O)C#CO)C2=N1
132 447.1564002681 NC1=NC(O)=C2N=C([NH+]=C3C=CC4=C5C3=CC=C3CCCC(=C35)C=C4)N(CC#CC#CO)C2=N1
133 427.1877003961 NC1=NC(O)=C2N=C([NH+]=C3C=CC4=C5C3=CC=C3CCCC(CC4)C35)N(CC#CO)C2=N1
134 425.1720503321 NC1=NC(O)=C2N=C([NH+]=C3C=CC4=C5C3=CC=C3CCCC(=C35)CC4)N(CC#CO)C2=N1
135 407.1614856481 C#CCN1C([NH+]=C2C=CC3=C4C2=CC=C2CCCC(=C24)C=C3)=NC2=C(O)N=C(N)N=C21
136 405.1458355841 C#CCN1C([NH+]=C2C=CC3=C4C2=CC=C2CC=CC(=C24)C=C3)=NC2=C(O)N=C(N)N=C21
137 379.1301855201 CN1C2=NC(N)=NC(=O)C2=NC1=[NH+]C1=CC=C2C=CC3=CC=CC4=C3C2=C1C=C4
138 423.1564002681 NC(=NC=O)N=C1C=NC(=[NH+]C2=CC=C3CC=C4C=CCC5=C4C3=C2C=C5)N1CC#CO Intermediate Fragment 
139 423.1564002681 NC1=NC(O)=C(N=C(N=CC#CO)[NH+]=C2C=CC3=C4C2=CC=C2CCCC(=C24)C=C3)C=N1 Intermediate Fragment 
140 63.0440558841 OCC[OH2+]
141 45.0334912001 C=C[OH2+]
142 399.1927857761 CCN1C([NH+]=C2C=CC3=C4C2=CC=C2CCCC(=C24)CC3)=NC2=C(O)N=C(N)N=C21
143 397.1771357121 CCN1C([NH+]=C2C=CC3=C4C2=CC=C2CCCC(=C24)C=C3)=NC2=C(O)N=C(N)N=C21
144 391.1301855201 C#CN1C([NH+]=C2C=CC3=C4C2=CC=C2CC=CC(=C24)C=C3)=NC2=C(O)N=C(N)N=C21
145 91.0389705041 OCC(=[OH+])CO
146 73.0284058201 OCC#C[OH2+]
147 93.0546205681 OCC([OH2+])CO
148 377.1145354561 [CH2+]N1C(=NC2=CC=C3C=CC4=CC=CC5=C4C3=C2C=C5)N=C2C(=O)N=C(N)N=C21
149 481.1618795721 NC1=NC(O)=C2N=C([NH+]=C3C=CC4=C5C3=CC=C3CCCC(=C35)C=C4)N(CC=C(O)C(=O)C=O)C2=N1
150 483.1775296361 C=C(O)C(=C=O)OCN1C([NH+]=C2C=CC3=C4C2=CC=C2CCCC(=C24)CC3)=NC2=C(O)N=C(N)N=C21 Intermediate Fragment 
151 89.0597059481 CC(O)C=C[OH2+]
152 483.1775296361 CC(OC(=C=O)C=O)N1C([NH+]=C2C=CC3=C4C2=CC=C2CCCC(=C24)CC3)=NC2=C(O)N=C(N)N=C21 Intermediate Fragment 
153 409.1407502041 CC(=O)N1C([NH+]=C2C=CC3=C4C2=CC=C2CC=CC(=C24)C=C3)=NC2=C(O)N=C(N)N=C21
154 409.1407502041 CC(=O)N1C(=NC(N)=NC#[O+])C=NC1=NC1=CC=C2CC=C3C=CCC4=C3C2=C1C=C4 Intermediate Fragment 
155 411.1564002681 CC(=O)N1C([NH+]=C2C=CC3=C4C2=CC=C2CCCC(=C24)C=C3)=NC2=C(O)N=C(N)N=C21
156 411.1564002681 CC(=O)N1C=C(C(=O)N=C(N)N)N=C1[NH+]=C1C=CC2=C3C1=CC=C1CC=CC(=C13)C=C2 Intermediate Fragment 
157 413.1720503321 CC(=O)N1C([NH+]=C2C=CC3=C4C2=CC=C2CCCC(=C24)CC3)=NC2=C(O)N=C(N)N=C21
158 415.1877003961 CC(=O)N1C([NH+]=C2C=CC3=C4C2=CC=C2CCCC(CC3)C24)=NC2=C(O)N=C(N)N=C21
159 451.1513148881 CC(OC#CO)N1C([NH+]=C2C=CC3=C4C2=CC=C2CC=CC(=C24)C=C3)=NC2=C(O)N=C(N)N=C21
160 453.1669649521 CC(OC#CO)N1C([NH+]=C2C=CC3=C4C2=CC=C2CCCC(=C24)C=C3)=NC2=C(O)N=C(N)N=C21
161 455.1826150161 CC(OC#CO)N1C([NH+]=C2C=CC3=C4C2=CC=C2CCCC(=C24)CC3)=NC2=C(O)N=C(N)N=C21
162 483.1775296361 NC1=NC(O)=C2N=C([NH+]=C3C=CC4=C5C3=CC=C3CCCC(CC4)C35)N(C(C=C=O)OC#CO)C2=N1 Intermediate Fragment 
163 441.1669649521 NC1=NC(O)=C2N=C([NH+]=C3C=CC4=C5C3=CC=C3CCCC(CC4)C35)N(C(=O)C#CO)C2=N1
164 423.1564002681 C#CC(=O)N1C([NH+]=C2C=CC3=C4C2=CC=C2CCCC(=C24)CC3)=NC2=C(O)N=C(N)N=C21
165 483.1775296361 NC1=NC(O)=C2N=C([NH+]=C3C=CC4=C5C3=CC=C3CCCC(CC4)C35)N(C(=O)C=C(O)C#CO)C2=N1 Intermediate Fragment 
166 437.1356648241 NC1=NC(O)=C2N=C([NH+]=C3C=CC4=C5C3=CC=C3CCCC(=C35)C=C4)N(C(=O)C#CO)C2=N1
167 419.1251001401 NC1=NC(O)=C2N=C(N=C3C=CC4=C5C3=CC=C3CC=CC(=C35)C=C4)N([CH+]C#CO)C2=N1
168 47.0491412641 CC[OH2+]
169 29.0385765801 C=[CH3+]
170 407.1251001401 [CH2+]C(=O)N1C(N=C2C=CC3=C4C2=CC=C2CC=CC(=C24)C=C3)=NC2=C(O)N=C(N)N=C21
171 389.1145354561 [C+]#CN1C(N=C2C=CC3=C4C2=CC=C2CC=CC(=C24)C=C3)=NC2=C(O)N=C(N)N=C21
172 68.9971056921 [O+]#CC#CO
173 41.0021910721 [C+]#CO
174 71.0127557561 O=CC#C[OH2+]
175 43.0178411361 C#C[OH2+]
176 55.0178411361 C#CC=[OH+]
177 399.1564002681 NC1=NC(O)=C2N=C([NH+]=C3C=CC4=C5C3=CC=C3CCCC(=C35)CC4)N(C=O)C2=N1
178 397.1407502041 NC1=NC(O)=C2N=C([NH+]=C3C=CC4=C5C3=CC=C3CCCC(=C35)C=C4)N(C=O)C2=N1
179 395.1251001401 NC1=NC(O)=C2N=C([NH+]=C3C=CC4=C5C3=CC=C3CC=CC(=C35)C=C4)N(C=O)C2=N1
180 395.1251001401 NC(=NC#[O+])N=C1C=NC(=NC2=CC=C3CC=C4C=CCC5=C4C3=C2C=C5)N1C=O Intermediate Fragment 
181 352.1192864881 N#C[NH+]=C1C=NC(=NC2=CC=C3C=CC4=C5C3=C2C=CC5CC=C4)N1C=O
182 393.1094500761 NC1=NC(O)=C2N=C(N=C3C=CC4=C5C3=CC=C3CC=CC(=C35)C=C4)N(C#[O+])C2=N1
183 87.0440558841 CC(O)C#C[OH2+]
184 69.0334912001 C#CC(=C)[OH2+]
185 69.0334912001 C=CC#C[OH2+]
186 91.0753560121 CC(O)CC[OH2+]
187 73.0647913281 C=CC(C)[OH2+]
188 73.0647913281 CCC=C[OH2+]
189 481.1618795721 NC1=NC(O)=C2N=C([NH+]=C3C=CC4=C5C3=CC=C3CCCC(=C35)CC4)N(C(=O)C=C(O)C#CO)C2=N1
190 463.1513148881 NC1=NC(O)=C2N=C([NH+]=C3C=CC4=C5C3=CC=C3CC=CC(=C35)C=C4)N(CC=C(O)C#CO)C2=N1
191 483.1775296361 C=C1CC=C2CCCC3=C2C1=C(C(C)=[NH+]C1=NC2=C(O)N=C(N)N=C2N1C1C=C(O)C(=C=O)O1)C=C3 Intermediate Fragment 
192 483.1775296361 C=CC(=[NH+]C1=NC2=C(O)N=C(N)N=C2N1C1C=C(O)C(=C=O)O1)C1=CC=C2CCCC3=C2C1=CCC3 Intermediate Fragment 
193 483.1775296361 NC1=NC(O)=C2N=C([NH+]=C=C=C=C3CCC4CCCC5C=CC=C3C54)N(C3C=C(O)C(=C=O)O3)C2=N1 Intermediate Fragment 
194 481.1618795721 NC1=NC(O)=C2N=C([NH+]=C=C=C=C3CCC4CCCC5=C4C3=CC=C5)N(C3C=C(O)C(=C=O)O3)C2=N1
195 483.1775296361 C=C=C1CCC2CCCC3=C2C1=C(C=[NH+]C1=NC2=C(O)N=C(N)N=C2N1C1C=C(O)C(=C=O)O1)C=C3 Intermediate Fragment 
196 483.1775296361 C=C1CCCC2=C1C1=C(C=CC(=[NH+]C3=NC4=C(O)N=C(N)N=C4N3C3C=C(O)C(=C=O)O3)C1=C)CC2 Intermediate Fragment 
197 483.1775296361 C=C=C1C(=[NH+]C2=NC3=C(O)N=C(N)N=C3N2C2C=C(O)C(=C=O)O2)C=CC2=C1C1=CCCCC1CC2 Intermediate Fragment 
198 483.1775296361 C=C=C1CCCC2=C1C1=C(C=CC(=[NH+]C3=NC4=C(O)N=C(N)N=C4N3C3C=C(O)C(=C=O)O3)C1)CC2 Intermediate Fragment 
199 483.1775296361 CC1=C2C(=CC=C3CCCC(C)=C32)C(=[NH+]C2=NC3=C(O)N=C(N)N=C3N2C2C=C(O)C(=C=O)O2)C=C1 Intermediate Fragment 
200 483.1775296361 CCC1=C2C(=CC=C3C2=CC=CC3=[NH+]C2=NC3=C(O)N=C(N)N=C3N2C2C=C(O)C(=C=O)O2)CCC1 Intermediate Fragment 
201 455.1462295081 NC1=NC(O)=C2N=C([NH+]=C3C=CC=C4C5=CCCCC5=CC=C43)N(C3C=C(O)C(=C=O)O3)C2=N1
202 457.1618795721 NC1=NC(O)=C2N=C([NH+]=C3C=CC=C4C3=CC=C3CCCCC34)N(C3C=C(O)C(=C=O)O3)C2=N1
203 457.1618795721 NC1=NC(O)=C2N=C([NH+]=C3C=CC=C4C3=CC=C3CCCCC34)N(C(=O)C=C(O)C#CO)C2=N1 Intermediate Fragment 
204 483.1775296361 CCC1=C2C3=CCCCC3=CC=C2C(=[NH+]C2=NC3=C(O)N=C(N)N=C3N2C2C=C(O)C(=C=O)O2)C=C1 Intermediate Fragment 
205 483.1775296361 CCC1=CC=C2C(=[NH+]C3=NC4=C(O)N=C(N)N=C4N3C3C=C(O)C(=C=O)O3)C=CC3=C2C1=C(C)CC3 Intermediate Fragment 
206 453.1305794441 CC1=C2C=CC=C3C(=[NH+]C4=NC5=C(O)N=C(N)N=C5N4C4C=C(O)C(=C=O)O4)C=CC(=C32)C=C1
207 341.1145354561 CC1=C2C=CC=C3C(=[NH+]C4=NC5=NC(N)=NC(=O)C5=N4)C=CC(=C32)C=C1
208 483.1775296361 CCC1=C2C(C)=CC=C3C(=[NH+]C4=NC5=C(O)N=C(N)N=C5N4C4C=C(O)C(=C=O)O4)C=CC(=C32)CC1 Intermediate Fragment 
209 453.1305794441 CC1=CC=C2C(=[NH+]C3=NC4=C(O)N=C(N)N=C4N3C3C=C(O)C(=C=O)O3)C=CC3=C2C1=CC=C3
210 455.1462295081 CC1=CC=C2C(=[NH+]C3=NC4=C(O)N=C(N)N=C4N3C3C=C(O)C(=C=O)O3)C=CC3=C2C1=CCC3
211 457.1618795721 CC1=CC=C2C(=[NH+]C3=NC4=C(O)N=C(N)N=C4N3C3C=C(O)C(=C=O)O3)C=CC3=C2C1CCC3
212 457.1618795721 CC1=CC=C2C(=[NH+]C3=NC4=C(O)N=C(N)N=C4N3C(=O)C=C(O)C#CO)C=CC3=C2C1CCC3 Intermediate Fragment 
213 483.1775296361 CCCC1=C2C=CC=C3C(=[NH+]C4=NC5=C(O)N=C(N)N=C5N4C4C=C(O)C(=C=O)O4)C=CC(=C32)CC1 Intermediate Fragment 
214 441.1305794441 NC1=NC(O)=C2N=C([NH+]=C3C=CC4=C5C(=CCC4)C=CC=C35)N(C3C=C(O)C(=C=O)O3)C2=N1
215 455.1462295081 CC1=C2C=CC=C3C(=[NH+]C4=NC5=C(O)N=C(N)N=C5N4C4C=C(O)C(=C=O)O4)C=CC(=C32)CC1
216 483.1775296361 CCCC1=CC=C2C(=[NH+]C3=NC4=C(O)N=C(N)N=C4N3C3C=C(O)C(=C=O)O3)C=CC3=C2C1=CCC3 Intermediate Fragment 
