#In-silico ESI-MS/MS [M+H]+ Spectra
#PREDICTED BY CFM-ID 4.0.8
#SMILES=n12c(nc3c(c1=O)ncn3[C@@H]1O[C@H](CO)[C@@H](C1)O)NC(CC2O)CC
#InChiKey=IELJLPIOUPQQGJ-ATNBRVFASA-N
energy0
236.11420 100.00 16 58 27 42 23 80 55 78 73 46 49 24 38 83 (86.543 2.3936 1.0355 0.071682 0.042988 0.031289 0.029815 0.026563 0.016238 0.014644 0.0097854 0.008038 0.0038598 0.00048495)
energy1
218.10364 48.90 18 17 (29.088 0.36335)
236.11420 100.00 16 27 58 80 49 42 24 78 55 73 38 46 23 83 (57.335 1.401 0.63979 0.18672 0.14298 0.11056 0.088066 0.078539 0.077141 0.070956 0.056803 0.023727 0.012675 0.0074209)
energy2
29.03858 2.83 165 (0.88671)
43.01784 2.86 176 (0.89475)
43.05423 2.15 60 (0.67271)
45.03349 6.26 166 (1.9576)
55.01784 4.20 178 (1.3154)
57.03349 22.17 10 (6.9368)
59.04914 5.86 180 (1.8342)
71.04914 3.16 188 189 (0.68598 0.30413)
150.04104 10.64 70 (3.3286)
180.05160 2.38 63 (0.74359)
206.06725 6.09 19 (1.9069)
208.08290 5.14 20 (1.6096)
218.10364 8.12 18 17 (2.3681 0.17411)
236.11420 100.00 16 49 58 27 73 80 55 78 46 38 24 83 42 23 (8.9863 8.5329 5.4986 1.8994 1.4472 1.2569 0.89842 0.76992 0.55352 0.42601 0.39274 0.32813 0.25114 0.053619)
238.12985 7.23 86 (2.2616)
240.14550 6.62 87 88 89 (1.5312 0.28334 0.25802)
242.16115 2.81 90 (0.87961)
260.11420 4.89 141 (1.5315)
262.12985 5.24 140 (1.6387)
266.08838 16.69 203 204 (4.3589 0.8644)
276.10912 2.62 156 (0.81988)
276.14550 2.83 145 (0.88625)
282.15607 10.33 160 (3.2323)
292.14042 2.27 146 137 147 (0.26663 0.24776 0.19446)
296.17172 4.03 143 (1.26)
308.13533 2.85 101 212 168 211 170 (0.79913 0.061818 0.017024 0.011964 0.00049886)
316.14042 3.01 142 136 99 (0.61779 0.21142 0.11282)
324.16663 3.02 114 93 (0.66499 0.27988)

0 352.1615452241 CCC1CC(O)n2c(nc3c(ncn3C3CC(O)C(CO)O3)c2=[OH+])N1
1 334.1509805401 CCC1CC(O)N2CC3=C(N=C2N1)N(C1CC(O)C(=C=[OH+])O1)C=N3
2 220.1192864881 CCC1=NC2=NC3=C(CN2C([OH2+])C1)N=CN3
3 119.0702706321 OC1CCOC1C[OH2+]
4 119.0702706321 O=CCC(O)CC[OH2+] Intermediate Fragment 
5 117.0546205681 OC1CCOC1=C[OH2+]
6 99.0440558841 C=C1OCC=C1[OH2+]
7 99.0440558841 [OH+]=C=C1CCCO1
8 117.0546205681 CCC(O)C(=O)C=[OH+] Intermediate Fragment 
9 99.0440558841 CC=C(O)C#C[OH2+]
10 57.0334912001 CC#C[OH2+]
11 117.0546205681 O=CCC(O)C=C[OH2+] Intermediate Fragment 
12 117.0546205681 OCCCOC#C[OH2+] Intermediate Fragment 
13 117.0546205681 CCOC(=C=[OH+])CO Intermediate Fragment 
14 115.0389705041 OC1CCOC1=C=[OH+]
15 234.0985510441 CCC1=NC2=NC3=C(N=CN3)C(=[OH+])N2C(O)C1
16 236.1142011081 CCC1CC(O)N2C(=[OH+])C3=C(N=C2N1)NC=N3
17 218.1036364241 CCC1=NC2=NC3=C(CN2C([OH2+])=C1)N=CN3
18 218.1036364241 CCC1=NC2=NC3=C(N=CN3)C(=[OH+])N2CC1
19 206.0672509161 OC1CC=NC2=NC3=C(N=CN3)C(=[OH+])N21
20 208.0829009801 OC1CCNC2=NC3=C(N=CN3)C(=[OH+])N21
21 210.0985510441 OC1CCNC2=NC3=C(NCN3)C(=[OH+])N21
22 220.0829009801 CC1=NC2=NC3=C(N=CN3)C(=[OH+])N2C(O)C1
23 236.1142011081 CCC1=NC(=N)N(C(=[OH+])C2=CNC=N2)C(O)C1 Intermediate Fragment 
24 236.1142011081 CCC1=NC(=NC2=CN=CN2)N(C=[OH+])C(O)C1 Intermediate Fragment 
25 82.0399735481 [NH2+]=C1C=NC=N1
26 208.1192864881 CCC1CC(O)N=C([NH+]=C2C=NC=N2)N1
27 236.1142011081 CCC1CC(O)N=C(N=C2NC=NC2=C=[OH+])N1 Intermediate Fragment 
28 114.0661882961 [NH2+]=C1NCNC1C=O
29 110.0348881681 [NH2+]=C1N=CN=C1C=O
30 125.0709393281 CCC1=NC=NC([OH2+])=C1
31 127.0865893921 CCC1=NC=NC([OH2+])C1
32 129.1022394561 CCC1CC([OH2+])N=CN1
33 136.0505382321 C#CC1=NC([NH3+])=NC(O)=C1
34 138.0661882961 C=CC1=NC([NH3+])=NC(O)=C1
35 140.0818383601 CCC1=NC([NH3+])=NC(O)=C1
36 142.0974884241 CCC1=NC([NH3+])=NC(O)C1
37 206.1036364241 CCC1=NC([NH+]=C2C=NC=N2)=NC(O)C1
38 236.1142011081 CCC1=CC(O)N(C([OH2+])=C2N=CNC2=N)C=N1 Intermediate Fragment 
39 219.0876520121 CCC1=CC(=O)N(C(=[OH+])C2=CNC=N2)C=N1
40 155.0815040121 CCC1=CC(O)N(C=[OH+])C=N1
41 108.0192381041 N=C1N=CN=C1C#[O+]
42 236.1142011081 CCC1CC(O)N2C(=[OH+])C=C(N=C=N)N=C2N1 Intermediate Fragment 
43 219.0876520121 C=[NH+]C1=CC(=O)N2C(O)=CC(CC)=NC2=N1
44 194.0924030441 CCC1=NC2=NC=CC(=[OH+])N2C(O)C1
45 192.0767529801 CCC1=NC2=NC=CC(=[OH+])N2C(O)=C1
46 236.1142011081 CCC1CC(O)N2C(=[OH+])C(N=C=N)=CN=C2N1 Intermediate Fragment 
47 209.1033020761 CCC1=NC2=NC=C([NH3+])C(=O)N2C(O)C1
48 219.0876520121 C=[NH+]C1=CN=C2N=C(CC)C=C(O)N2C1=O
49 236.1142011081 C=NC1=C(N)N=C2N=C(CC)CC(O)N2C1=[OH+] Intermediate Fragment 
50 205.0720019481 C=CC1=NC2=NC([NH3+])=CC(=O)N2C(O)=C1
51 207.0876520121 CCC1=NC2=NC([NH3+])=CC(=O)N2C(O)=C1
52 209.1033020761 CCC1=NC2=NC([NH3+])=CC(=O)N2C(O)C1
53 220.0829009801 C=CC1=NC2=NC(N)=C([NH3+])C(=O)N2C(O)=C1
54 234.0985510441 C=[NH+]C1=C(N)N=C2N=C(CC)C=C(O)N2C1=O
55 236.1142011081 C=NC1=C(N)C(=[OH+])N2C(=N1)N=C(CC)CC2O Intermediate Fragment 
56 207.0876520121 CCC1=NC2=NC=C([NH3+])C(=O)N2C(O)=C1
57 205.0720019481 C=CC1=NC2=NC=C([NH3+])C(=O)N2C(O)=C1
58 236.1142011081 CCC=CC(O)N1C(=[OH+])C2=C(N=C1N)NC=N2 Intermediate Fragment 
59 194.0672509161 C=C(O)N1C(=O)C2=C(N=C1[NH3+])NC=N2
60 43.0542266441 CC=[CH3+]
61 186.0985510441 [NH3+]C1=NC2=C(NCN2)C(O)N1CO
62 184.0829009801 [NH3+]C1=NC2=C(NCN2)C(=O)N1CO
63 180.0516008521 [NH3+]C1=NC2=C(N=CN2)C(=O)N1C=O
64 178.0359507881 NC1=NC2=C(N=CN2)C(=O)N1C#[O+]
65 57.0698767081 C=[CH2+]CC
66 59.0855267721 CC[CH3+]C
67 156.0879863601 [NH3+]C1=NC(O)C2NCNC2=N1
68 154.0723362961 [NH3+]C1=NC(=O)C2NCNC2=N1
69 152.0566862321 [NH3+]C1=NC(=O)C2=NCNC2=N1
70 150.0410361681 [NH3+]C1=NC(=O)C2=NC=NC2=N1
71 87.0804413921 CCC=CC[OH2+]
72 234.0985510441 CCC#CC(O)N1C(=O)C2=C(N=C1[NH3+])NC=N2
73 236.1142011081 CCC=NC1=NC2=C(N=CN2)C(=[OH+])N1C(C)O Intermediate Fragment 
74 58.0651256761 CCC=[NH2+]
75 192.0516008521 [CH+]=C(O)N1C(=O)C2=C(N=C1N)NC=N2
76 194.1036364241 CCC[NH2+]C1=NC(O)=C2N=CNC2=N1
77 192.0879863601 CCC=[NH+]C1=NC(O)=C2N=CNC2=N1
78 236.1142011081 CCC(C)=NC1=NC2=C(N=CN2)C(=[OH+])N1CO Intermediate Fragment 
79 206.1036364241 CCC(C)=[NH+]C1=NC(O)=C2N=CNC2=N1
80 236.1142011081 CCC(CCO)=NC1=NC([OH2+])=C2N=CNC2=N1 Intermediate Fragment 
81 102.0913404241 CCC(=[NH2+])CCO
82 85.0647913281 CCC#CC[OH2+]
83 236.1142011081 CCC(=N)CC(O)N1C=NC2=C(N=CN2)C1=[OH+] Intermediate Fragment 
84 219.0876520121 CCC#CC(O)N1C=NC2=C(N=CN2)C1=[OH+]
85 135.0301371361 [OH+]=C1N=CN=C2N=CN=C12
86 238.1298511721 CCC1CC(O)N2C(=[OH+])C3=C(N=C2N1)NCN3
87 240.1455012361 CCC1CC(O)N2C(=NC3=C(NCN3)C2[OH2+])N1
88 240.1455012361 CCC1CC(O)N=C(N=C2NCNC2=C[OH2+])N1 Intermediate Fragment 
89 240.1455012361 CCCCC(O)N1C(=[OH+])C2=C(N=C1N)NCN2 Intermediate Fragment 
90 242.1611513001 CCC1CC(O)N2C(=NC3NCNC3C2[OH2+])N1
91 320.1353304761 CCC1CC(O)N2C(=[OH+])C3=C(N=C2N1)N(C1CC(O)=CO1)C=N3
92 322.1509805401 CCC1CC(O)N2C(=[OH+])C3=C(N=C2N1)N(C1CC(O)CO1)C=N3
93 324.1666306041 CCC1CC(O)N2C(=[OH+])C3=C(N=C2N1)N(C1CC(O)CO1)CN3
94 334.1509805401 C=C1OC(N2C=NC3=C2N=C2NC(CC)CC(O)N2C3=[OH+])CC1O
95 334.1509805401 CCC1CC(O)N2C(=[OH+])C3=C(N=C2N1)N(CC=C(O)C(C)=O)C=N3 Intermediate Fragment 
96 334.1509805401 C=C(C=O)OC(C)N1C=NC2=C1N=C1NC(CC)CC(O)N1C2=[OH+] Intermediate Fragment 
97 334.1509805401 CCC1CCN2C(=[OH+])C3=C(N=C2N1)N(C1CC(O)C(=CO)O1)C=N3
98 220.1192864881 CCC1CCN2C(=[OH+])C3=C(N=C2N1)NC=N3
99 316.1404158561 C=C1OC(N2C=NC3=C2N=C2NC(CC)CCN2C3=[OH+])C=C1O
100 306.1196804121 OC=C1OC(N2C=NC3=C2N=C2NCCCN2C3=[OH+])CC1O
101 308.1353304761 OCC1OC(N2C=NC3=C2N=C2NCCCN2C3=[OH+])CC1O
102 334.1509805401 CCC1CCN2C(=[OH+])C3=C(N=C2N1)N(CCC(O)C(=O)C=O)C=N3 Intermediate Fragment 
103 334.1509805401 CCC1CCN2C(=[OH+])C3=C(N=C2N1)N(C(=O)CC(O)C=CO)C=N3 Intermediate Fragment 
104 334.1509805401 CCC(CC)NC1=NC([OH2+])=C2N=CN(C3CC(O)C(=C=O)O3)C2=N1 Intermediate Fragment 
105 322.1145950321 OC=C1OC(N2C=NC3=C2N=C2NCCC(O)N2C3=[OH+])CC1O
106 324.1302450961 OCC1OC(N2C=NC3=C2N=C2NCCC(O)N2C3=[OH+])CC1O
107 306.1196804121 OC=C1CCC(N2C=NC3=C2N=C2NCCC(O)N2C3=[OH+])O1
108 324.1302450961 O=C(CC(O)CCO)N1C=NC2=C1N=C1NCCC(O)N1C2=[OH+] Intermediate Fragment 
109 324.1302450961 CCC(O)N1C(=[OH+])C2=C(N=C1N)N(C1CC(O)C(=CO)O1)C=N2 Intermediate Fragment 
110 326.1458951601 OCC1OC(N2CNC3=C2N=C2NCCC(O)N2C3=[OH+])CC1O
111 336.1302450961 CC1CC(O)N2C(=[OH+])C3=C(N=C2N1)N(C1CC(O)C(=CO)O1)C=N3
112 352.1615452241 CCC1CC(O)N(C(=[OH+])C2=CN(C3CC(O)C(=CO)O3)C=N2)C(=N)N1 Intermediate Fragment 
113 352.1615452241 CCC1CC(O)N(C=[OH+])C(=NC2=CN=CN2C2CC(O)C(=CO)O2)N1 Intermediate Fragment 
114 324.1666306041 CCC1CC(O)N=C([NH+]=C2C=NCN2C2CC(O)C(=CO)O2)N1
115 352.1615452241 CCC1CC(O)N=C(N=C2C(=C=[OH+])N=CN2C2CC(O)C(CO)O2)N1 Intermediate Fragment 
116 226.0822322841 [NH2+]=C1C(=C=O)N=CN1C1CC(O)C(CO)O1
117 127.0865893921 CCC(=CC[OH2+])N=C=N Intermediate Fragment 
118 111.0916747721 C[CH3+]C1=NC=NCC1
119 217.1182834441 OCC1OC(N2C=C(C[OH2+])NC2)CC1O
120 352.1615452241 CCC1CC(O)N(C([OH2+])=C2N=CN(C3CC(O)C(=C=O)O3)C2=N)CN1 Intermediate Fragment 
121 224.0665822201 [NH2+]=C1C(=C=O)N=CN1C1CC(O)C(=CO)O1
122 352.1615452241 CCC1CC(O)N2C(=[OH+])C=C(N(C=N)C3CC(O)C(=CO)O3)N=C2N1 Intermediate Fragment 
123 335.1349961281 CCC1CC(O)N2C(=O)C=C([NH+](C)C3C=C(O)C(=C=O)O3)N=C2N1
124 325.1506461921 CCC1CC(O)N2C(=O)C=C([NH+]=C3CC(O)C(CO)O3)N=C2N1
125 196.1080531081 CCC1CC(O)N2C(=[OH+])C=CN=C2N1
126 178.0974884241 CCC1=NC2=NC=CCN2C([OH2+])=C1
127 196.1080531081 CCC=CC(O)N1C(=[OH+])C=CN=C1N Intermediate Fragment 
128 194.0924030441 CCC=C=C(O)N1C(=[OH+])C=CN=C1N Intermediate Fragment 
129 159.0764186321 [NH+]#CNC1CC(O)C(CO)O1
130 352.1615452241 CCC1CC(O)N2C(=[OH+])C(N=C=NC3CC(O)C(CO)O3)=CN=C2N1 Intermediate Fragment 
131 352.1615452241 C=NC1=C(N=C2CC(O)C(CO)O2)N=C2NC(CC)CC(O)N2C1=[OH+] Intermediate Fragment 
132 227.1502522681 CCC1CC(O)N2C(=NC=C([NH2+]C)C2O)N1
133 352.1615452241 CCC1CC(O)N2C(=[OH+])C3=C(N=C2N1)N(CCC(O)C(=O)CO)C=N3 Intermediate Fragment 
134 334.1509805401 CCC1CC(O)N2C(=[OH+])C3=C(N=C2N1)N(CCC(O)C#CO)C=N3
135 306.1560659201 C=C(O)CCN1C=NC2=C1N=C1NC(CC)CC(O)N1C2=[OH+]
136 316.1404158561 C#CC(O)=CCN1C=NC2=C1N=C1NC(CC)CC(O)N1C2=[OH+]
137 292.1404158561 CCC1CC(O)N2C(=[OH+])C3=C(N=C2N1)N(CC=CO)C=N3
138 290.1247657921 CCC1CC(O)N2C(=[OH+])C3=C(N=C2N1)N(CC#CO)C=N3
139 264.1455012361 CCC1CC(O)N2C(=[OH+])C3=C(N=C2N1)N(CC)C=N3
140 262.1298511721 CCC1=NC2=NC3=C(N=CN3CC)C(=[OH+])N2C(O)C1
141 260.1142011081 CCC1=NC2=NC3=C(N=CN3CC)C(=[OH+])N2C(O)=C1
142 316.1404158561 CCC1CC(O)N2C(=[OH+])C3=C(N=C2N1)N(CC=CC#CO)C=N3
143 296.1717159841 CCC1CC(O)N2C(=[OH+])C3=C(N=C2N1)N(CCCO)CN3
144 294.1560659201 CCC1CC(O)N2C(=[OH+])C3=C(N=C2N1)N(CCCO)C=N3
145 276.1455012361 C=CCN1C=NC2=C1N=C1NC(CC)CC(O)N1C2=[OH+]
146 292.1404158561 CCCCC(O)N1C(=[OH+])C2=C(N=C1N)N(CC#CO)C=N2 Intermediate Fragment 
147 292.1404158561 CCC(N)CC(O)N1C=NC2=C(N=CN2CC#CO)C1=[OH+] Intermediate Fragment 
148 63.0440558841 OCC[OH2+]
149 268.1768013641 CCC1CC(O)N2C(=NC3=C(NCN3CC)C2[OH2+])N1
150 266.1611513001 CCC1CC(O)N2C(=[OH+])C3=C(N=C2N1)N(CC)CN3
151 264.1455012361 CCC1CC(O)N=C(N=C2C(=C=[OH+])N=CN2CC)N1 Intermediate Fragment 
152 91.0389705041 OCC(=[OH+])CO
153 352.1615452241 CCC1CC(O)N2C(=[OH+])C3=C(N=C2N1)N(COC(=CO)C(C)O)C=N3 Intermediate Fragment 
154 352.1615452241 CCC1CC(O)N2C(=[OH+])C3=C(N=C2N1)N(C(C)OC(=CO)CO)C=N3 Intermediate Fragment 
155 75.0440558841 OCC=C[OH2+]
156 276.1091157281 CCC1=NC2=NC3=C(N=CN3C(C)=O)C(=[OH+])N2C(O)C1
157 278.1247657921 CCC1CC(O)N2C(=[OH+])C3=C(N=C2N1)N(C(C)=O)C=N3
158 278.1247657921 CCC=CC(O)N1C(=[OH+])C2=C(N=C1N)N(C(C)=O)C=N2 Intermediate Fragment 
159 280.1404158561 CCC1CC(O)N2C(=[OH+])C3=C(N=C2N1)N(C(C)O)C=N3
160 282.1560659201 CCC1CC(O)N2C(=[OH+])C3=C(N=C2N1)N(C(C)O)CN3
161 320.1353304761 CCC1CC(O)N2C(=[OH+])C3=C(N=C2N1)N(C(C)OC#CO)C=N3
162 322.1509805401 CCC1CC(O)N2C(=[OH+])C3=C(N=C2N1)N(C(C)OC=CO)C=N3
163 352.1615452241 CCC1CC(O)N2C(=[OH+])C3=C(N=C2N1)N(C(CCO)OC=CO)C=N3 Intermediate Fragment 
164 47.0491412641 CC[OH2+]
165 29.0385765801 C=[CH3+]
166 45.0334912001 C=C[OH2+]
167 306.1196804121 CCC1CC(O)N2C(=[OH+])C3=C(N=C2N1)N(C(=O)C=CO)C=N3
168 308.1353304761 CCC1CC(O)N2C(=[OH+])C3=C(N=C2N1)N(C(=O)CCO)C=N3
169 310.1509805401 CCC1CC(O)N2C(=[OH+])C3=C(N=C2N1)N(C(O)CCO)C=N3
170 308.1353304761 CCC1CC(O)N2C(=[OH+])C3=C(N=C2N1)N(COC=CO)C=N3
171 306.1196804121 CCC1CC(O)N2C(=[OH+])C3=C(N=C2N1)N(COC#CO)C=N3
172 352.1615452241 CCC1CC(O)N2C(=[OH+])C3=C(N=C2N1)N(C(=O)CC(O)CCO)C=N3 Intermediate Fragment 
173 284.1717159841 CCC1CC(O)N2C(=NC3=C(NCN3C(C)O)C2[OH2+])N1
174 68.9971056921 [O+]#CC#CO
175 71.0127557561 O=CC#C[OH2+]
176 43.0178411361 C#C[OH2+]
177 73.0284058201 OCC#C[OH2+]
178 55.0178411361 C#CC=[OH+]
179 77.0597059481 OCCC[OH2+]
180 59.0491412641 C=CC[OH2+]
181 268.1404158561 CCC1CC(O)N2C(=[OH+])C3=C(N=C2N1)N(CO)CN3
182 266.1247657921 CCC1CC(O)N2C(=[OH+])C3=C(N=C2N1)N(CO)C=N3
183 264.1091157281 CCC1CC(O)N2C(=[OH+])C3=C(N=C2N1)N(C=O)C=N3
184 264.1091157281 CCC=CC(O)N1C(=[OH+])C2=C(N=C1N)N(C=O)C=N2 Intermediate Fragment 
185 262.0934656641 CCC1=NC2=NC3=C(N=CN3C=O)C(=[OH+])N2C(O)C1
186 87.0440558841 CC(O)C#C[OH2+]
187 89.0597059481 CC(O)C=C[OH2+]
188 71.0491412641 C#CC(C)[OH2+]
189 71.0491412641 CCC#C[OH2+]
190 91.0753560121 CC(O)CC[OH2+]
191 73.0647913281 C=CC(C)[OH2+]
192 73.0647913281 CCC=C[OH2+]
193 350.1458951601 CCC1CC(O)N2C(=[OH+])C3=C(N=C2N1)N(C(=O)CC(O)C=CO)C=N3
194 352.1615452241 CCCCC(O)N1C(=[OH+])C2=C(N=C1N)N(C1CC(O)C(=CO)O1)C=N2 Intermediate Fragment 
195 312.1302450961 CC(O)N1C(=O)C2=C(N=C1[NH3+])N(C1CC(O)C(CO)O1)C=N2
196 45.0698767081 CC[CH4+]
197 298.1145950321 [NH3+]C1=NC2=C(N=CN2C2CC(O)C(CO)O2)C(=O)N1CO
198 296.0989449681 [NH3+]C1=NC2=C(N=CN2C2CC(O)C(=CO)O2)C(=O)N1CO
199 272.1353304761 [NH3+]C1=NC(O)C2NCN(C3CC(O)C(CO)O3)C2=N1
200 270.1196804121 [NH3+]C1=NC(O)=C2NCN(C3CC(O)C(CO)O3)C2=N1
201 268.1040303481 [NH3+]C1=NC(O)=C2N=CN(C3CC(O)C(CO)O3)C2=N1
202 268.1040303481 [NH3+]C1=NC(O)=C2N=CN(C(=O)CC(O)CCO)C2=N1 Intermediate Fragment 
203 266.0883802841 [NH3+]C1=NC(O)=C2N=CN(C(=O)CC(O)C=CO)C2=N1
204 266.0883802841 [NH3+]C1=NC(O)=C2N=CN(CCC(O)C(=O)C=O)C2=N1 Intermediate Fragment 
205 264.0727302201 [NH3+]C1=NC(O)=C2N=CN(C3CC(O)C(=C=O)O3)C2=N1
206 352.1615452241 CCCNC1=NC2=C(N=CN2C2CC(O)C(=CO)O2)C(=[OH+])N1C(C)O Intermediate Fragment 
207 310.1145950321 CC(O)N1C(=O)C2=C(N=C1[NH3+])N(C1CC(O)C(=CO)O1)C=N2
208 310.1145950321 CC(O)N1C(=O)C2=C(N=C1[NH3+])N(C(=O)CC(O)C=CO)C=N2 Intermediate Fragment 
209 310.1509805401 CCC[NH2+]C1=NC(O)=C2N=CN(C3CC(O)C(CO)O3)C2=N1
210 310.1509805401 CCC[NH2+]C1=NC(O)=C2N=CN(C(=O)CC(O)CCO)C2=N1 Intermediate Fragment 
211 308.1353304761 CCC[NH2+]C1=NC(O)=C2N=CN(C3CC(O)C(=CO)O3)C2=N1
212 308.1353304761 CCC[NH2+]C1=NC(O)=C2N=CN(C(=O)CC(O)C=CO)C2=N1 Intermediate Fragment 
213 352.1615452241 CCC(C)NC1=NC2=C(N=CN2C2CC(O)C(=CO)O2)C(=[OH+])N1CO Intermediate Fragment 
214 352.1615452241 CCC(CCO)NC1=NC([OH2+])=C2N=CN(C3CC(O)C(=CO)O3)C2=N1 Intermediate Fragment 
215 352.1615452241 CCC(N)CC(O)N1C=NC2=C(N=CN2C2CC(O)C(=CO)O2)C1=[OH+] Intermediate Fragment 
216 335.1349961281 CCCCC(O)N1C=NC2=C(N=CN2C2CC(O)C(=C=O)O2)C1=[OH+]
217 221.1033020761 CCC=CC(O)N1C=NC2=C(N=CN2)C1=[OH+]
218 251.0774812521 OC=C1OC(N2C=NC3=C([OH2+])N=CN=C32)CC1O
219 297.1193460641 CC(O)N1C=NC2=C(N=CN2C2CC(O)C(CO)O2)C1=[OH+]
220 295.1036960001 CC(O)N1C=NC2=C(N=CN2C2CC(O)C(=CO)O2)C1=[OH+]
221 179.0563518841 C=C(O)N1C=NC2=C(N=CN2)C1=[OH+]
222 295.1036960001 CC(O)N1C=NC2=C(N=CN2C(=O)CC(O)C=CO)C1=[OH+] Intermediate Fragment 
223 56.0494756121 CCC#[NH+]
224 39.0229265161 [C+]#CC
225 60.0807757401 CCC[NH3+]
226 281.0880459361 OC=C1OC(N2C=NC3=C2N=CN(CO)C3=[OH+])CC1O
227 253.0931313161 OCC1OC(N2C=NC3=C([OH2+])N=CN=C32)CC1O
228 253.0931313161 O=C(CC(O)CCO)N1C=NC2=C([OH2+])N=CN=C21 Intermediate Fragment 
229 251.0774812521 O=C(CC(O)C=CO)N1C=NC2=C([OH2+])N=CN=C21 Intermediate Fragment 
230 100.0756903601 CCC(=[NH2+])C=CO
231 82.0651256761 C#CC(=[NH2+])CC
