#In-silico ESI-MS/MS [M+H]+ Spectra
#PREDICTED BY CFM-ID 4.0.8
#SMILES=O1[C@H](CO)[C@@H](C[C@@H]1N1CC(C(=O)NC1=O)C)O
#InChiKey=FEYHMSUYKIMUAL-UIYHXYAWSA-N
energy0
84.04439 10.27 42 48 37 (2.3826 1.7713 1.6352)
101.07094 6.48 38 58 (3.3928 0.26102)
129.06585 100.00 2 40 68 32 60 64 52 (43.363 7.5531 1.5392 1.3604 1.0365 0.85104 0.64188)
227.10263 9.78 120 4 127 123 118 185 128 14 122 11 10 13 15 12 (4.7611 0.24127 0.14345 0.11108 0.10997 0.076952 0.030434 0.016155 0.0097717 0.002833 0.0021992 0.0015601 0.0010193 0.00047423)
245.11320 18.84 0 209 129 244 239 234 188 223 191 193 249 256 (10.194 0.26116 0.062208 0.026131 0.019292 0.013849 0.010639 0.0093206 0.0068922 0.0059618 0.0050536 0.0031065)
energy1
43.01784 11.60 90 (2.2557)
43.05423 17.14 70 (3.3317)
45.03349 23.36 91 (4.5406)
57.03349 27.54 55 (5.3549)
58.06513 12.56 25 (2.4413)
59.04914 10.98 54 (2.1356)
61.02841 6.83 100 (1.3287)
71.02399 5.02 56 (0.9752)
84.04439 24.20 37 48 42 (2.6198 1.9693 0.11495)
87.04406 11.15 80 94 102 (1.9537 0.15326 0.059865)
89.05971 5.25 85 98 95 (0.5922 0.27306 0.15455)
99.04406 85.69 96 7 86 (10.919 4.4427 1.2987)
101.05971 17.49 8 111 114 (1.8434 0.90373 0.65329)
111.05529 7.63 29 30 (0.85916 0.62438)
113.03455 6.56 31 (1.2751)
117.05462 14.43 105 84 87 97 101 104 (1.0707 0.75264 0.65269 0.24751 0.061099 0.021238)
127.05020 13.30 6 39 71 59 72 67 51 (0.82231 0.67545 0.62292 0.19232 0.1896 0.076978 0.0059669)
129.06585 100.00 2 60 68 52 32 40 64 (12.907 1.8089 1.793 0.89164 0.84434 0.76982 0.42746)
133.09715 6.26 16 19 26 24 20 (1.1691 0.016779 0.01558 0.0087558 0.0059308)
227.10263 5.46 118 4 185 120 15 14 128 10 13 123 11 12 127 122 (0.44573 0.35769 0.11742 0.050844 0.040809 0.012261 0.0079097 0.006486 0.0063303 0.0055049 0.0051726 0.0028106 0.0013376 0.00054758)
energy2
41.03858 6.87 69 (1.1835)
43.01784 6.64 90 (1.1429)
45.03349 19.07 91 (3.2837)
55.01784 6.49 65 (1.1175)
56.04948 13.67 36 (2.3529)
57.03349 31.03 55 (5.3433)
58.06513 12.56 25 (2.1622)
59.04914 10.16 54 (1.7494)
61.02841 6.43 100 (1.1077)
69.03349 26.45 53 180 179 (4.0661 0.28018 0.20771)
71.04914 15.43 181 182 21 (1.6234 0.71976 0.31355)
84.04439 16.12 42 37 48 (1.4917 0.71243 0.57156)
86.06004 8.36 23 173 41 (0.89391 0.47661 0.0693)
99.04406 30.63 7 86 96 (4.0066 0.83616 0.43107)
100.07569 11.01 142 (1.8959)
101.05971 5.31 8 111 114 (0.48001 0.42786 0.0067776)
111.05529 24.56 29 30 (3.8789 0.35078)
112.03930 14.74 33 49 (2.2644 0.27344)
113.03455 28.11 31 (4.8407)
113.07094 8.43 27 (1.4518)
115.01382 7.02 172 (1.2079)
127.05020 9.21 6 39 72 59 71 51 67 (0.66428 0.48108 0.21275 0.16427 0.033035 0.021392 0.0093814)
129.06585 100.00 52 2 32 60 40 68 64 (6.5326 2.9773 2.4647 1.977 1.2121 1.0962 0.95849)
155.08150 13.49 126 136 (1.9541 0.36845)
157.06077 5.97 137 171 169 170 174 167 (0.33493 0.29503 0.11517 0.10798 0.10661 0.067794)
157.09715 17.03 192 (2.9319)
183.07642 5.83 186 (1.0045)
187.10772 8.36 190 (1.4386)

0 245.1131980641 CC1CN(C2CC(O)C(C[OH2+])O2)C(=O)NC1=O
1 213.0869833161 CC1=CN(C2=CC(O)=CO2)C(O)NC1[OH2+]
2 129.0658539481 CC1=C([OH2+])NC(O)N=C1
3 215.1026333801 CC1CN(C2=CC(O)=CO2)C(O)NC1[OH2+]
4 227.1026333801 C=C1OC(N2C=C(C)C([OH2+])NC2O)C=C1O
5 131.0815040121 CC1C=NC(O)NC1[OH2+]
6 127.0502038841 CC1=C([OH2+])N=C(O)N=C1
7 99.0440558841 C=C1OC=CC1[OH2+]
8 101.0597059481 C=C1OCCC1[OH2+]
9 209.0920686961 C=C1C=CC(N2C=C(C)C(=[OH+])NC2O)O1
10 227.1026333801 C#COC(=C=CO)N1CC(C)C([OH2+])NC1O Intermediate Fragment 
11 227.1026333801 CC(=O)C(O)=C=CN1C=C(C)C([OH2+])NC1O Intermediate Fragment 
12 227.1026333801 C=C1OC(N(C)C(O)=NC([OH2+])=CC)C=C1O Intermediate Fragment 
13 227.1026333801 C=C1OC(N(C=CC)C(O)NC=[OH+])C=C1O Intermediate Fragment 
14 227.1026333801 C=C1OC(N(C=C(C)C=[OH+])C(N)O)C=C1O Intermediate Fragment 
15 227.1026333801 C=C1OC(=NC=C(C)C([OH2+])NCO)C=C1O Intermediate Fragment 
16 133.0971540761 CC1CNC(O)NC1[OH2+]
17 115.0865893921 CC1C=NC([OH2+])NC1
18 115.0865893921 CC1C=NCNC1[OH2+]
19 133.0971540761 CC(C=N)C([OH2+])NCO Intermediate Fragment 
20 133.0971540761 CC(C=NC(N)O)C[OH2+] Intermediate Fragment 
21 71.0491412641 C=C(C)C=[OH+]
22 73.0396392001 C=[NH+]C(=N)O
23 86.0600402961 CC(C#[NH+])CO
24 133.0971540761 CCC=NC(O)NC[OH2+] Intermediate Fragment 
25 58.0651256761 CCC=[NH2+]
26 133.0971540761 C=NC(O)NC([OH2+])CC Intermediate Fragment 
27 113.0709393281 CC1=CNC([OH2+])N=C1
28 115.0502038841 OC1N=CC=C([OH2+])N1
29 111.0552892641 CC1=CN=C([OH2+])N=C1
30 111.0552892641 CC1=C([OH2+])N=CN=C1
31 113.0345538201 OC1=NC([OH2+])=CC=N1
32 129.0658539481 CC(=C=N)C(=[OH+])NCO Intermediate Fragment 
33 112.0393048521 C=C(C)C(=O)[NH+]=C=O
34 72.0080047241 O=C=[NH+]C=O
35 54.0338255481 C=CC#[NH+]
36 56.0494756121 CCC#[NH+]
37 84.0443902321 CC(C#[NH+])=CO
38 101.0709393281 CC(C#[NH+])C(N)O
39 127.0502038841 CC(C#[NH+])=C(O)N=CO
40 129.0658539481 CC(=C=NCO)C(N)=[OH+] Intermediate Fragment 
41 86.0600402961 C=C(C)C([NH3+])=O
42 84.0443902321 [CH+]=C(C)C(N)=O
43 44.0130901041 [NH2+]=C=O
44 72.0443902321 C=CC([NH3+])=O
45 56.0130901041 C#[N+]C=O
46 58.0287401681 C=[NH+]C=O
47 60.0443902321 C=[NH+]CO
48 84.0443902321 CC=C=[NH+]C=O
49 112.0393048521 CC(=C=[NH+]C=O)C=O
50 99.0552892641 CC(C#[NH+])=C(N)O
51 127.0502038841 CC(=C=[NH+]C=O)C(N)=O
52 129.0658539481 CC(=C=NC(N)O)C=[OH+] Intermediate Fragment 
53 69.0334912001 C=C(C)C#[O+]
54 59.0491412641 CC=C[OH2+]
55 57.0334912001 CC=C=[OH+]
56 71.0239891361 C#[N+]C(=N)O
57 99.0552892641 CC=C=[NH+]C(=N)O
58 101.0709393281 CC=C=[NH+]C(N)O
59 127.0502038841 CC(=C=[NH+]C(=N)O)C=O
60 129.0658539481 CC=C=NC(O)NC=[OH+] Intermediate Fragment 
61 87.0189037561 [NH3+]C(=O)N=C=O
62 46.0287401681 [NH3+]C=O
63 69.9923546601 O=C=[N+]=C=O
64 129.0658539481 C=NC(O)=NC([OH2+])=CC Intermediate Fragment 
65 55.0178411361 C=C=C=[OH+]
66 98.0236547881 C=C=C(O)[NH+]=C=O
67 127.0502038841 C=C=C(O)N=C(O)[NH+]=C
68 129.0658539481 C=C(C)C(=[OH+])N=C(N)O Intermediate Fragment 
69 41.0385765801 [CH2+]#CC
70 43.0542266441 CC=[CH3+]
71 127.0502038841 [CH+]=C(C)C(=O)N=C(N)O
72 127.0502038841 CC=C=NC(O)N=C=[OH+] Intermediate Fragment 
73 113.0233204401 OC1=CCOC1=C=[OH+]
74 85.0284058201 [OH2+]C1=COC=C1
75 95.0127557561 [CH+]=C1OC=CC1=O
76 95.0127557561 [O+]#CC1=CC=CO1
77 113.0233204401 OC=C=C(O)C#C[OH2+] Intermediate Fragment 
78 113.0233204401 C=C=C(O)C(=O)C=[OH+] Intermediate Fragment 
79 115.0389705041 OC1CCOC1=C=[OH+]
80 87.0440558841 [OH2+]C1=COCC1
81 115.0389705041 OCC=C(O)C#C[OH2+] Intermediate Fragment 
82 115.0389705041 CC=C(O)C(=O)C=[OH+] Intermediate Fragment 
83 97.0284058201 C=C=C(O)C#C[OH2+]
84 117.0546205681 OC1CCOC1=C[OH2+]
85 89.0597059481 [OH2+]C1CCOC1
86 99.0440558841 [OH+]=C=C1CCCO1
87 117.0546205681 OCCC(O)C#C[OH2+] Intermediate Fragment 
88 73.0284058201 OC#CC[OH2+]
89 71.0127557561 OC#CC=[OH+]
90 43.0178411361 C#C[OH2+]
91 45.0334912001 C=C[OH2+]
92 47.0491412641 CC[OH2+]
93 75.0440558841 OCC=C[OH2+]
94 87.0440558841 CC(O)C#C[OH2+]
95 89.0597059481 CC(O)C=C[OH2+]
96 99.0440558841 CC=C(O)C#C[OH2+]
97 117.0546205681 OCCCOC#C[OH2+] Intermediate Fragment 
98 89.0597059481 CC[OH+]C=CO
99 73.0284058201 C[OH+]C#CO
100 61.0284058201 OCC=[OH+]
101 117.0546205681 CCOC(=C=[OH+])CO Intermediate Fragment 
102 87.0440558841 CC[OH+]C#CO
103 91.0389705041 OCC(=[OH+])CO
104 117.0546205681 COC(=C=[OH+])C(C)O Intermediate Fragment 
105 117.0546205681 CCC(O)C(=O)C=[OH+] Intermediate Fragment 
106 61.0647913281 CCC[OH2+]
107 59.0127557561 OC=C=[OH+]
108 31.0542266441 C[CH4+]
109 29.0385765801 C=[CH3+]
110 119.0702706321 OC1CCOC1C[OH2+]
111 101.0597059481 [OH2+]C=C1CCCO1
112 119.0702706321 OCCC(O)C=C[OH2+] Intermediate Fragment 
113 91.0753560121 CC(O)CC[OH2+]
114 101.0597059481 CCC(O)C#C[OH2+]
115 119.0702706321 OCCCOC=C[OH2+] Intermediate Fragment 
116 119.0702706321 CCOC(=C[OH2+])CO Intermediate Fragment 
117 119.0702706321 CCC(O)C(=O)C[OH2+] Intermediate Fragment 
118 227.1026333801 CC1CNC(O)N(C2C=C(O)C(=C=[OH+])O2)C1
119 229.0818979361 OC1=CC(N2CCC(O)NC2O)OC1=C=[OH+]
120 227.1026333801 CC1CN(C2C=CC(=C=[OH+])O2)C(O)NC1O
121 197.0920686961 CC1=CN(C2=CC=CO2)C(O)NC1[OH2+]
122 227.1026333801 C=C(OC(C)=C=[OH+])N1C=C(C)C(O)NC1O Intermediate Fragment 
123 227.1026333801 CC1CN(C=C=CC(=O)C=[OH+])C(O)NC1O Intermediate Fragment 
124 169.0971540761 C#CCN1C=C(C)C([OH2+])NC1O
125 167.0815040121 C#CCN1C=C(C)C(=[OH+])NC1O
126 155.0815040121 C#CN1C=C(C)C([OH2+])NC1O
127 227.1026333801 CC(=CN(C(N)O)C1C=CC(=C=[OH+])O1)CO Intermediate Fragment 
128 227.1026333801 CC(CN=C1C=CC(=C=[OH+])O1)C(O)NCO Intermediate Fragment 
129 245.1131980641 CC1CN(C(O)C=C(O)C#C[OH2+])C(O)NC1O Intermediate Fragment 
130 203.1026333801 CC1CN(C([OH2+])C#CO)C(O)NC1O
131 201.0869833161 CC1=CN(C([OH2+])C#CO)C(O)NC1O
132 199.0713332521 CC1=CN(C([OH2+])C#CO)C(O)NC1=O
133 177.1233688241 CC1CN(C(C)[OH2+])C(O)NC1O
134 175.1077187601 C=C([OH2+])N1CC(C)C(O)NC1O
135 173.0920686961 C=C([OH2+])N1C=C(C)C(O)NC1O
136 155.0815040121 C=C([OH2+])N1C=C(C)C=NC1O
137 157.0607685681 C=C([OH2+])N1C=CC(=O)NC1O
138 173.0920686961 C=C([OH2+])N=C=C(C)C(O)NCO Intermediate Fragment 
139 173.0920686961 C=C([OH2+])N(C=C(C)C(N)=O)CO Intermediate Fragment 
140 173.0920686961 C=C([OH2+])N(C=C(C)C=O)C(N)O Intermediate Fragment 
141 173.0920686961 C=C([OH2+])N(C=CC)C(O)NC=O Intermediate Fragment 
142 100.0756903601 C=C(O)[NH+]=CCC
143 173.0920686961 C=C([OH2+])N(C)C(O)=NC(O)=CC Intermediate Fragment 
144 72.0443902321 C=[NH+]C(=C)O
145 171.0764186321 C=C([OH2+])N1C=C(C)C(=O)NC1O
146 125.0345538201 [CH2+]C1=C(O)N=C(O)N=C1
147 153.0658539481 C#CN1C=C(C)C(=[OH+])NC1O
148 171.0764186321 C=C([OH2+])N=C=C(C)C(=O)NCO Intermediate Fragment 
149 70.0287401681 C#[N+]C(=C)O
150 96.0443902321 C=C=C=[NH+]C(=C)O
151 98.0600402961 C=C(O)[NH+]=C=CC
152 126.0549549161 C=C(O)[NH+]=C=C(C)C=O
153 128.0706049801 C=C(O)[NH+]=C=C(C)CO
154 143.0815040121 C=C(O)[NH+]=C=C(C)C(N)O
155 171.0764186321 C=C([OH2+])N(C=O)C=C(C)C(N)=O Intermediate Fragment 
156 171.0764186321 C=C([OH2+])N(C=C(C)C=O)C(=N)O Intermediate Fragment 
157 171.0764186321 C=C([OH2+])N(C=CC)C(O)N=C=O Intermediate Fragment 
158 171.0764186321 C=C=C(O)N=C(O)N(C)C(=C)[OH2+] Intermediate Fragment 
159 74.0600402961 C=C(O)[NH2+]C
160 100.0393048521 CC=C(O)[NH+]=C=O
161 169.0607685681 C=C([OH2+])N1C=C(C)C(=O)N=C1O
162 169.0607685681 C=C([OH2+])N=C=C(C)C(=O)N=CO Intermediate Fragment 
163 77.0597059481 OCCC[OH2+]
164 161.0920686961 CC1=CN(C[OH2+])C(O)NC1O
165 159.0764186321 CC1=CN(C[OH2+])C(O)NC1=O
166 141.0658539481 CC1=CN(C)C(O)=NC1=[OH+]
167 157.0607685681 CC1=CN(C[OH2+])C(O)=NC1=O
168 139.0502038841 [CH2+]N1C=C(C)C(=O)N=C1O
169 157.0607685681 CC(=CN=C[OH2+])C(=O)N=CO Intermediate Fragment 
170 157.0607685681 CC(=CN(C=O)C=[OH+])C(N)=O Intermediate Fragment 
171 157.0607685681 CC=CN(C[OH2+])C(=O)N=C=O Intermediate Fragment 
172 115.0138183761 O=C=NC(=O)[NH+]=CO
173 86.0600402961 CC=C[NH+]=CO
174 157.0607685681 C=C(C)C(=O)N=C(O)N=C[OH2+] Intermediate Fragment 
175 155.0451185041 CC1=CN(C=[OH+])C(O)=NC1=O
176 155.0451185041 CC(=CN=C[OH2+])C(=O)N=C=O Intermediate Fragment 
177 155.0451185041 C=C=CN(C[OH2+])C(=O)N=C=O Intermediate Fragment 
178 112.9981683121 O=C=NC(=O)[NH+]=C=O
179 69.0334912001 C#CC(=C)[OH2+]
180 69.0334912001 C=CC#C[OH2+]
181 71.0491412641 C#CC(C)[OH2+]
182 71.0491412641 CCC#C[OH2+]
183 73.0647913281 C=CC(C)[OH2+]
184 73.0647913281 CCC=C[OH2+]
185 227.1026333801 CC1CN(C=C=C(O)C#C[OH2+])C(O)NC1O
186 183.0764186321 CC1=CN(CC#CO)C(O)NC1=[OH+]
187 243.0975480001 CC1CN(C([OH2+])=C=C(O)C#CO)C(O)NC1O
188 245.1131980641 CC1CN(C(C=CO)OC#C[OH2+])C(O)NC1O Intermediate Fragment 
189 185.0920686961 CC1=CN(CC#CO)C(O)NC1[OH2+]
190 187.1077187601 CC1CN(CC#CO)C(O)NC1[OH2+]
191 245.1131980641 C=C(OC(=C=[OH+])CO)N1CC(C)C(O)NC1O Intermediate Fragment 
192 157.0971540761 C#CN1CC(C)C([OH2+])NC1O
193 245.1131980641 C=C(O)C(=C=[OH+])OCN1CC(C)C(O)NC1O Intermediate Fragment 
194 201.0869833161 CC1=CN(C[OH+]C#CO)C(O)NC1O
195 139.0502038841 C=NC=C(C)C(=[OH+])N=C=O Intermediate Fragment 
196 139.0502038841 C=C=CN(C)C(=O)N=C=[OH+] Intermediate Fragment 
197 96.0443902321 C=[N+](C#CC)C=O
198 68.0494756121 C=[NH+]C#CC
199 141.0658539481 C=NC=C(C)C(=[OH+])N=CO Intermediate Fragment 
200 141.0658539481 CC(=CN(C)C#[O+])C(N)=O Intermediate Fragment 
201 141.0658539481 CC(C#[O+])=CN(C)C(=N)O Intermediate Fragment 
202 141.0658539481 CC=CN(C)C(=O)N=C=[OH+] Intermediate Fragment 
203 98.0600402961 CC#C[NH+](C)C=O
204 70.0651256761 C=[NH+]C=CC
205 141.0658539481 C=C=C(O)N=C(O)N([CH2+])C Intermediate Fragment 
206 141.0658539481 C=NC(O)=NC(=[OH+])C(=C)C Intermediate Fragment 
207 143.0815040121 CC1=CN(C)C(O)NC1=[OH+]
208 125.0709393281 CC1=CN(C)C(=[OH+])N=C1
209 245.1131980641 CC1CN(CC=C(O)C(=O)C=[OH+])C(O)NC1O Intermediate Fragment 
210 189.1233688241 CC1CN(CC=CO)C(O)NC1[OH2+]
211 63.0440558841 OCC[OH2+]
212 161.1284542041 CCN1CC(C)C([OH2+])NC1O
213 159.1128041401 C=CN1CC(C)C([OH2+])NC1O
214 153.0658539481 C#CN=C=C(C)C(=[OH+])NCO Intermediate Fragment 
215 87.0076703761 O=CC(=[OH+])C=O
216 89.0233204401 O=CC(=[OH+])CO
217 71.0127557561 CC(=O)C#[O+]
218 73.0284058201 CC(=[OH+])C=O
219 93.0546205681 OCC([OH2+])CO
220 75.0440558841 CC(=[OH+])CO
221 105.0546205681 CC(O)C(=[OH+])CO
222 243.0975480001 CC1CN(C=C=C(O)C(=[OH+])C=O)C(O)NC1O
223 245.1131980641 CCC(O)NC(O)N(C)C1C=C(O)C(=C=[OH+])O1 Intermediate Fragment 
224 148.0968197281 C[NH2+]C1CC(O)C(CO)O1
225 130.0862550441 C=C1OC([NH2+]C)CC1O
226 130.0862550441 C[NH2+]C1CCC(=CO)O1
227 146.0811696641 C[NH2+]C1CC(O)C(=CO)O1
228 128.0706049801 C=C1OC([NH2+]C)C=C1O
229 146.0811696641 C[NH2+]C(O)CC(O)C#CO Intermediate Fragment 
230 146.0811696641 C[NH2+]C(C)OC(=C=O)CO Intermediate Fragment 
231 146.0811696641 C[NH2+]COC(=C=O)C(C)O Intermediate Fragment 
232 146.0811696641 C[NH2+]CCC(O)C(=O)C=O Intermediate Fragment 
233 144.0655196001 C[NH2+]C1CC(O)C(=C=O)O1
234 245.1131980641 CCCN(C(O)NCO)C1C=C(O)C(=C=[OH+])O1 Intermediate Fragment 
235 174.1124697921 CCC[NH2+]C1CC(O)C(=CO)O1
236 174.1124697921 CCC[NH2+]C(O)CC(O)C#CO Intermediate Fragment 
237 174.1124697921 CCC[NH2+]COC(=C=O)C(C)O Intermediate Fragment 
238 170.0811696641 CCC[NH2+]C1C=C(O)C(=C=O)O1
239 245.1131980641 CC(CO)CN(C(N)O)C1C=C(O)C(=C=[OH+])O1 Intermediate Fragment 
240 175.0713332521 NC(O)[NH2+]C1CC(O)C(=C=O)O1
241 175.0713332521 NC(O)[NH2+]C(O)C=C(O)C#CO Intermediate Fragment 
242 177.0869833161 NC(O)[NH2+]C1CC(O)C(=CO)O1
243 217.1182834441 CCC[NH+](C(N)O)C1CC(O)C(=C=O)O1
244 245.1131980641 CC(CN(CO)C1C=C(O)C(=C=[OH+])O1)C(N)O Intermediate Fragment 
245 158.0447841561 O=C=C1OC([NH2+]CO)C=C1O
246 160.0604342201 O=C=C1OC([NH2+]CO)CC1O
247 160.0604342201 OC#CC(O)=CC(O)[NH2+]CO Intermediate Fragment 
248 160.0604342201 C=C(O)C(=C=O)OC[NH2+]CO Intermediate Fragment 
249 245.1131980641 CC(CNC1C=C(O)C(=C=[OH+])O1)C(O)NCO Intermediate Fragment 
250 120.1019051081 CC(C)C(O)[NH2+]CO
251 116.0706049801 C=C(C)C(=O)[NH2+]CO
252 98.0600402961 C=[NH+]C(=O)C(=C)C
253 114.0549549161 C=C(C)C(=O)[NH+]=CO
254 132.0655196001 [NH3+]C1CC(O)C(=CO)O1
255 200.0917343481 CC(CO)C[NH2+]C1C=C(O)C(=C=O)O1
256 245.1131980641 CC(C)C(O)NC(O)NC1C=C(O)C(=C=[OH+])O1 Intermediate Fragment 
