#In-silico ESI-MS/MS [M+H]+ Spectra
#PREDICTED BY CFM-ID 4.0.8
#SMILES=[C@H]1(C[C@@H](O[C@@H]1CO)n1cc(c(=O)n(c1=O)C/C=C/c1ccc2c(c1)OCO2)C)O
#InChiKey=JEOAKLMKSSGQBE-NOVZMGDGSA-N
energy0
99.04406 4.96 125 133 124 (0.87974 0.68595 0.68288)
117.05462 4.75 121 131 126 142 137 130 (1.1407 0.74965 0.094095 0.091213 0.06078 0.01749)
127.05020 7.74 25 (3.5099)
244.09682 3.91 55 268 (1.7723 0.00011121)
257.09207 20.55 105 99 51 70 (6.2636 2.5807 0.33828 0.13533)
259.10772 5.97 52 71 (2.5319 0.17434)
285.08698 3.92 4 53 113 73 66 112 111 92 (1.2358 0.2255 0.10639 0.10598 0.09305 0.009663 0.0017502 0.00034959)
287.10263 100.00 3 54 103 97 35 109 83 67 86 107 79 74 85 93 94 96 363 (33.16 3.7652 2.9829 2.3622 0.96538 0.69602 0.53147 0.26732 0.15423 0.13075 0.12142 0.088745 0.07061 0.023718 0.010567 0.0067435 1.5915e-05)
373.13941 7.75 357 349 323 367 365 362 325 324 360 350 366 255 364 (2.7763 0.49804 0.12029 0.023264 0.022683 0.020017 0.018437 0.015525 0.0097356 0.0041868 0.003648 0.0011555 0.00024192)
403.14998 18.86 0 353 372 347 263 233 249 203 371 327 261 333 188 201 330 250 332 252 346 342 341 (7.4089 0.57306 0.11882 0.113 0.09708 0.07653 0.0533 0.037221 0.025004 0.013947 0.013263 0.0065377 0.0028141 0.0024516 0.0024338 0.0021301 0.0019327 0.0010391 0.00074327 0.0003502 0.00034605)
energy1
87.04406 2.03 117 139 (0.91758 0.13469)
89.03858 2.03 165 (1.053)
99.04406 3.40 133 124 125 (0.72957 0.66704 0.36327)
139.05020 3.64 15 213 (1.8717 0.014456)
141.06585 3.57 29 (1.8491)
159.04406 9.21 23 168 167 170 (4.5796 0.14618 0.029078 0.017786)
161.05971 100.00 5 161 166 155 158 164 (34.401 4.9169 4.2332 3.9219 2.2435 2.102)
176.07060 2.71 64 (1.4044)
257.09207 10.51 105 99 51 70 (3.9608 1.2816 0.15432 0.04889)
259.10772 4.92 52 71 (2.0504 0.50026)
269.09207 2.20 106 98 22 21 (0.5469 0.32962 0.18944 0.07302)
287.10263 11.32 3 103 97 54 35 74 67 109 79 83 86 107 85 93 363 94 96 (3.7961 0.64994 0.39011 0.28061 0.16597 0.1062 0.086973 0.08468 0.082431 0.068215 0.055248 0.048991 0.028851 0.0072632 0.0054246 0.0033106 0.0032507)
energy2
45.03349 14.19 120 (1.3241)
57.03349 12.27 135 (1.145)
77.03858 14.30 154 (1.3344)
89.03858 19.10 165 (1.7822)
99.04406 11.47 125 124 133 (0.5275 0.51136 0.031249)
117.05462 10.87 137 126 121 131 142 130 (0.52 0.18503 0.13675 0.080906 0.048536 0.043293)
125.03455 12.85 13 (1.1986)
137.03455 24.20 14 (2.2578)
139.05020 51.69 15 213 (4.8137 0.0096433)
141.06585 11.02 29 (1.0285)
161.05971 100.00 158 155 161 5 164 166 (2.1052 2.0958 2.0745 1.9347 0.76766 0.35271)
163.07536 12.35 12 152 156 162 159 (0.6728 0.26282 0.10535 0.058195 0.05314)
167.10666 10.07 148 (0.93922)
172.03930 14.87 270 (1.3876)
174.05495 31.62 65 (2.9501)
176.07060 41.50 64 (3.8721)
206.08117 12.40 45 (1.1571)
241.09715 31.33 101 (2.923)
242.08117 14.50 56 272 273 (1.2962 0.049128 0.0073855)
257.09207 19.01 51 99 105 70 (1.2189 0.26813 0.2359 0.050846)
259.10772 40.83 52 71 (2.3686 1.4408)
271.07133 13.36 34 110 95 (1.2194 0.019584 0.0078191)
285.08698 12.69 66 73 4 53 92 111 112 113 (0.71089 0.30068 0.069177 0.042893 0.026587 0.024035 0.0084724 0.0013459)
287.10263 66.27 54 35 3 74 67 86 103 97 94 107 79 83 109 363 93 85 96 (1.8721 1.4332 0.68357 0.57858 0.4226 0.21699 0.19317 0.17639 0.14317 0.089137 0.086654 0.086427 0.085989 0.060118 0.022924 0.017141 0.015413)
315.09755 13.34 340 240 241 239 (1.2085 0.025015 0.009584 0.0014469)
315.13393 11.70 193 225 192 (0.62706 0.37407 0.090733)
317.11320 55.47 202 339 (4.1692 1.0061)
317.14958 14.01 194 (1.307)
319.16523 14.01 195 (1.307)
371.12376 23.35 351 326 356 (1.339 0.5527 0.28726)

0 403.1499774961 Cc1cn(C2CC(O)C(C[OH2+])O2)c(=O)n(CC=Cc2ccc3c(c2)OCO3)c1=O
1 385.1394128121 C=C1OC(N2C=C(C)C(=[OH+])N(C#CC=C3CCC4OCOC4C3)C2=O)C=C1O
2 289.1182834441 CC1=C([OH2+])N(C#CC=C2CCC3OCOC3C2)C(=O)N=C1
3 287.1026333801 CC1=C([OH2+])N(C#CC=C2C=CC3OCOC3C2)C(=O)N=C1
4 285.0869833161 CC1=C([OH2+])N(C#CC=C2C=CC3=C(C2)OCO3)C(=O)N=C1
5 161.0597059481 [CH2+]#CC=C1C=CC2=C(C1)OCO2
6 239.1026333801 C=C1OC(N2C=C(C)C(=[OH+])N(C)C2O)=CC1O
7 385.1394128121 C=C1OC(N(C=O)C=C(C)C(=[OH+])N=C=C=C=C2CCC3OCOC3C2)C=C1O Intermediate Fragment 
8 385.1394128121 C=C1OC(N2C=C(C)C(=[OH+])N(C#CC=C3C=CC(OCO)CC3)C2=O)C=C1O Intermediate Fragment 
9 385.1394128121 C=C1OC(N2C=C(C)C(=[OH+])N(C#CC=C3C=CCC(OCO)C3)C2=O)C=C1O Intermediate Fragment 
10 293.1495835721 CC1=C([OH2+])N(C=CCC2CCC3OCOC3C2)C(=O)N=C1
11 169.1223062041 [CH3+]=CCC1CCC2OCOC2C1
12 163.0753560121 [CH2+]#CC=C1C=CC2OCOC2C1
13 125.0345538201 C=C1C=NC(O)=NC1=[OH+]
14 137.0345538201 C=C1C=NC(=O)N([CH2+])C1=O
15 139.0502038841 C=C1C=NC(=O)N(C)C1=[OH+]
16 147.1128041401 CC1CNC(O)N(C)C1[OH2+]
17 293.1495835721 CC(=C=N)C(=[OH+])N(C=O)C=CCC1CCC2OCOC2C1 Intermediate Fragment 
18 293.1495835721 CC(=C=NC=O)C(=[OH+])N=CCCC1CCC2OCOC2C1 Intermediate Fragment 
19 291.1339335081 CC1=C([OH2+])N(C#CCC2CCC3OCOC3C2)C(=O)N=C1
20 273.0869833161 O=C1N=CC=C([OH2+])N1C#CC=C1C=CC2OCOC2C1
21 269.0920686961 CC1=CN(C#CC=C2C=CC3=C(C2)OCO3)C(=[OH+])N=C1
22 269.0920686961 CC1=C(O)N(C#C[C+]=C2C=CC3=C(C2)OCO3)CN=C1
23 159.0440558841 [C+]#CC=C1C=CC2=C(C1)OCO2
24 123.0189037561 [CH+]=C1C=NC(O)=NC1=O
25 127.0502038841 CC1C=NC(O)=NC1=[OH+]
26 149.0597059481 [CH2+]#CC1=CC=C2OCOC2C1
27 147.0440558841 [CH2+]#CC1=CC=C2OCOC2=C1
28 145.0284058201 [C+]#CC1=CC=C2OCOC2=C1
29 141.0658539481 CC1C=NC(=O)N(C)C1=[OH+]
30 137.0597059481 [CH3+]=C1C=CC2=C(C1)OCO2
31 135.0440558841 [CH+]=C1C=CC2=C(C1)OCO2
32 163.0502038841 C=C1C=NC(=O)N(C#CC)C1=[OH+]
33 165.0658539481 CC#CN1C(=O)N=CC(C)C1=[OH+]
34 271.0713332521 O=C1N=CC=C([OH2+])N1C#CC=C1C=CC2=C(C1)OCO2
35 287.1026333801 CC(=C=N)C(=[OH+])N(C#CC=C1C=CC2OCOC2C1)C=O Intermediate Fragment 
36 270.0760842841 C=C(C)C(=O)[N+](=C=O)C#CC=C1C=CC2=C(C1)OCO2
37 260.0917343481 CC=C(O)[NH+](C#CC=C1C=CC2=C(C1)OCO2)C=O
38 258.0760842841 C=C=C(O)[NH+](C#CC=C1C=CC2=C(C1)OCO2)C=O
39 256.0604342201 C=C=C(O)[N+](=C=O)C#CC=C1C=CC2=C(C1)OCO2
40 236.0917343481 O=C[NH+](C#CC=C1CCC2OCOC2C1)C=O
41 234.0760842841 O=C[NH+](C#CC=C1C=CC2OCOC2C1)C=O
42 232.0604342201 O=C[NH+](C#CC=C1C=CC2=C(C1)OCO2)C=O
43 230.0447841561 O=C=[N+](C#CC=C1C=CC2=C(C1)OCO2)C=O
44 56.0494756121 CCC#[NH+]
45 206.0811696641 O=C=[NH+]C#CC=C1CCC2OCOC2C1
46 204.0655196001 O=C=[NH+]C#CC=C1C=CC2OCOC2C1
47 202.0498695361 O=C=[NH+]C#CC=C1C=CC2=C(C1)OCO2
48 200.0342194721 O=C=NC#C[C+]=C1C=CC2=C(C1)OCO2
49 82.0287401681 CC(=C=O)C#[NH+]
50 255.0764186321 CC(C#[NH+])=C(O)N=C=C=C=C1C=CC2=C(C1)OCO2
51 257.0920686961 CC(C#[NH+])=C(O)N=C=C=C=C1C=CC2OCOC2C1
52 259.1077187601 CC(C#[NH+])=C(O)N=C=C=C=C1CCC2OCOC2C1
53 285.0869833161 CC(C#[NH+])=C(O)N(C#CC=C1C=CC2=C(C1)OCO2)C=O
54 287.1026333801 CC(=C=NC=O)C(=[OH+])N=C=C=C=C1CCC2OCOC2C1 Intermediate Fragment 
55 244.0968197281 C=C(C)C(=O)[NH+]=C=C=C=C1C=CC2OCOC2C1
56 242.0811696641 C=C(C)C(=O)[NH+]=C=C=C=C1C=CC2=C(C1)OCO2
57 240.0655196001 [CH+]=C(C)C(=O)N=C=C=C=C1C=CC2=C(C1)OCO2
58 232.0968197281 CC=C(O)[NH+]=C=C=C=C1C=CC2OCOC2C1
59 230.0811696641 CC=C(O)[NH+]=C=C=C=C1C=CC2=C(C1)OCO2
60 228.0655196001 C=C=C(O)[NH+]=C=C=C=C1C=CC2=C(C1)OCO2
61 226.0498695361 [CH+]=C=C(O)N=C=C=C=C1C=CC2=C(C1)OCO2
62 208.0968197281 O=C=[NH+]C#CCC1CCC2OCOC2C1
63 178.0862550441 [NH+]#CC#CC1CCC2OCOC2C1
64 176.0706049801 [NH+]#CC#CC1=CCC2OCOC2C1
65 174.0549549161 [NH+]#CC#CC1=CC=C2OCOC2C1
66 285.0869833161 CC(=C=[NH+]C=O)C(=O)N=C=C=C=C1C=CC2OCOC2C1
67 287.1026333801 CC(=C=NC(O)=NC#CC=C1C=CC2OCOC2C1)C=[OH+] Intermediate Fragment 
68 71.0491412641 C=C(C)C=[OH+]
69 255.0764186321 C=C=C=[NH+]C(O)=NC#CC=C1C=CC2=C(C1)OCO2
70 257.0920686961 CC=C=[NH+]C(O)=NC#CC=C1C=CC2=C(C1)OCO2
71 259.1077187601 CC=C=[NH+]C(O)=NC#CC=C1C=CC2OCOC2C1
72 84.0443902321 CC(C#[NH+])=CO
73 285.0869833161 CC(=C=[NH+]C(O)=NC#CC=C1C=CC2=C(C1)OCO2)C=O
74 287.1026333801 CC=C=NC(=O)N(C#CC=C1C=CC2OCOC2C1)C=[OH+] Intermediate Fragment 
75 247.0713332521 [NH3+]C(=O)N(C#CC=C1C=CC2=C(C1)OCO2)C=O
76 257.0556831881 C#[N+]C(=O)N(C#CC=C1C=CC2=C(C1)OCO2)C=O
77 259.0713332521 C=[NH+]C(=O)N(C#CC=C1C=CC2=C(C1)OCO2)C=O
78 261.0869833161 C=[NH+]C(=O)N(C#CC=C1C=CC2OCOC2C1)C=O
79 287.1026333801 C=NC(=O)N(C#CC=C1C=CC2=C(C1)OCO2)C([OH2+])=CC Intermediate Fragment 
80 233.0920686961 C=[NH+]C(=O)N=C=C=C=C1CCC2OCOC2C1
81 231.0764186321 C=[NH+]C(=O)N=C=C=C=C1C=CC2OCOC2C1
82 229.0607685681 C=[NH+]C(=O)N=C=C=C=C1C=CC2=C(C1)OCO2
83 287.1026333801 C=C(C)C(=[OH+])N(C#CC=C1C=CC2=C(C1)OCO2)C(N)=O Intermediate Fragment 
84 219.0764186321 [NH3+]C(=O)N=C=C=CC1C=CC2=C(C1)OCO2
85 287.1026333801 C=C1OCOC1=CC(C)=CC#CN1C(=O)N=CC(C)=C1[OH2+] Intermediate Fragment 
86 287.1026333801 C=CC(=CC#CN1C(=O)N=CC(C)=C1[OH2+])CC1=COCO1 Intermediate Fragment 
87 257.0556831881 CC1=C(O)N(C#CC#C[CH+]C2=COCO2)C(=O)N=C1
88 215.0815040121 C#CC(C)=CC#CN1C(=O)N=CC(C)=C1[OH2+]
89 213.0658539481 C#CC(C)=[C+]C#CN1C(=O)N=CC(C)=C1O
90 201.0658539481 C=CC#CC#CN1C(=O)N=CC(C)=C1[OH2+]
91 199.0502038841 C#CC#CC#CN1C(=O)N=CC(C)=C1[OH2+]
92 285.0869833161 C#CC(=CC#CN1C(=O)N=CC(C)=C1[OH2+])CC1=COCO1
93 287.1026333801 CC(C=C=C1COCO1)=CC#CN1C(=O)N=CC(C)=C1[OH2+] Intermediate Fragment 
94 287.1026333801 CC1=C([OH2+])N(C#CC#CC=CC2OCOC2C)C(=O)N=C1 Intermediate Fragment 
95 271.0713332521 CC1=C([OH2+])N(C#CC#CC#CC2COCO2)C(=O)N=C1
96 287.1026333801 C=CC1OCOC1CC#CC#CN1C(=O)N=CC(C)=C1[OH2+] Intermediate Fragment 
97 287.1026333801 CC1=C([OH2+])N(C#CC=C2C=CC(OCO)=CC2)C(=O)N=C1 Intermediate Fragment 
98 269.0920686961 C=[O+]C1=CCC(=CC#CN2C(=O)N=CC(C)=C2O)C=C1
99 257.0920686961 CC1=C([OH2+])N(C#CC=C2C=CC(O)=CC2)C(=O)N=C1
100 243.1128041401 CC1=C([OH2+])N(C#CC=C2C=CCCC2)C(=O)N=C1
101 241.0971540761 CC1=C([OH2+])N(C#CC=C2C=CC=CC2)C(=O)N=C1
102 239.0815040121 CC1=C(O)N(C#C[C+]=C2C=CC=CC2)C(=O)N=C1
103 287.1026333801 CC1=C([OH2+])N(C#CC=C2C=CC=C(OCO)C2)C(=O)N=C1 Intermediate Fragment 
104 255.0764186321 CC1=C(O)N(C#C[C+]=C2C=CC=C(O)C2)C(=O)N=C1
105 257.0920686961 CC1=C([OH2+])N(C#CC=C2C=CC=C(O)C2)C(=O)N=C1
106 269.0920686961 C=[O+]C1=CC=CC(=CC#CN2C(=O)N=CC(C)=C2O)C1
107 287.1026333801 COC1=C(O)C=CC(=CC#CN2C(=O)N=CC(C)=C2[OH2+])C1 Intermediate Fragment 
108 255.0764186321 CC1=C(O)N(C#C[C+]=C2C=CC(O)=CC2)C(=O)N=C1
109 287.1026333801 COC1=C(O)CC(=CC#CN2C(=O)N=CC(C)=C2[OH2+])C=C1 Intermediate Fragment 
110 271.0713332521 CC1=C(O)N(C#C[C+]=C2C=CC(O)=C(O)C2)C(=O)N=C1
111 285.0869833161 C=[O+]C1=C(O)CC(=CC#CN2C(=O)N=CC(C)=C2O)C=C1
112 285.0869833161 CC=C=NC(=O)N(C#CC=C1C=CC2=C(C1)OCO2)C=[OH+] Intermediate Fragment 
113 285.0869833161 CC1=C([OH2+])N(C#CC=C2C=CC=C(OC=O)C2)C(=O)N=C1 Intermediate Fragment 
114 111.0076703761 O=C1C=COC1=C=[OH+]
115 113.0233204401 OC1C=COC1=C=[OH+]
116 115.0389705041 OC1C=COC1=C[OH2+]
117 87.0440558841 [OH2+]C1C=COC1
118 115.0389705041 C=C=C(O)C(=O)C[OH2+] Intermediate Fragment 
119 115.0389705041 O=C=C=C(O)CC[OH2+] Intermediate Fragment 
120 45.0334912001 C=C[OH2+]
121 117.0546205681 OC1C=COC1C[OH2+]
122 85.0284058201 [OH+]=C1C=COC1
123 89.0597059481 [OH2+]C1CCOC1
124 99.0440558841 C=C1OCC=C1[OH2+]
125 99.0440558841 [OH2+]C=C1C=CCO1
126 117.0546205681 C=COC(=C[OH2+])CO Intermediate Fragment 
127 91.0389705041 OCC(=[OH+])CO
128 75.0440558841 OCC=C[OH2+]
129 73.0284058201 OCC#C[OH2+]
130 117.0546205681 C=C(O)C(=C[OH2+])OC Intermediate Fragment 
131 117.0546205681 C=C=C(O)C(O)C[OH2+] Intermediate Fragment 
132 29.0385765801 C=[CH3+]
133 99.0440558841 C=C=C(O)C=C[OH2+]
134 59.0491412641 CC=C[OH2+]
135 57.0334912001 CC#C[OH2+]
136 61.0284058201 OCC=[OH+]
137 117.0546205681 OC=C=C(O)CC[OH2+] Intermediate Fragment 
138 43.0178411361 C#C[OH2+]
139 87.0440558841 C=C(O)C=C[OH2+]
140 89.0597059481 C=C(O)CC[OH2+]
141 47.0491412641 CC[OH2+]
142 117.0546205681 OC=C=COCC[OH2+] Intermediate Fragment 
143 119.0702706321 OC1CCOC1C[OH2+]
144 101.0597059481 CC1OCC=C1[OH2+]
145 101.0597059481 [OH2+]CC1C=CCO1
146 119.0702706321 OCC=C(O)CC[OH2+] Intermediate Fragment 
147 101.0597059481 C=C=C(O)CC[OH2+]
148 167.1066561401 [CH2+]#CCC1CCC2OCOC2C1
149 165.0910060761 [CH2+]#CC=C1CCC2OCOC2C1
150 165.0910060761 C=CC(=CC#[CH2+])CC1COCO1 Intermediate Fragment 
151 93.0698767081 C=CC(C)=CC#[CH2+]
152 163.0753560121 [CH2+]#CC#CC=CC1OCOC1C Intermediate Fragment 
153 75.0229265161 C#CC#CC#[CH2+]
154 77.0385765801 C=CC#CC#[CH2+]
155 161.0597059481 [CH2+]#CC#CC#CC1OCOC1C
156 163.0753560121 C=CC(=CC#[CH2+])CC1=COCO1 Intermediate Fragment 
157 91.0542266441 C#CC(C)=CC#[CH2+]
158 161.0597059481 C#CC(=CC#[CH2+])CC1=COCO1
159 163.0753560121 [CH2+]#CC=C1C=CC(OCO)=CC1 Intermediate Fragment 
160 133.0647913281 C#CC=C1C=CC([OH2+])=CC1
161 161.0597059481 C#CC=C1C=CC(OC=[OH+])=CC1
162 163.0753560121 [CH2+]#CC=C1C=CC=C(OCO)C1 Intermediate Fragment 
163 133.0647913281 C#CC=C1C=CC=C([OH2+])C1
164 161.0597059481 C#CC=C1C=CC=C([OH+]C=O)C1
165 89.0385765801 [C+]#CC=C(C)C#C
166 161.0597059481 [C+]#CC=C1C=CC(O)=C(OC)C1 Intermediate Fragment 
167 159.0440558841 C=C1OCOC1=C=CC#CC#[CH2+] Intermediate Fragment 
168 159.0440558841 [C+]#CC=C1C=CC(OC=O)=CC1 Intermediate Fragment 
169 115.0542266441 [C+]#CC=C1C=CC=CC1
170 159.0440558841 [C+]#CC=C1C=CC(=O)C(OC)=C1 Intermediate Fragment 
171 243.0975480001 CC1CN(C2C=C(O)C(=C=[OH+])O2)C(O)NC1O
172 243.0975480001 CC1CN(C(O)=C=C(O)C#C[OH2+])C(O)NC1O Intermediate Fragment 
173 153.0910060761 [CH2+]#CC1CCC2OCOC2C1
174 151.0753560121 [CH2+]#CC1=CCC2OCOC2C1
175 249.0505978081 [CH2+]N1C(=O)C(C)=CN(C2C=C(O)C(=C=O)O2)C1=O
176 253.0818979361 CC1=CN(C2C=C(O)C(=C=[OH+])O2)C(O)N(C)C1=O
177 255.0975480001 CC1=CN(C2C=C(O)C(=C=[OH+])O2)C(O)N(C)C1O
178 255.0975480001 CC1=CN(C=C=C(O)C(=O)C=[OH+])C(O)N(C)C1O Intermediate Fragment 
179 257.1131980641 CC1CN(C2C=C(O)C(=C=[OH+])O2)C(O)N(C)C1O
180 257.1131980641 CC1CN(C(O)=C=C(O)C#C[OH2+])C(O)N(C)C1O Intermediate Fragment 
181 183.0764186321 C=C([OH2+])N1C=C(C)C(=O)N(C)C1=O
182 135.0440558841 [CH+]=C1C=CC=C(OC=O)C1 Intermediate Fragment 
183 135.0440558841 [CH+]=C1C=CC(=O)C(OC)=C1 Intermediate Fragment 
184 385.1394128121 CC1=CN(C2C=CC(=C=[OH+])O2)C(=O)N(C#CCC2CCC3OCOC3C2)C1=O
185 239.1026333801 CC1=CN(C2C=CC(=C=[OH+])O2)C(O)N(C)C1O
186 385.1394128121 CC(=CN=C1C=CC(=C=[OH+])O1)C(=O)N(C#CCC1CCC2OCOC2C1)C=O Intermediate Fragment 
187 385.1394128121 CC1=CN(C2C=CC(=C=[OH+])O2)C(=O)N(C#CC=C2CCC(OCO)CC2)C1=O Intermediate Fragment 
188 403.1499774961 C=C(OC(=C=[OH+])CO)N1C=C(C)C(=O)N(C#CCC2CCC3OCOC3C2)C1=O Intermediate Fragment 
189 311.1026333801 C#CN1C=C(C)C(=[OH+])N(C#CC=C2C=CC3OCOC3C2)C1=O
190 313.1182834441 C#CN1C=C(C)C(=[OH+])N(C#CC=C2CCC3OCOC3C2)C1=O
191 313.1182834441 C#CN(C=O)C=C(C)C(=[OH+])N=C=C=C=C1CCC2OCOC2C1 Intermediate Fragment 
192 315.1339335081 C#CN1C=C(C)C(=[OH+])N(C#CCC2CCC3OCOC3C2)C1=O
193 315.1339335081 C#CN(C=O)C=C(C)C(=[OH+])N=C=C=CC1CCC2OCOC2C1 Intermediate Fragment 
194 317.1495835721 C#CN1C=C(C)C(=[OH+])N(C=CCC2CCC3OCOC3C2)C1=O
195 319.1652336361 C#CN1C=C(C)C(=[OH+])N(CCCC2CCC3OCOC3C2)C1=O
196 329.1131980641 C=C([OH2+])N1C=C(C)C(=O)N(C#CC=C2C=CC3OCOC3C2)C1=O
197 329.1131980641 C=C([OH2+])N(C=O)C=C(C)C(=O)N=C=C=C=C1C=CC2OCOC2C1 Intermediate Fragment 
198 301.1182834441 C=C(O)[NH+]=C=C(C)C(=O)N=C=C=C=C1CCC2OCOC2C1
199 331.1288481281 C=C([OH2+])N1C=C(C)C(=O)N(C#CC=C2CCC3OCOC3C2)C1=O
200 331.1288481281 C=C([OH2+])N(C=O)C=C(C)C(=O)N=C=C=C=C1CCC2OCOC2C1 Intermediate Fragment 
201 403.1499774961 C=C(O)C(=C=[OH+])OCN1C=C(C)C(=O)N(C#CCC2CCC3OCOC3C2)C1=O Intermediate Fragment 
202 317.1131980641 CC1=CN(C=[OH+])C(=O)N(C#CC=C2CCC3OCOC3C2)C1=O
203 403.1499774961 CC1=CN(C=C=C(O)C(=O)C=[OH+])C(=O)N(C=CCC2CCC3OCOC3C2)C1=O Intermediate Fragment 
204 84.9920203121 O=CC(=O)C#[O+]
205 87.0076703761 O=CC(=[OH+])C=O
206 89.0233204401 O=CC(=[OH+])CO
207 71.0127557561 CC(=O)C#[O+]
208 73.0284058201 CC(=[OH+])C=O
209 93.0546205681 OCC([OH2+])CO
210 75.0440558841 CC(=[OH+])CO
211 301.1182834441 CC1=CN(C)C(=O)N(C#CC=C2C=CC3OCOC3C2)C1=[OH+]
212 299.1026333801 CC1=CN(C)C(=O)N(C#CC=C2C=CC3=C(C2)OCO3)C1=[OH+]
213 139.0502038841 [CH2+]N1C=C(C)C(=O)N=C1O
214 299.1026333801 CC(=CN(C)C=O)C(=[OH+])N=C=C=C=C1C=CC2=C(C1)OCO2 Intermediate Fragment 
215 271.1077187601 C=[NH+]C=C(C)C(=O)N=C=C=C=C1C=CC2OCOC2C1
216 297.0869833161 [CH2+]N1C=C(C)C(=O)N(C#CC=C2C=CC3=C(C2)OCO3)C1=O
217 385.1394128121 CC1=CN(C=C=C(O)C#C[OH2+])C(=O)N(C#CCC2CCC3OCOC3C2)C1=O
218 367.1288481281 CC1=CN(CC#CC#C[OH2+])C(=O)N(C#CC=C2CCC3OCOC3C2)C1=O
219 343.1288481281 CC1=CN(CC#CO)C(=O)N(C#CC=C2CCC3OCOC3C2)C1=[OH+]
220 385.1394128121 CC1=CN(C=C=C(O)C#C[OH2+])C(=O)N(C#CC=C2CCC(OCO)CC2)C1=O Intermediate Fragment 
221 347.1601482561 CC1=CN(CC#CO)C(=O)N(C=CCC2CCC3OCOC3C2)C1=[OH+]
222 345.1444981921 CC1=CN(CC#CO)C(=O)N(C#CCC2CCC3OCOC3C2)C1=[OH+]
223 325.1182834441 C#CCN1C=C(C)C(=[OH+])N(C#CC=C2C=CC3OCOC3C2)C1=O
224 343.1288481281 CC(=CN=CC#CO)C(=[OH+])N(C#CC=C1CCC2OCOC2C1)C=O Intermediate Fragment 
225 315.1339335081 CC(=C[NH+]=CC#CO)C(=O)N=C=C=CC1CCC2OCOC2C1
226 343.1288481281 CC(=CN(C=O)CC#CO)C(=[OH+])N=C=C=C=C1CCC2OCOC2C1 Intermediate Fragment 
227 343.1288481281 CC1=CN(CC#CO)C(=O)N(C#CC#CCCC2OCOC2C)C1=[OH+] Intermediate Fragment 
228 343.1288481281 CC1=CN(CC#CO)C(=O)N(C#CC=C2C=CCC(OCO)C2)C1=[OH+] Intermediate Fragment 
229 313.1182834441 CC1=CN(CC#CO)C(=O)N(C#CC=C2C=CCC(O)C2)C1=[OH+]
230 341.1131980641 CC1=CN(CC#CO)C(=O)N(C#CC=C2C=CC3OCOC3C2)C1=[OH+]
231 59.0127557561 O=C=C[OH2+]
232 63.0440558841 OCC[OH2+]
233 403.1499774961 CC1=CN(C(O)=C=C(O)C#C[OH2+])C(=O)N(C=CCC2CCC3OCOC3C2)C1=O Intermediate Fragment 
234 335.1601482561 C=C([OH2+])N1C=C(C)C(=O)N(C=CCC2CCC3OCOC3C2)C1=O
235 333.1444981921 C=C([OH2+])N1C=C(C)C(=O)N(C#CCC2CCC3OCOC3C2)C1=O
236 327.0975480001 C=C([OH2+])N1C=C(C)C(=O)N(C#CC=C2C=CC3=C(C2)OCO3)C1=O
237 77.0597059481 OCCC[OH2+]
238 319.1288481281 CC1=CN(C=[OH+])C(=O)N(C#CCC2CCC3OCOC3C2)C1=O
239 315.0975480001 CC1=CN(C=[OH+])C(=O)N(C#CC=C2C=CC3OCOC3C2)C1=O
240 315.0975480001 CC(=CN(C=O)C=[OH+])C(=O)N=C=C=C=C1C=CC2OCOC2C1 Intermediate Fragment 
241 315.0975480001 CC=CN(C=[OH+])C(=O)N(C#CC=C1C=CC2=C(C1)OCO2)C=O Intermediate Fragment 
242 313.0818979361 CC1=CN(C=[OH+])C(=O)N(C#CC=C2C=CC3=C(C2)OCO3)C1=O
243 71.0491412641 C=CC(=C)[OH2+]
244 71.0491412641 C#CCC[OH2+]
245 361.1394128121 CC1=CN(C(=[OH+])C#CO)C(=O)N(C=CCC2CCC3OCOC3C2)C1=O
246 359.1237627481 CC1=CN(C(=[OH+])C#CO)C(=O)N(C#CCC2CCC3OCOC3C2)C1=O
247 359.1237627481 CC(=CN(C=O)C(=[OH+])C#CO)C(=O)N=C=C=CC1CCC2OCOC2C1 Intermediate Fragment 
248 357.1081126841 CC1=CN(C(=[OH+])C#CO)C(=O)N(C#CC=C2CCC3OCOC3C2)C1=O
249 403.1499774961 CC1=CN(C(=C=CO)OC#C[OH2+])C(=O)N(C=CCC2CCC3OCOC3C2)C1=O Intermediate Fragment 
250 403.1499774961 CC=C(O)N(C#CC=C1CCC2OCOC2C1)C(=O)N(C)C1C=C(O)C(=C=[OH+])O1 Intermediate Fragment 
251 349.1394128121 C[NH+](C(O)=NC#CCC1CCC2OCOC2C1)C1C=C(O)C(=C=O)O1
252 403.1499774961 CC=CN(C(=O)N(C#CCC1CCC2OCOC2C1)C=O)C1C=C(O)C(=C=[OH+])O1 Intermediate Fragment 
253 363.1186773681 O=C=C1OC(=[NH+]C(=O)N(C=O)C=CCC2CCC3OCOC3C2)C=C1O
254 375.1550628761 CC#C[NH+](C(O)=NC=CCC1CCC2OCOC2C1)C1C=C(O)C(=C=O)O1
255 373.1394128121 CC#C[NH+](C(O)=NC#CCC1CCC2OCOC2C1)C1C=C(O)C(=C=O)O1
256 172.0968197281 CCC[NH2+]C1C=C(O)C(=CO)O1
257 142.0498695361 C[NH2+]C1C=C(O)C(=C=O)O1
258 144.0655196001 C[NH2+]C1C=C(O)C(=CO)O1
259 172.0968197281 CCC[NH2+]C(O)=C=C(O)C=CO Intermediate Fragment 
260 168.0655196001 CCC[NH+]=C1C=C(O)C(=C=O)O1
261 403.1499774961 CC(C=O)=CN(C(O)=NC#CCC1CCC2OCOC2C1)C1C=C(O)C(=C=[OH+])O1 Intermediate Fragment 
262 200.0917343481 CC(CO)C[NH2+]C1C=C(O)C(=C=O)O1
263 403.1499774961 CC(=CN(C=O)C1C=C(O)C(=C=[OH+])O1)C(=O)N=C=CCC1CCC2OCOC2C1 Intermediate Fragment 
264 250.1437699201 C=C(C)C(=O)[NH+]=C=CCC1CCC2OCOC2C1
265 248.1281198561 C=C(C)C(=O)[NH+]=C=C=CC1CCC2OCOC2C1
266 246.1124697921 C=C(C)C(=O)[NH+]=C=C=C=C1CCC2OCOC2C1
267 228.1019051081 C=C(C)C=[NH+]C#CC=C1C=CC2=C(C1)OCO2
268 244.0968197281 C=C(C)C(=O)[NH+]=C=C=C=C=C=CC1OCOC1C Intermediate Fragment 
269 158.0600402961 C=C=C=C=C=C=[NH+]C(=O)C(=C)C
270 172.0393048521 [NH+]#CC#CC1=CC=C2OCOC2=C1
271 96.0443902321 C#[N+]C(=O)C(=C)C
272 242.0811696641 C=C(C)C(=O)[NH+]=C=C=C=C1C=CC(OC=O)=CC1 Intermediate Fragment 
273 242.0811696641 C=C(C)C(=O)[NH+]=C=C=C=C1C=CC=C(OC=O)C1 Intermediate Fragment 
274 196.0756903601 [CH+]=C(C)C(=O)N=C=C=C=C1C=CC=CC1
275 214.0862550441 C=C(C)C(=O)[NH+]=C=C=C=C1C=CC=C(O)C1
276 160.0604342201 OC=C1OC([NH2+]CO)C=C1O
277 132.0655196001 [NH3+]C1C=C(O)C(CO)O1
278 130.0498695361 [NH3+]C1C=C(O)C(=CO)O1
279 128.0342194721 [NH3+]C1C=C(O)C(=C=O)O1
280 160.0604342201 C=C(O)C(=C=O)OC[NH2+]CO Intermediate Fragment 
281 160.0604342201 O=C(CO)C(O)=C=C[NH2+]CO Intermediate Fragment 
282 160.0604342201 OC=CC(O)=C=C(O)[NH2+]CO Intermediate Fragment 
283 236.1281198561 CC=C(O)[NH+]=C=C=CC1CCC2OCOC2C1
284 234.1124697921 CC=C(O)[NH+]=C=C=C=C1CCC2OCOC2C1
285 196.0604342201 CC#C[NH+](CO)C1C=C(O)C(=C=O)O1
286 198.0760842841 CC=C[NH+](CO)C1C=C(O)C(=C=O)O1
287 200.0917343481 CCC[NH+](CO)C1C=C(O)C(=C=O)O1
288 84.0443902321 CC=C=[NH+]C=O
289 174.0760842841 C[NH+](CO)C1C=C(O)C(=CO)O1
290 200.0917343481 CCC[NH+](C=C=C(O)C(=O)C=O)CO Intermediate Fragment 
291 200.0917343481 CCC[NH+](CO)C(O)=C=C(O)C#CO Intermediate Fragment 
292 202.1073844121 CCC[NH+](CO)C1C=C(O)C(=CO)O1
293 202.1073844121 CCC[NH+](CO)C(O)=C=C(O)C=CO Intermediate Fragment 
294 226.0709989041 CC(C=O)=C[NH+](CO)C1C=C(O)C(=C=O)O1
295 228.0866489681 CC(=C[NH+](CO)C1C=C(O)C(=C=O)O1)CO
296 230.1022990321 CC(CO)C[NH+](CO)C1C=C(O)C(=C=O)O1
297 202.1073844121 CC(CO)C[NH2+]C1C=C(O)C(=CO)O1
298 232.1179490961 CC(CO)C[NH+](CO)C1C=C(O)C(=CO)O1
299 375.1550628761 CC(=C[NH+]=C1C=C(O)C(=C=O)O1)C(=O)N=CCCC1CCC2OCOC2C1
300 345.1444981921 CC(=C[NH+]=C1C=C(O)CO1)C(=O)N=C=C=CC1CCC2OCOC2C1
301 357.1444981921 C=C1OC(=[NH+]C=C(C)C(=O)N=C=C=CC2CCC3OCOC3C2)C=C1O
302 265.1546689521 CC(C#[NH+])=C(O)N=CCCC1CCC2OCOC2C1
303 263.1390188881 CC(C#[NH+])=C(O)N=C=CCC1CCC2OCOC2C1
304 261.1233688241 CC(C#[NH+])=C(O)N=C=C=CC1CCC2OCOC2C1
305 170.0811696641 CCC[NH2+]C1C=C(O)C(=C=O)O1
306 198.0760842841 CC(CO)C[NH+]=C1C=C(O)C(=C=O)O1
307 227.1026333801 CNC(O)C(C)C[NH+]=C1C=C(O)C(=C=O)O1
308 357.1444981921 CC(=C[NH+]=C1C=CC(=C=O)O1)C(=O)N=C=CCC1CCC2OCOC2C1
309 375.1550628761 C=C([NH+]=C=C(C)C(=O)N=C=CCC1CCC2OCOC2C1)OC(=C=O)CO Intermediate Fragment 
310 285.1233688241 C#C[NH+]=C=C(C)C(=O)N=C=C=CC1CCC2OCOC2C1
311 303.1339335081 C=C(O)[NH+]=C=C(C)C(=O)N=C=C=CC1CCC2OCOC2C1
312 375.1550628761 C=C(O)C(=C=O)OC=[NH+]C=C(C)C(=O)N=C=CCC1CCC2OCOC2C1 Intermediate Fragment 
313 289.1182834441 CC(=C[NH+]=C=O)C(=O)N=C=C=CC1CCC2OCOC2C1
314 375.1550628761 CC(=C[NH+]=C=C=C(O)C(=O)C=O)C(=O)N=CCCC1CCC2OCOC2C1 Intermediate Fragment 
315 357.1444981921 CC(=C[NH+]=C=C=C(O)C#CO)C(=O)N=C=CCC1CCC2OCOC2C1
316 375.1550628761 CC(=C=[NH+]C(O)=C=C(O)C#CO)C(=O)N=CCCC1CCC2OCOC2C1 Intermediate Fragment 
317 331.1288481281 CC(=C=[NH+]C(=O)C#CO)C(=O)N=C=CCC1CCC2OCOC2C1
318 375.1550628761 CC(=C=[NH+]C(=C=CO)OC#CO)C(=O)N=CCCC1CCC2OCOC2C1 Intermediate Fragment 
319 375.1550628761 CC(=C[NH+]=C1C=C(O)C(=C=O)O1)C(=O)N=C=CCCCCC1OCOC1C Intermediate Fragment 
320 375.1550628761 CC(=C[NH+]=C1C=C(O)C(=C=O)O1)C(=O)N=C=CCC1CCCC(OCO)C1 Intermediate Fragment 
321 327.1339335081 CC(=C[NH+]=C1C=C(O)C(=C=O)O1)C(=O)N=C=C=CC1CCCCC1
322 345.1444981921 CC(=C[NH+]=C1C=C(O)C(=C=O)O1)C(=O)N=C=CCC1CCCC(O)C1
323 373.1394128121 CC(=C[NH+]=C1C=C(O)C(=C=O)O1)C(=O)N=C=CCC1CCC2OCOC2C1
324 373.1394128121 CC(=C[NH+]=C=C=C(O)C(=O)C=O)C(=O)N=C=CCC1CCC2OCOC2C1 Intermediate Fragment 
325 373.1394128121 CC(=C=[NH+]C(=C=CO)OC#CO)C(=O)N=C=CCC1CCC2OCOC2C1 Intermediate Fragment 
326 371.1237627481 CC(=C[NH+]=C1C=C(O)C(=C=O)O1)C(=O)N=C=C=CC1CCC2OCOC2C1
327 403.1499774961 CC(=CN=C1C=C(O)C(=C=[OH+])O1)C(=O)N(C=O)C=CCC1CCC2OCOC2C1 Intermediate Fragment 
328 274.1073844121 C=C(C)C(=O)[NH+](C#CC=C1C=CC2OCOC2C1)C=O
329 272.0917343481 C=C(C)C(=O)[NH+](C#CC=C1C=CC2=C(C1)OCO2)C=O
330 403.1499774961 C=C(C)C(=O)N(C=CCC1CCC2OCOC2C1)C(=O)N=C1C=C(O)C(=C=[OH+])O1 Intermediate Fragment 
331 335.1237627481 O=C=C1OC(=[NH+]C(O)=NC=CCC2CCC3OCOC3C2)C=C1O
332 403.1499774961 CC1=CN(C2C=C(O)C(=C=[OH+])O2)C(=O)N(C#CCC(C)CC2OCOC2C)C1=O Intermediate Fragment 
333 403.1499774961 CCC(CC#CN1C(=O)C(C)=CN(C2C=C(O)C(=C=[OH+])O2)C1=O)CC1COCO1 Intermediate Fragment 
334 373.1030273041 CC1=CN(C2C=C(O)C(=C=[OH+])O2)C(=O)N(C#CC=CCC2COCO2)C1=O
335 377.1343274321 CC1=CN(C2C=C(O)C(=C=[OH+])O2)C(=O)N(C=CCCCC2COCO2)C1=O
336 261.0869833161 CC1=C([OH2+])N(C#CC#CCC2COCO2)C(=O)N=C1
337 331.1288481281 CCC(C)CC#CN1C(=O)C(C)=CN(C2C=C(O)C(=C=[OH+])O2)C1=O
338 329.1131980641 CCC(C)=CC#CN1C(=O)C(C)=CN(C2C=C(O)C(=C=[OH+])O2)C1=O
339 317.1131980641 CCCCC#CN1C(=O)C(C)=CN(C2C=C(O)C(=C=[OH+])O2)C1=O
340 315.0975480001 CCC=CC#CN1C(=O)C(C)=CN(C2C=C(O)C(=C=[OH+])O2)C1=O
341 403.1499774961 CC1=CN(C2C=C(O)C(=C=[OH+])O2)C(=O)N(C#CCC(C)CCC2COCO2)C1=O Intermediate Fragment 
342 403.1499774961 CC1=CN(C2C=C(O)C(=C=[OH+])O2)C(=O)N(C#CCCCCC2OCOC2C)C1=O Intermediate Fragment 
343 303.0975480001 CCCC#CN1C(=O)C(C)=CN(C2C=C(O)C(=C=[OH+])O2)C1=O
344 305.1131980641 CCCC=CN1C(=O)C(C)=CN(C2C=C(O)C(=C=[OH+])O2)C1=O
345 387.1186773681 CC1=CN(C2C=C(O)C(=C=[OH+])O2)C(=O)N(C#CC=CCCC2COCO2)C1=O
346 403.1499774961 CCC1OCOC1CCCC#CN1C(=O)C(C)=CN(C2C=C(O)C(=C=[OH+])O2)C1=O Intermediate Fragment 
347 403.1499774961 CC1=CN(C2C=C(O)C(=C=[OH+])O2)C(=O)N(C#CCC2CCC(OCO)CC2)C1=O Intermediate Fragment 
348 385.1394128121 COC1CCC(=CC#CN2C(=O)C(C)=CN(C3C=C(O)C(=C=[OH+])O3)C2=O)CC1
349 373.1394128121 CC1=CN(C2C=C(O)C(=C=[OH+])O2)C(=O)N(C#CCC2CCC(O)CC2)C1=O
350 373.1394128121 CC(=CN(C=O)C1C=C(O)C(=C=[OH+])O1)C(=O)N=C=C=CC1CCC(O)CC1 Intermediate Fragment 
351 371.1237627481 CC1=CN(C2C=C(O)C(=C=[OH+])O2)C(=O)N(C#CC=C2CCC(O)CC2)C1=O
352 355.1288481281 CC1=CN(C2C=C(O)C(=C=[OH+])O2)C(=O)N(C#CC=C2CCCCC2)C1=O
353 403.1499774961 CC1=CN(C2C=C(O)C(=C=[OH+])O2)C(=O)N(C#CCC2CCCC(OCO)C2)C1=O Intermediate Fragment 
354 357.1444981921 CC1=CN(C2C=C(O)C(=C=[OH+])O2)C(=O)N(C#CCC2CCCCC2)C1=O
355 359.1601482561 CC1=CN(C2C=C(O)C(=C=[OH+])O2)C(=O)N(C=CCC2CCCCC2)C1=O
356 371.1237627481 CC1=CN(C2C=C(O)C(=C=[OH+])O2)C(=O)N(C#CC=C2CCCC(O)C2)C1=O
357 373.1394128121 CC1=CN(C2C=C(O)C(=C=[OH+])O2)C(=O)N(C#CCC2CCCC(O)C2)C1=O
358 355.1288481281 C=C1OC(N2C=C(C)C(=[OH+])N(C#CC=C3C=CCC(O)C3)C2=O)C=C1O
359 263.1390188881 CC1=C([OH2+])N(C#CCC2CCCC(O)C2)C(=O)N=C1
360 373.1394128121 CC1=CN(C=C=C(O)C(=O)C=[OH+])C(=O)N(C#CCC2CCCC(O)C2)C1=O Intermediate Fragment 
361 285.1233688241 C#CN1C=C(C)C(=[OH+])N(C#CC=C2CCCC(O)C2)C1=O
362 373.1394128121 CC1=CN(C(O)=C=C(O)C#C[OH2+])C(=O)N(C#CCC2CCCC(O)C2)C1=O Intermediate Fragment 
363 287.1026333801 CC1=CN(C=[OH+])C(=O)N(C#CC=C2C=CCC(O)C2)C1=O
364 373.1394128121 CC=CN(C(=O)N(C#CC=C1CCCC(O)C1)C=O)C1C=C(O)C(=C=[OH+])O1 Intermediate Fragment 
365 373.1394128121 CC(=CN(C=O)C1C=C(O)C(=C=[OH+])O1)C(=O)N=C=C=CC1CCCC(O)C1 Intermediate Fragment 
366 373.1394128121 CC(=CN=C1C=C(O)C(=C=[OH+])O1)C(=O)N(C#CCC1CCCC(O)C1)C=O Intermediate Fragment 
367 373.1394128121 CCCC(=CC#CN1C(=O)C(C)=CN(C2C=C(O)C(=C=[OH+])O2)C1=O)CCO Intermediate Fragment 
368 375.1550628761 CC1=CN(C2C=C(O)C(=C=[OH+])O2)C(=O)N(C=CCC2CCCC(O)C2)C1=O
369 385.1394128121 COC1CCCC(=CC#CN2C(=O)C(C)=CN(C3C=C(O)C(=C=[OH+])O3)C2=O)C1
370 271.1077187601 COC1=CC=CC(=CC#CN2C(=O)N=CC(C)C2=[OH+])C1
371 403.1499774961 COC1CC(CC#CN2C(=O)C(C)=CN(C3C=C(O)C(=C=[OH+])O3)C2=O)CCC1O Intermediate Fragment 
372 403.1499774961 COC1CCC(CC#CN2C(=O)C(C)=CN(C3C=C(O)C(=C=[OH+])O3)C2=O)CC1O Intermediate Fragment 
373 401.1343274321 CC1=CN(C2C=C(O)C(=C=[OH+])O2)C(=O)N(C#CCC2CCC3OCOC3C2)C1=O
