#In-silico ESI-MS/MS [M+H]+ Spectra
#PREDICTED BY CFM-ID 4.0.8
#SMILES=n1cnc2c(c1N)nc(n2[C@H]1C[C@H]([C@H](O1)CO)O)Nc1ccc(cc1)c1ccc(cc1)N
#InChiKey=LNTBBSJWMJXXSB-KZNAEPCWSA-N
energy0
318.14617 48.27 12 42 73 23 55 70 48 38 58 54 76 45 34 31 69 51 (27.362 0.23302 0.08268 0.062001 0.055632 0.026026 0.025785 0.024516 0.022889 0.019875 0.016959 0.01203 0.010412 0.0043012 0.0030966 0.0012561)
434.19351 100.00 0 171 134 128 204 207 140 219 216 130 132 224 122 133 208 210 126 127 131 212 (56.564 0.59446 0.36396 0.085457 0.080077 0.052517 0.034254 0.033742 0.023899 0.018877 0.017394 0.014936 0.012202 0.0095689 0.0087627 0.0077618 0.0011475 0.00070895 0.00044707 0.00028555)
energy1
301.11962 23.59 22 13 46 24 50 39 (12.318 2.068 0.44798 0.32479 0.084822 0.083057)
318.14617 100.00 12 45 58 73 76 38 42 70 51 54 55 34 23 31 69 48 (60.391 0.90218 0.67625 0.63064 0.55545 0.23005 0.22947 0.22095 0.18535 0.18306 0.17816 0.16493 0.15119 0.11376 0.1061 0.046106)
energy2
45.03349 18.08 7 (2.9734)
55.01784 8.73 181 (1.4357)
57.03349 18.78 180 (3.0881)
89.05971 15.68 136 (2.5786)
134.04612 25.39 16 (4.175)
136.06177 8.62 17 (1.4169)
183.09167 13.20 15 (2.1709)
185.10732 6.86 14 (1.1276)
225.08832 13.68 21 (2.2502)
251.10397 7.76 226 (1.2762)
263.10397 12.24 77 (2.0132)
265.11962 5.85 78 (0.96126)
292.13052 16.75 61 80 (2.2937 0.46086)
301.11962 14.55 22 13 24 46 50 39 (1.3112 0.46185 0.37244 0.14653 0.096049 0.0044266)
303.13527 10.20 82 (1.6776)
318.14617 100.00 12 58 51 45 54 23 76 42 55 73 38 69 70 34 48 31 (5.7761 2.1898 1.3254 0.92609 0.83065 0.803 0.74293 0.67988 0.60528 0.45517 0.44149 0.43891 0.33257 0.3302 0.30098 0.2652)
320.16182 6.07 81 (0.9981)
324.19312 7.24 85 (1.1899)
330.14617 16.91 138 (2.7807)
342.14617 6.33 148 (1.0401)
344.16182 10.20 149 (1.6777)
346.14108 15.87 135 (2.609)
346.17747 10.76 150 (1.7699)
348.15673 5.26 164 176 (0.78887 0.075725)
374.17238 27.64 201 163 98 161 156 159 158 157 160 (1.1751 0.92842 0.75515 0.50076 0.32629 0.27076 0.23617 0.19 0.1626)
379.15131 8.61 223 (1.4151)
398.17238 9.30 170 99 91 (0.90475 0.60465 0.019644)
406.16221 7.78 220 214 (1.0051 0.27406)
408.17786 13.08 221 211 (1.8689 0.28251)
418.16221 8.16 209 215 236 (1.0691 0.27152 0.00089783)

0 434.1935140481 Nc1ccc(-c2ccc(Nc3nc4c([NH3+])ncnc4n3C3CC(O)C(CO)O3)cc2)cc1
1 417.1669649521 NC1CC=C(C2=CCC(=[NH+]C3=NC4=CN=CN=C4N3C3=CC(O)=C(C=O)O3)C=C2)CC1
2 119.0702706321 OC1CCOC1C[OH2+]
3 117.0546205681 OC1C=COC1C[OH2+]
4 99.0440558841 CC1=C([OH2+])C=CO1
5 99.0440558841 [OH2+]CC1=CC=CO1
6 117.0546205681 C=COC(=CO)C[OH2+] Intermediate Fragment 
7 45.0334912001 C=C[OH2+]
8 117.0546205681 OC=C=COCC[OH2+] Intermediate Fragment 
9 117.0546205681 OC=C=C(O)CC[OH2+] Intermediate Fragment 
10 115.0389705041 OC1=C(C[OH2+])OC=C1
11 316.1305198681 NC1=CC=C(C2=CCC(=NC3=NC4=NC=NC(=[NH2+])C4=N3)C=C2)C=C1
12 318.1461699321 NC1=CC=C(C2=CCC(=NC3=NC4=NC=NC(=[NH2+])C4=N3)C=C2)CC1
13 301.1196208361 N=C1C=CC(=C2C=CC(=[NH+]C3=NC4=CN=CN=C4N3)C=C2)C=C1
14 185.1073248361 NC1C=CC(=C2C=CC(=[NH2+])C=C2)C=C1
15 183.0916747721 N=C1C=CC(=C2C=CC(=[NH2+])C=C2)C=C1
16 134.0461215481 [NH2+]=C1N=CN=C2N=CN=C12
17 136.0617716121 [NH2+]=C1N=CN=C2NCN=C12
18 170.0964258041 [NH3+]C1=CC=C(C2=CC=CC=C2)C=C1
19 149.0570205801 NC1=NC2=NC=NC(=[NH2+])C2=N1
20 94.0651256761 [NH3+]C1=CC=CC=C1
21 225.0883207081 [NH2+]=C1N=CN=C2N=C(N=C3C=CC=CC3)N=C12
22 301.1196208361 [NH2+]=C1N=CN=C2N=C(N=C3C=CC(C4=CC=CC=C4)=CC3)N=C12
23 318.1461699321 N=C=NC1=C(C#[NH+])N=C(N=C2C=CC(C3=CC=C(N)CC3)=CC2)N1 Intermediate Fragment 
24 301.1196208361 C#[N+]C1=C(C#N)N=C(N=C2C=CC(C3=CC=C(N)C=C3)=CC2)N1
25 291.1352709001 N#CC1=NC(N=C2C=CC(=C3C=CC(N)CC3)C=C2)=NC1=[NH2+]
26 276.1243718681 N=C1C=CC(=C2C=CC(N=C3N=C(C#[NH+])CN3)C=C2)C=C1
27 274.1087218041 N=C1C=CC(=C2C=CC(N=C3N=CC(C#[NH+])=N3)C=C2)C=C1
28 289.1196208361 [NH+]#CN=C1C=NC(N=C2C=CC(=C3C=CC(N)C=C3)C=C2)=N1
29 291.1352709001 [NH+]#CN=C1C=NC(N=C2C=CC(=C3C=CC(N)CC3)C=C2)=N1
30 316.1305198681 N=C=C1N=C(N=C2C=CC(C3=CC=C(N)C=C3)=CC2)NC1=NC#[NH+]
31 318.1461699321 [NH+]#CN=C=NC1=CN=C(N=C2C=CC(C3=CC=C(N)CC3)=CC2)N1 Intermediate Fragment 
32 276.1243718681 C=[NH+]C1=CN=C(N=C2C=CC(=C3C=CC(=N)C=C3)C=C2)N1
33 274.1087218041 C#[N+]C1=CN=C(N=C2C=CC(=C3C=CC(=N)C=C3)C=C2)N1
34 318.1461699321 N=C=NC(=[NH2+])C1=CNC(N=C2C=CC(C3=CC=C(N)C=C3)=CC2)=N1 Intermediate Fragment 
35 291.1352709001 N=C1C=CC(=C2C=CC(N=C3N=CC(C(=N)[NH3+])=N3)C=C2)C=C1
36 249.1134728361 N=C1C=CC(=C2C=CC([NH+]=C3N=CC=N3)C=C2)C=C1
37 316.1305198681 N=C=[NH+]C(=N)C1=CNC(N=C2C=CC(=C3C=CC(=N)C=C3)C=C2)=N1
38 318.1461699321 C=NC(=[NH2+])C1=NC(N=C2C=CC(C3=CC=C(N)C=C3)=CC2)=NC1=N Intermediate Fragment 
39 301.1196208361 C#[N+]C(=N)C1=CNC(N=C2C=CC(=C3C=CC(=N)C=C3)C=C2)=N1
40 262.1087218041 N=C1C=CC(=C2C=CC(=NC3=NC(=[NH2+])C=N3)C=C2)C=C1
41 289.1196208361 N#CC1=NC(N=C2C=CC(=C3C=CC(N)C=C3)C=C2)=NC1=[NH2+]
42 318.1461699321 C=NC1=C(C(N)=[NH2+])N=C(N=C2C=CC(=C3C=CC(=N)C=C3)C=C2)N1 Intermediate Fragment 
43 289.1196208361 N=C1C=CC(=C2C=CC(=[N+]=C3N=CC(C(=N)N)=N3)C=C2)C=C1
44 316.1305198681 C#[N+]C1=C(C(=N)N)N=C(N=C2C=CC(=C3C=CC(=N)C=C3)C=C2)N1
45 318.1461699321 N=C1C=CC(=C2C=CC(=NC(=N)NC3=NC=NC([NH3+])=C3)C=C2)C=C1 Intermediate Fragment 
46 301.1196208361 N=C1C=CC(=C2C=CC(=[N+]=C=NC3=NC=NC(N)=C3)C=C2)C=C1
47 208.0869237401 N=C1C=CC(=C2C=CC(=NC#[NH+])C=C2)C=C1
48 318.1461699321 N=C(N=C1C=CC(C2=CC=C(N)C=C2)=CC1)N=C1C=NC=NC1=[NH2+] Intermediate Fragment 
49 210.1025738041 [NH+]#CN=C1C=CC(=C2C=CC(N)C=C2)C=C1
50 301.1196208361 N=C1N=CN=CC1=[N+]=C=NC1=CC=C(C2=CC=C(N)C=C2)C=C1
51 318.1461699321 NC1=CC=C(C2=CC=C(N=C=NC3=C([NH3+])N=CN=C3N)C=C2)C=C1 Intermediate Fragment 
52 195.0916747721 C#[N+]C1=CC=C(C2=CC=C(N)C=C2)C=C1
53 124.0617716121 N=C1C(=[NH2+])N=CN=C1N
54 318.1461699321 NC1=CC=C(C2=CC=C(N=C=NC3=NC=NC([NH3+])=C3N)C=C2)C=C1 Intermediate Fragment 
55 318.1461699321 C=C(C=CC(C)=NC1=NC2=NC=NC(=[NH2+])C2=N1)C1=CC=C(N)C=C1 Intermediate Fragment 
56 302.1148698041 [CH2+]C(CC#CC1=CC=C(N)C=C1)=NC1=NC2=NC=NC(=N)C2=N1
57 175.0726706441 CC=NC1=NC2=NC=NC(=[NH2+])C2=N1
58 318.1461699321 C=CC(C=C=C=C1C=CC(N)=CC1)=NC1=NC2=C([NH3+])N=CN=C2N1 Intermediate Fragment 
59 288.0992197401 NC1=CC=C(C#C[C+]=C=NC2=NC3=C(N)N=CN=C3N2)C=C1
60 290.1148698041 NC1=CC=C(C#CC=C=NC2=NC3=C([NH3+])N=CN=C3N2)C=C1
61 292.1305198681 NC1=CC=C(C#CCC=NC2=NC3=C([NH3+])N=CN=C3N2)C=C1
62 213.0883207081 C#CC(C=C)=NC1=NC2=C([NH3+])N=CN=C2N1
63 211.0726706441 C#CC(C#C)=NC1=NC2=C([NH3+])N=CN=C2N1
64 209.0570205801 [C+]#CC(C#C)=NC1=NC2=C(N)N=CN=C2N1
65 106.0651256761 C=C1C=CC(=[NH2+])C=C1
66 201.0883207081 C=CC(C)=NC1=NC2=NC=NC(=[NH2+])C2=N1
67 120.0807757401 C#CC1=CC=C([NH3+])CC1
68 189.0883207081 CCC=NC1=NC2=NC=NC(=[NH2+])C2=N1
69 318.1461699321 C=CC(=C=C=C=NC1=NC2=C([NH3+])N=CN=C2N1)C1=CC=C(N)CC1 Intermediate Fragment 
70 318.1461699321 C=C(N)C=CC(=C)C1=CCC(=NC2=NC3=NC=NC(=[NH2+])C3=N2)C=C1 Intermediate Fragment 
71 275.1039707721 C#CC(=C)C1=CCC(=NC2=NC3=NC=NC(=[NH2+])C3=N2)C=C1
72 273.0883207081 C#CC(=[CH+])C1=CCC(=NC2=NC3=NC=NC(=N)C3=N2)C=C1
73 318.1461699321 C=C=C(C=C=CN)C1=CCC(=NC2=NC3=C([NH3+])N=CN=C3N2)C=C1 Intermediate Fragment 
74 291.1352709001 C=C=C(C=C)C1=CCC(=NC2=NC3=C([NH3+])N=CN=C3N2)C=C1
75 289.1196208361 C#CC(=C=C)C1=CCC(=NC2=NC3=C([NH3+])N=CN=C3N2)C=C1
76 318.1461699321 C=CC(N)=C=C=CC1=CCC(=NC2=NC3=C([NH3+])N=CN=C3N2)C=C1 Intermediate Fragment 
77 263.1039707721 CC=C=C1C=CC(=NC2=NC3=NC=NC(=[NH2+])C3=N2)C=C1
78 265.1196208361 CCC=C1C=CC(=NC2=NC3=NC=NC(=[NH2+])C3=N2)C=C1
79 288.0992197401 N=C=[C+]C#CC1=CCC(=NC2=NC3=C(N)N=CN=C3N2)C=C1
80 292.1305198681 NC=CC#CC1=CCC(=NC2=NC3=C([NH3+])N=CN=C3N2)C=C1
81 320.1618199961 NC1CC=C(C2=CCC(=NC3=NC4=NC=NC(=[NH2+])C4=N3)C=C2)CC1
82 303.1352709001 [NH3+]C1=C2N=C(N=C3C=CC(C4=CC=CC=C4)=CC3)NC2=NC=N1
83 322.1774700601 NC1CCC(C2=CCC(=NC3=NC4=NC=NC(=[NH2+])C4=N3)C=C2)CC1
84 305.1509209641 [NH3+]C1=C2N=C(N=C3C=CC(C4=CC=CCC4)=CC3)NC2=NC=N1
85 324.1931201241 NC1CCC(C2C=CC(=NC3=NC4=NC=NC(=[NH2+])C4=N3)CC2)CC1
86 402.1672993001 NC1=CC=C(C2=CCC(=NC3=NC4=C([NH3+])N=CN=C4N3C3=CC(O)=CO3)C=C2)CC1
87 404.1829493641 NC1CC=C(C2=CCC(=NC3=NC4=C([NH3+])N=CN=C4N3C3=CC(O)=CO3)C=C2)CC1
88 406.1985994281 NC1CCC(C2=CCC(=NC3=NC4=C([NH3+])N=CN=C4N3C3=CC(O)=CO3)C=C2)CC1
89 416.1829493641 CC1=C(O)C=C(N2C(N=C3C=CC(C4=CC=C(N)CC4)=CC3)=NC3=C([NH3+])N=CN=C32)O1
90 101.0597059481 CC1OC=CC1[OH2+]
91 398.1723846801 CC1=CC=C(N2C(N=C3C=CC(C4=CC=C(N)C=C4)=CC3)=NC3=C([NH3+])N=CN=C32)O1
92 232.0829009801 C=C1OC(N2C=NC3=C([NH3+])N=CN=C32)=CC1O
93 234.0985510441 CC1OC(N2C=NC3=C([NH3+])N=CN=C32)=CC1O
94 399.1564002681 CC1=C(O)C=C(N2C(N=C3C=CC(C4=CC=CC=C4)=CC3)=NC3=C([NH3+])N=CN=C32)O1
95 416.1829493641 C=NC([NH3+])=C1N=C(N=C2C=CC(C3=CC=C(N)C=C3)=CC2)N(C2=CC(O)=C(C)O2)C1=N Intermediate Fragment 
96 416.1829493641 C=C(O)C(=C)OCN1C(N=C2C=CC(C3=CC=C(N)C=C3)=CC2)=NC2=C([NH3+])N=CN=C21 Intermediate Fragment 
97 416.1829493641 CC(=O)C(O)=C=CN1C(N=C2C=CC(C3=CC=C(N)CC3)=CC2)=NC2=C([NH3+])N=CN=C21 Intermediate Fragment 
98 374.1723846801 NC1CC=C(C2=CCC(=NC3=NC4=C([NH3+])N=CN=C4N3C#CC=O)C=C2)CC1
99 398.1723846801 C=C=C(O)C#CN1C(N=C2C=CC(C3=CC=C(N)CC3)=CC2)=NC2=C([NH3+])N=CN=C21
100 416.1829493641 C#CC(O)=C=C(O)N1C(N=C2C=CC(C3=CCC(N)CC3)=CC2)=NC2=C([NH3+])N=CN=C21 Intermediate Fragment 
101 390.1672993001 NC1CC=C(C2=CCC(=NC3=NC4=C([NH3+])N=CN=C4N3C(O)=C=C=O)C=C2)CC1
102 416.1829493641 C#COC(=C=C=O)N1C(N=C2C=CC(C3CCC(N)CC3)=CC2)=NC2=C([NH3+])N=CN=C21 Intermediate Fragment 
103 416.1829493641 CCC(N)=C=C=CC1=CCC(=NC2=NC3=C([NH3+])N=CN=C3N2C2=CC(O)=C(C)O2)C=C1 Intermediate Fragment 
104 416.1829493641 NC1CC=C(C2=CCC(=NC3=NC4=C([NH3+])N=CN=C4N3C3=CC=C(C=O)O3)C=C2)CC1
105 416.1829493641 NC1CCC(C2=CCC(=NC3=NC4=C([NH3+])N=CN=C4N3C(O)=C=C=C=C=O)C=C2)CC1 Intermediate Fragment 
106 191.1542750281 NC1CCC(C2C=CC(=[NH2+])C=C2)CC1
107 189.1386249641 NC1CCC(=C2C=CC(=[NH2+])C=C2)CC1
108 187.1229749001 NC1C=CC(=C2C=CC(=[NH2+])C=C2)CC1
109 248.0778156001 [NH3+]C1=C2N=CN(C3=CC(O)=C(CO)O3)C2=NC=N1
110 250.0934656641 [NH3+]C1=C2N=CN(C3=CC(O)C(CO)O3)C2=NC=N1
111 252.1091157281 [NH3+]C1=C2N=CN(C3CC(O)C(CO)O3)C2=NC=N1
112 176.1433759961 [NH3+]C1CCC(C2=CC=CC=C2)CC1
113 172.1120758681 [NH3+]C1=CC=C(C2=CC=CC=C2)CC1
114 94.0651256761 C=C=C=C=C(C)[NH3+] Intermediate Fragment 
115 92.0494756121 C=C=C=[C+]C(=C)N
116 335.0887146321 NC1=C2N=C(N=C3C=CC=CC3)N(C3=CC(O)=C(C#[O+])O3)C2=NC=N1
117 337.1043646961 [NH3+]C1=C2N=C(N=C3C=CC=CC3)N(C3=CC(O)=C(C=O)O3)C2=NC=N1
118 339.1200147601 [NH3+]C1=C2N=C(N=C3C=CCCC3)N(C3=CC(O)=C(C=O)O3)C2=NC=N1
119 341.1356648241 [NH3+]C1=C2N=C(N=C3CCCCC3)N(C3=CC(O)=C(C=O)O3)C2=NC=N1
120 417.1669649521 [NH3+]C1=C2N=C(N=C3C=CC(C4=CCCCC4)=CC3)N(C3=CC(O)=C(C=O)O3)C2=NC=N1
121 417.1669649521 [NH3+]C1=C2N=C(N=C3C=CC(C4=CCCCC4)=CC3)N(C(O)=C=C(O)C#CO)C2=NC=N1 Intermediate Fragment 
122 434.1935140481 N=C=NC1=C(C#[NH+])N=C(N=C2C=CC(C3CCC(N)CC3)CC2)N1C1=CC(O)=C(C=O)O1 Intermediate Fragment 
123 392.1717159841 [NH+]#CC1=CN(C2=CC(O)=C(C=O)O2)C(N=C2C=CC(C3CCC(N)CC3)=CC2)=N1
124 407.1826150161 [NH+]#CN=C1C=NC(=NC2=CC=C(C3CCC(N)CC3)CC2)N1C1=CC(O)=C(C=O)O1
125 380.1717159841 NC1CCC(C2=CC=C(N=C3N=CC(=[NH2+])N3C3=CC(O)=C(C=O)O3)C=C2)CC1
126 434.1935140481 [NH+]#CN=C=NC1=CN=C(N=C2C=CC(C3CCC(N)CC3)CC2)N1C1=CC(O)=C(C=O)O1 Intermediate Fragment 
127 434.1935140481 N=C=NC(=[NH2+])C1=CN(C2=CC(O)=C(C=O)O2)C(N=C2C=CC(C3CCC(N)CC3)=CC2)=N1 Intermediate Fragment 
128 434.1935140481 C=NC([NH3+])=C1N=C(N=C2C=CC(C3=CCC(N)CC3)=CC2)N(C2=CC(O)=C(C=O)O2)C1=N Intermediate Fragment 
129 407.1826150161 N=C=C1N=C(N=C2C=CC(C3CCC(N)CC3)=CC2)N(C2=CC(O)=C(C=O)O2)C1=[NH2+]
130 434.1935140481 N=C(N=C1C=CC(C2=CCC(N)CC2)=CC1)N(C1=CC(O)=C(C=O)O1)C1=NC=NC([NH3+])=C1 Intermediate Fragment 
131 434.1935140481 NC1CCC(C2=CCC(=NC(=NC3=C([NH3+])N=CN=C3)N=C3C=C(O)C(=C=O)O3)C=C2)CC1 Intermediate Fragment 
132 434.1935140481 NC1CCC(C2=CC=C(N=C=NC3=C([NH3+])N=CN=C3N=C3C=C(O)C(=C=O)O3)CC2)CC1 Intermediate Fragment 
133 434.1935140481 NC1=C([NH3+])N=CN=C1N(C=NC1=CC=C(C2=CCC(N)CC2)C=C1)C1=CC(O)=C(C=O)O1 Intermediate Fragment 
134 434.1935140481 C=C(O)C(=C=O)OCN1C(N=C2C=CC(C3=CCC(N)CC3)=CC2)=NC2=C([NH3+])N=CN=C21 Intermediate Fragment 
135 346.1410845521 NC1=CC=C(C2=CCC(=NC3=NC4=C([NH3+])N=CN=C4N3C=O)C=C2)C=C1
136 89.0597059481 C=C(O)CC[OH2+]
137 332.1618199961 CN1C(=NC2C=CC(C3=CC=C(N)C=C3)=CC2)N=C2C(=[NH2+])N=CN=C21
138 330.1461699321 CN1C(=NC2=CC=C(C3=CC=C(N)C=C3)C=C2)N=C2C(=[NH2+])N=CN=C21
139 328.1305198681 [CH2+]N1C(=NC2=CC=C(C3=CC=C(N)C=C3)C=C2)N=C2C(=N)N=CN=C21
140 434.1935140481 NC1CCC(C2=CCC(=NC3=NC4=C([NH3+])N=CN=C4N3C=C=C(O)C(=O)C=O)C=C2)CC1 Intermediate Fragment 
141 105.0546205681 C=C(O)C([OH2+])CO
142 93.0546205681 OCC([OH2+])CO
143 91.0389705041 OC=C([OH2+])CO
144 61.0284058201 OCC=[OH+]
145 73.0284058201 OC#CC[OH2+]
146 73.0284058201 CC([OH2+])=C=O
147 89.0233204401 O=CC([OH2+])=CO
148 342.1461699321 C#CN1C(N=C2C=CC(C3=CC=C(N)C=C3)=CC2)=NC2=C([NH3+])N=CN=C21
149 344.1618199961 C#CN1C(N=C2C=CC(C3=CC=C(N)CC3)=CC2)=NC2=C([NH3+])N=CN=C21
150 346.1774700601 C#CN1C(N=C2C=CC(C3=CCC(N)CC3)=CC2)=NC2=C([NH3+])N=CN=C21
151 348.1931201241 C#CN1C(N=C2C=CC(C3CCC(N)CC3)=CC2)=NC2=C([NH3+])N=CN=C21
152 350.2087701881 C#CN1C(N=C2C=CC(C3CCC(N)CC3)CC2)=NC2=C([NH3+])N=CN=C21
153 63.0440558841 OCC[OH2+]
154 372.1567346161 NC1=CC=C(C2=CCC(=NC3=NC4=C([NH3+])N=CN=C4N3C#CC=O)C=C2)CC1
155 356.1618199961 CC#CN1C(N=C2C=CC(C3=CC=C(N)C=C3)=CC2)=NC2=C([NH3+])N=CN=C21
156 374.1723846801 N=C=NC1=C(C#[NH+])N=C(N=C2C=CC(C3CCC(N)CC3)=CC2)N1C#CC=O Intermediate Fragment 
157 374.1723846801 N=C(N=C1C=CC(C2=CC=C(N)CC2)=CC1)N(C#CC=O)C1=NC=NC([NH3+])=C1 Intermediate Fragment 
158 374.1723846801 NC1CC=C(C2=CCC(=NC(N=C=C=C=O)=NC3=C([NH3+])N=CN=C3)C=C2)CC1 Intermediate Fragment 
159 374.1723846801 NC1=CC=C(C2=CC=C(N=CN(C#CC=O)C3=NC=NC([NH3+])=C3N)C=C2)CC1 Intermediate Fragment 
160 374.1723846801 C=CC(C=C=C=C1CCC(N)CC1)=NC1=NC2=C([NH3+])N=CN=C2N1C#CC=O Intermediate Fragment 
161 374.1723846801 CCC(=C=CCN)C1=CCC(=NC2=NC3=C([NH3+])N=CN=C3N2C#CC=O)C=C1 Intermediate Fragment 
162 347.1614856481 CC=C(CC)C1=CCC(=NC2=NC3=C([NH3+])N=CN=C3N2C#CC=O)C=C1
163 374.1723846801 CCC(N)C=C=CC1=CCC(=NC2=NC3=C([NH3+])N=CN=C3N2C#CC=O)C=C1 Intermediate Fragment 
164 348.1567346161 NCCC=CC1=CCC(=NC2=NC3=C([NH3+])N=CN=C3N2C#CC=O)C=C1
165 376.1880347441 NC1CCC(C2=CCC(=NC3=NC4=C([NH3+])N=CN=C4N3C#CC=O)C=C2)CC1
166 358.1774700601 CC#CN1C(N=C2C=CC(C3=CC=C(N)CC3)=CC2)=NC2=C([NH3+])N=CN=C21
167 376.1880347441 CCC(=CCCN)C1=CCC(=NC2=NC3=C([NH3+])N=CN=C3N2C#CC=O)C=C1 Intermediate Fragment 
168 378.2036848081 NC1CCC(C2C=CC(=NC3=NC4=C([NH3+])N=CN=C4N3C#CC=O)CC2)CC1
169 416.1829493641 NC1CCC(C2=CCC(=NC3=NC4=C([NH3+])N=CN=C4N3C#CC(O)=C=C=O)C=C2)CC1
170 398.1723846801 NC1CC=C(C2=CCC(=NC3=NC4=C([NH3+])N=CN=C4N3C#CC#CC=O)C=C2)CC1
171 434.1935140481 NC1CCC(C2=CCC(=NC3=NC4=C([NH3+])N=CN=C4N3C(O)=C=C(O)C#CO)C=C2)CC1 Intermediate Fragment 
172 91.0753560121 CC(O)CC[OH2+]
173 73.0647913281 C=C([OH2+])CC
174 87.0440558841 C=C(O)C=C[OH2+]
175 344.1254344881 NC1=CC=C(C2=CCC(=NC3=NC4=C(N)N=CN=C4N3C#[O+])C=C2)C=C1
176 348.1567346161 NC1=CC=C(C2=CCC(=NC3=NC4=C([NH3+])N=CN=C4N3CO)C=C2)C=C1
177 350.1723846801 NC1=CC=C(C2=CCC(=NC3=NC4=C([NH3+])N=CN=C4N3CO)C=C2)CC1
178 75.0440558841 OC=CC[OH2+]
179 43.0178411361 C#C[OH2+]
180 57.0334912001 CC#C[OH2+]
181 55.0178411361 [CH2+]C#CO
182 71.0127557561 OC#CC=[OH+]
183 68.9971056921 [O+]#CC#CO
184 41.0021910721 [C+]#CO
185 358.1410845521 [CH+]=C(O)N1C(N=C2C=CC(C3=CC=C(N)C=C3)=CC2)=NC2=C(N)N=CN=C21
186 360.1567346161 C=C(O)N1C(N=C2C=CC(C3=CC=C(N)C=C3)=CC2)=NC2=C([NH3+])N=CN=C21
187 362.1723846801 C=C(O)N1C(N=C2C=CC(C3=CC=C(N)CC3)=CC2)=NC2=C([NH3+])N=CN=C21
188 362.1723846801 C=C(O)N1C(N=C2C=CC(C(=C=C=CN)CC)=CC2)=NC2=C([NH3+])N=CN=C21 Intermediate Fragment 
189 364.1880347441 C=C(O)N1C(N=C2C=CC(C3=CCC(N)CC3)=CC2)=NC2=C([NH3+])N=CN=C21
190 366.2036848081 C=C(O)N1C(N=C2C=CC(C3CCC(N)CC3)=CC2)=NC2=C([NH3+])N=CN=C21
191 47.0491412641 CC[OH2+]
192 29.0385765801 C=[CH3+]
193 388.1516492361 NC1=CC=C(C2=CCC(=NC3=NC4=C([NH3+])N=CN=C4N3C(O)=C=C=O)C=C2)CC1
194 372.1567346161 C=C=C(O)N1C(N=C2C=CC(C3=CC=C(N)C=C3)=CC2)=NC2=C([NH3+])N=CN=C21
195 390.1672993001 C=CC(C=C=C=C1CCC(N)CC1)=NC1=NC2=C([NH3+])N=CN=C2N1C(O)=C=C=O Intermediate Fragment 
196 390.1672993001 CCC(=C=CCN)C1=CCC(=NC2=NC3=C([NH3+])N=CN=C3N2C(O)=C=C=O)C=C1 Intermediate Fragment 
197 363.1564002681 CC=C(CC)C1=CCC(=NC2=NC3=C([NH3+])N=CN=C3N2C(O)=C=C=O)C=C1
198 390.1672993001 CCC(N)C=C=CC1=CCC(=NC2=NC3=C([NH3+])N=CN=C3N2C(O)=C=C=O)C=C1 Intermediate Fragment 
199 364.1516492361 NCCC=CC1=CCC(=NC2=NC3=C([NH3+])N=CN=C3N2C(O)=C=C=O)C=C1
200 392.1829493641 NC1CCC(C2=CCC(=NC3=NC4=C([NH3+])N=CN=C4N3C(O)=C=C=O)C=C2)CC1
201 374.1723846801 C=C=C(O)N1C(N=C2C=CC(C3=CC=C(N)CC3)=CC2)=NC2=C([NH3+])N=CN=C21
202 392.1829493641 CCC(=CCCN)C1=CCC(=NC2=NC3=C([NH3+])N=CN=C3N2C(O)=C=C=O)C=C1 Intermediate Fragment 
203 432.1778639841 NC1CC=C(C2=CCC(=NC3=NC4=C([NH3+])N=CN=C4N3C(O)=C=C(O)C#CO)C=C2)CC1
204 434.1935140481 NC1CCC(C2C=CC(=NC3=NC4=C([NH3+])N=CN=C4N3C(=C=C=O)OC#CO)CC2)CC1 Intermediate Fragment 
205 404.1829493641 C=C(OC#CO)N1C(N=C2C=CC(C3=CCC(N)CC3)=CC2)=NC2=C([NH3+])N=CN=C21
206 406.1985994281 C=C(OC#CO)N1C(N=C2C=CC(C3CCC(N)CC3)=CC2)=NC2=C([NH3+])N=CN=C21
207 434.1935140481 C=C(OC(=C=O)C=O)N1C(N=C2C=CC(C3CCC(N)CC3)=CC2)=NC2=C([NH3+])N=CN=C21 Intermediate Fragment 
208 434.1935140481 C=C(C=CC(C)=NC1=NC2=C([NH3+])N=CN=C2N1C1=CC(O)=C(C=O)O1)C1=CCC(N)CC1 Intermediate Fragment 
209 418.1622139201 CC(CC#CC1=CC=C(N)CC1)=NC1=NC2=C([NH3+])N=CN=C2N1C1=CC(O)=C(C=O)O1
210 434.1935140481 C=CC(C=C=CC1CCC(N)CC1)=NC1=NC2=C([NH3+])N=CN=C2N1C1=CC(O)=C(C=O)O1 Intermediate Fragment 
211 408.1778639841 NC1CCC(C#CCC=NC2=NC3=C([NH3+])N=CN=C3N2C2=CC(O)=C(C=O)O2)CC1
212 434.1935140481 CCC(=C=C=C=NC1=NC2=C([NH3+])N=CN=C2N1C1=CC(O)=C(C=O)O1)C1CCC(N)CC1 Intermediate Fragment 
213 404.1465638561 NC1CCC(=C=C=C=C=NC2=NC3=C([NH3+])N=CN=C3N2C2=CC(O)=C(C=O)O2)CC1
214 406.1622139201 NC1CCC(C=C=C=C=NC2=NC3=C([NH3+])N=CN=C3N2C2=CC(O)=C(C=O)O2)CC1
215 418.1622139201 CC(=C=C=C=NC1=NC2=C([NH3+])N=CN=C2N1C1=CC(O)=C(C=O)O1)C1=CCC(N)CC1
216 434.1935140481 C=C(CCC(C)N)C1=CCC(=NC2=NC3=C([NH3+])N=CN=C3N2C2=CC(O)=C(C=O)O2)C=C1 Intermediate Fragment 
217 391.1513148881 C=C(CC)C1=CCC(=NC2=NC3=C([NH3+])N=CN=C3N2C2=CC(O)=C(C=O)O2)C=C1
218 389.1356648241 C=CC(=C)C1=CCC(=NC2=NC3=C([NH3+])N=CN=C3N2C2=CC(O)=C(C=O)O2)C=C1
219 434.1935140481 CC=C(CCCN)C1=CCC(=NC2=NC3=C([NH3+])N=CN=C3N2C2=CC(O)=C(C=O)O2)C=C1 Intermediate Fragment 
220 406.1622139201 NC=CCCC1=CCC(=NC2=NC3=C([NH3+])N=CN=C3N2C2=CC(O)=C(C=O)O2)C=C1
221 408.1778639841 NCCCCC1=CCC(=NC2=NC3=C([NH3+])N=CN=C3N2C2=CC(O)=C(C=O)O2)C=C1
222 407.1826150161 CCC(CC)C1=CCC(=NC2=NC3=C([NH3+])N=CN=C3N2C2=CC(O)=C(C=O)O2)C=C1
223 379.1513148881 CCCC1=CCC(=NC2=NC3=C([NH3+])N=CN=C3N2C2=CC(O)=C(C=O)O2)C=C1
224 434.1935140481 CCC(N)CC=CC1=CCC(=NC2=NC3=C([NH3+])N=CN=C3N2C2=CC(O)=C(C=O)O2)C=C1 Intermediate Fragment 
225 361.1043646961 C#CC1=CCC(=NC2=NC3=C([NH3+])N=CN=C3N2C2=CC(O)=C(C=O)O2)C=C1
226 251.1039707721 C=CC1=CCC(=NC2=NC3=NC=NC(=[NH2+])C3=N2)C=C1
227 363.1200147601 C=CC1=CCC(=NC2=NC3=C([NH3+])N=CN=C3N2C2=CC(O)=C(C=O)O2)C=C1
228 365.1356648241 CCC1=CCC(=NC2=NC3=C([NH3+])N=CN=C3N2C2=CC(O)=C(C=O)O2)C=C1
229 367.1513148881 CCC1C=CC(=NC2=NC3=C([NH3+])N=CN=C3N2C2=CC(O)=C(C=O)O2)CC1
230 367.1513148881 CCC1C=CC(=NC2=NC3=C([NH3+])N=CN=C3N2C(O)=C=C(O)C#CO)CC1 Intermediate Fragment 
231 375.1200147601 CC#CC1=CCC(=NC2=NC3=C([NH3+])N=CN=C3N2C2=CC(O)=C(C=O)O2)C=C1
232 377.1356648241 CC=CC1=CCC(=NC2=NC3=C([NH3+])N=CN=C3N2C2=CC(O)=C(C=O)O2)C=C1
233 381.1669649521 CCCC1C=CC(=NC2=NC3=C([NH3+])N=CN=C3N2C2=CC(O)=C(C=O)O2)CC1
234 383.1826150161 CCCC1CCC(=NC2=NC3=C([NH3+])N=CN=C3N2C2=CC(O)=C(C=O)O2)CC1
235 404.1465638561 NCCC#CC1=CCC(=NC2=NC3=C([NH3+])N=CN=C3N2C2=CC(O)=C(C=O)O2)C=C1
236 418.1622139201 CC(N)CC#CC1=CCC(=NC2=NC3=C([NH3+])N=CN=C3N2C2=CC(O)=C(C=O)O2)C=C1
237 304.1305198681 CC(N)C=C=C=C1C=CC(=NC2=NC3=NC=NC(=[NH2+])C3=N2)C=C1
