#In-silico ESI-MS/MS [M+H]+ Spectra
#PREDICTED BY CFM-ID 4.0.8
#SMILES=[C@H]1(C[C@@H](O[C@@H]1CO)n1cc(c(=O)[nH]c1=O)Cl)O
#InChiKey=NJCXGFKPQSFZIB-FSDSQADBSA-N
energy0
99.04406 16.51 79 7 92 (3.0381 1.7303 1.6052)
117.05462 14.82 77 89 80 99 97 87 (3.0629 1.9674 0.24695 0.23939 0.15952 0.045901)
119.00067 30.62 35 50 (11.278 0.54359)
146.99558 100.00 5 37 25 52 45 (26.742 9.0589 1.7712 0.74159 0.28817)
245.03236 14.06 103 3 108 148 101 14 111 107 112 9 13 15 11 154 12 (4.5348 0.51419 0.20445 0.064545 0.052517 0.013507 0.012838 0.0093769 0.0077268 0.0073437 0.0014853 0.0013409 0.0011058 0.0010788 0.00025802)
263.04293 34.09 0 137 167 193 233 128 222 202 115 236 243 195 (12.427 0.48192 0.14688 0.04049 0.021907 0.018678 0.0099317 0.0048988 0.004313 0.0020047 0.00076845 0.00063313)
energy1
44.01309 14.44 31 (3.4176)
45.03349 14.98 72 (3.5452)
57.03349 15.20 70 (3.5976)
75.99485 20.49 20 (4.8486)
87.04406 10.65 64 85 74 (2.2417 0.26026 0.016886)
99.04406 48.98 7 92 79 (4.8772 4.3096 2.4029)
101.97412 62.66 32 41 (13.417 1.4099)
103.98977 12.58 33 42 38 (1.7197 0.98636 0.27062)
119.00067 16.59 35 50 (3.7065 0.21977)
119.98468 10.85 27 (2.5664)
129.96903 15.13 43 26 178 (3.3176 0.25652 0.0049341)
146.99558 100.00 5 25 37 52 45 (12.325 7.8557 2.0736 1.0233 0.3843)
energy2
43.01784 23.36 73 (3.2286)
45.03349 41.66 72 (5.7595)
55.01784 8.16 94 (1.1276)
57.03349 45.87 70 (6.3406)
61.02841 5.64 96 (0.77967)
73.02841 10.07 83 143 100 (0.98818 0.3951 0.0092755)
75.04406 5.98 82 145 (0.55602 0.27123)
75.99485 14.26 20 (1.971)
87.99485 6.00 132 (0.82918)
89.05971 40.01 88 78 86 (5.4814 0.039944 0.0096648)
97.02841 9.58 6 65 68 (0.78033 0.4508 0.092822)
99.04406 36.31 7 79 92 (2.6291 2.1815 0.20873)
115.98977 14.53 120 131 (1.9713 0.037437)
118.00542 13.28 121 (1.8359)
119.00067 6.41 50 35 (0.49667 0.3892)
143.00067 21.35 134 (2.9517)
146.99558 100.00 5 37 52 45 25 (3.1072 2.8375 2.7374 2.6269 2.5146)
149.01123 15.43 24 4 (1.7404 0.39238)
158.99558 27.50 130 129 10 (2.1962 0.93215 0.67259)
170.99558 8.36 116 (1.1551)
173.01123 45.72 126 125 (3.7985 2.522)
174.99050 27.21 135 (3.7608)
175.02688 16.42 117 160 (2.0999 0.17046)
177.00615 21.76 136 (3.0078)
190.02655 10.32 220 (1.4273)
191.02180 5.86 127 124 (0.68464 0.12512)

0 263.0429255841 O=c1[nH]c(=O)n(C2CC(O)C(C[OH2+])O2)cc1Cl
1 231.0167108361 OC1=CC(N2C=C(Cl)C(=[OH+])N=C2O)OC1
2 233.0323609001 OC1=CC(N2C=C(Cl)C(=[OH+])NC2O)OC1
3 245.0323609001 C=C1OC(N2C=C(Cl)C(=[OH+])NC2O)C=C1O
4 149.0112315321 OC1N=CC(Cl)=C([OH2+])N1
5 146.9955814681 OC1=NC([OH2+])=C(Cl)C=N1
6 97.0284058201 C=C1OC=CC1=[OH+]
7 99.0440558841 C=C1OC=CC1[OH2+]
8 227.0217962161 C=C1C=CC(N2C=C(Cl)C(=[OH+])N=C2O)O1
9 245.0323609001 CC(=O)C(O)=C=CN1C=C(Cl)C(=[OH+])NC1O Intermediate Fragment 
10 158.9955814681 [CH2+]N1C=C(Cl)C(=O)N=C1O
11 245.0323609001 C#CC(O)=C=C(O)N1C=C(Cl)C([OH2+])NC1O Intermediate Fragment 
12 245.0323609001 [CH+]=C1OC(N(C)C(O)=NC(O)=CCl)C=C1O Intermediate Fragment 
13 245.0323609001 C=C1OC(N(C=CCl)C(O)N=C=[OH+])C=C1O Intermediate Fragment 
14 245.0323609001 C=C1OC(N(C=C(Cl)C=[OH+])C(=N)O)C=C1O Intermediate Fragment 
15 245.0323609001 C=C1OC(=NC=C(Cl)C(=[OH+])NCO)C=C1O Intermediate Fragment 
16 153.0425316601 OC1NCC(Cl)C([OH2+])N1
17 153.0425316601 N=CC(Cl)C([OH2+])NCO Intermediate Fragment 
18 153.0425316601 NC(O)N=CC(Cl)C[OH2+] Intermediate Fragment 
19 153.0425316601 OC(N=CCCl)NC[OH2+] Intermediate Fragment 
20 75.9948531961 [NH+]#CCCl
21 151.0268815961 OC1N=CC(Cl)C([OH2+])N1
22 151.0268815961 N=C=C(Cl)C([OH2+])NCO Intermediate Fragment 
23 151.0268815961 C=NC(O)NC([OH2+])=CCl Intermediate Fragment 
24 149.0112315321 N=C=C(Cl)C(=[OH+])NCO Intermediate Fragment 
25 146.9955814681 N=C=C(Cl)C(=[OH+])N=CO Intermediate Fragment 
26 129.9690323721 [CH+]=C(Cl)C(=O)N=C=O
27 119.9846824361 O=C=[NH+]C(O)=CCl
28 117.9690323721 O=C=NC(O)=[C+]Cl
29 72.0080047241 O=C=[NH+]C=O
30 73.9792031321 N#C[CH+]Cl
31 44.0130901041 [NH+]#CO
32 101.9741177521 N=[C+]C(Cl)=C=O
33 103.9897678161 [NH2+]=CC(Cl)=C=O
34 116.9850167841 N#C[C+](Cl)C(N)=O
35 119.0006668481 [NH+]#CC(Cl)C(N)=O
36 144.9799314041 [NH+]#CC(Cl)=C(O)N=C=O
37 146.9955814681 NC(=[OH+])C(Cl)=C=NC=O Intermediate Fragment 
38 103.9897678161 [CH+]=C(Cl)C(N)=O
39 91.9897678161 NC(O)=[C+]Cl
40 46.0287401681 [NH3+]C=O
41 101.9741177521 [O+]#CN=C=CCl
42 103.9897678161 O=C[NH+]=C=CCl
43 129.9690323721 O=CN=C=C(Cl)C#[O+]
44 144.9799314041 NC(=O)C(Cl)=C=NC#[O+]
45 146.9955814681 N=C(O)N=C=C(Cl)C=[OH+] Intermediate Fragment 
46 76.9788687841 [OH+]=C=CCl
47 74.9632187201 O=C=[C+]Cl
48 71.0239891361 C#[N+]C(=N)O
49 116.9850167841 N=C(O)N=C=[C+]Cl
50 119.0006668481 N=C(O)[NH+]=C=CCl
51 144.9799314041 N=C(O)N=C=C(Cl)C#[O+]
52 146.9955814681 OC(N=C=[OH+])N=C=CCl Intermediate Fragment 
53 60.9839541641 C#C[ClH+]
54 58.9683041001 [C+]#CCl
55 87.0189037561 [NH3+]C(=O)N=C=O
56 50.9996042281 C[ClH+]
57 69.9923546601 O=C=[N+]=C=O
58 144.9799314041 O=C=NC(=O)[NH+]=C=CCl
59 111.0076703761 O=C1C=COC1=C=[OH+]
60 113.0233204401 OC1C=COC1=C=[OH+]
61 85.0284058201 [OH+]=C1C=COC1
62 113.0233204401 C=C=C(O)C(=O)C=[OH+] Intermediate Fragment 
63 115.0389705041 OC1C=COC1=C[OH2+]
64 87.0440558841 [OH2+]C1C=COC1
65 97.0284058201 [OH+]=C=C1C=CCO1
66 115.0389705041 C=COC(=C=[OH+])CO Intermediate Fragment 
67 115.0389705041 C=C=C(O)C(=O)C[OH2+] Intermediate Fragment 
68 97.0284058201 C=C=C(O)C#C[OH2+]
69 59.0491412641 CC=C[OH2+]
70 57.0334912001 C=C=C[OH2+]
71 115.0389705041 O=C=C=C(O)CC[OH2+] Intermediate Fragment 
72 45.0334912001 C=C[OH2+]
73 43.0178411361 C#C[OH2+]
74 87.0440558841 C=C(O)C=C[OH2+]
75 47.0491412641 CC[OH2+]
76 115.0389705041 OC=C=COC=C[OH2+] Intermediate Fragment 
77 117.0546205681 OC1C=COC1C[OH2+]
78 89.0597059481 [OH2+]C1CCOC1
79 99.0440558841 [OH2+]C=C1C=CCO1
80 117.0546205681 C=COC(=C[OH2+])CO Intermediate Fragment 
81 91.0389705041 OCC(=[OH+])CO
82 75.0440558841 OCC=C[OH2+]
83 73.0284058201 OCC#C[OH2+]
84 71.0127557561 O=CC#C[OH2+]
85 87.0440558841 C#C[OH+]CCO
86 89.0597059481 C=C[OH+]CCO
87 117.0546205681 C=C(O)C(=C[OH2+])OC Intermediate Fragment 
88 89.0597059481 C=C(O)CC[OH2+]
89 117.0546205681 C=C=C(O)C(O)C[OH2+] Intermediate Fragment 
90 31.0542266441 C[CH4+]
91 29.0385765801 C=[CH3+]
92 99.0440558841 C=C=C(O)C=C[OH2+]
93 61.0647913281 CCC[OH2+]
94 55.0178411361 [CH2+]C#CO
95 59.0127557561 OC=C=[OH+]
96 61.0284058201 OCC=[OH+]
97 117.0546205681 OC=C=C(O)CC[OH2+] Intermediate Fragment 
98 85.0284058201 C=C(O)C#C[OH2+]
99 117.0546205681 OC=C=COCC[OH2+] Intermediate Fragment 
100 73.0284058201 C[OH+]C#CO
101 245.0323609001 OC1=CC(N2C=C(Cl)CNC2O)OC1=C=[OH+]
102 227.0662478721 OC1=CC(N2C=CC(O)NC2O)OC1=C=[OH+]
103 245.0323609001 OC1NC(O)N(C2C=CC(=C=[OH+])O2)C=C1Cl
104 213.0061461521 OC1=NC(=[OH+])C(Cl)=CN1C1=CC=CO1
105 215.0217962161 OC1=NC(=[OH+])C(Cl)=CN1C1=CCCO1
106 217.0374462801 OC1NC(=[OH+])C(Cl)=CN1C1=CCCO1
107 245.0323609001 C=C(OC(C)=C=[OH+])N1C=C(Cl)C(=O)NC1O Intermediate Fragment 
108 245.0323609001 O=C(C=[OH+])C=C=CN1C=C(Cl)C(O)NC1O Intermediate Fragment 
109 187.0268815961 C#CCN1C=C(Cl)C(=[OH+])NC1O
110 185.0112315321 C#CCN1C=C(Cl)C(=[OH+])N=C1O
111 245.0323609001 O=CNC(O)N(C=CCl)C1C=CC(=C=[OH+])O1 Intermediate Fragment 
112 245.0323609001 OCNC(O)C(Cl)=CN=C1C=CC(=C=[OH+])O1 Intermediate Fragment 
113 174.0316326281 O=C=C1C=CC([NH2+]CCCl)O1
114 202.0265472481 O=C=C1C=CC(=[NH+]CC(Cl)CO)O1
115 263.0429255841 C=C(OC(=C=[OH+])CO)N1C=C(Cl)C(O)NC1O Intermediate Fragment 
116 170.9955814681 C#CN1C=C(Cl)C(=[OH+])N=C1O
117 175.0268815961 C#CN1C=C(Cl)C([OH2+])NC1O
118 189.0061461521 C=C([OH2+])N1C=C(Cl)C(=O)N=C1O
119 189.0061461521 C=C([OH2+])N=C=C(Cl)C(=O)N=CO Intermediate Fragment 
120 115.9897678161 [CH+]=C(O)N=C=CCl
121 118.0054178801 C=C(O)[NH+]=C=CCl
122 161.0112315321 C=C(O)[NH+]=C=C(Cl)C(N)=O
123 189.0061461521 C=C([OH2+])N(C=CCl)C(=O)N=C=O Intermediate Fragment 
124 191.0217962161 C=C([OH2+])N1C=C(Cl)C(=O)NC1O
125 173.0112315321 C#CN1C=C(Cl)C(=[OH+])NC1O
126 173.0112315321 C=C([OH2+])N1C=C(Cl)C=NC1=O
127 191.0217962161 C=C([OH2+])N=C=C(Cl)C(=O)NCO Intermediate Fragment 
128 263.0429255841 C=C(O)C(=C=[OH+])OCN1C=C(Cl)C(O)NC1O Intermediate Fragment 
129 158.9955814681 C=NC=C(Cl)C(=[OH+])N=C=O Intermediate Fragment 
130 158.9955814681 [CH2+]N(C=CCl)C(=O)N=C=O Intermediate Fragment 
131 115.9897678161 C=[N+](C#CCl)C=O
132 87.9948531961 C=[NH+]C#CCl
133 161.0112315321 CN1C=C(Cl)C(=[OH+])N=C1O
134 143.0006668481 [CH2+]N1C=C(Cl)C=NC1=O
135 174.9904960881 O=C1N=C(O)N(C=[OH+])C=C1Cl
136 177.0061461521 O=C1NC(O)N(C=[OH+])C=C1Cl
137 263.0429255841 O=C(C=[OH+])C(O)=C=CN1CC(Cl)C(O)NC1O Intermediate Fragment 
138 179.0581817241 C=CN1CC(Cl)C([OH2+])NC1O
139 179.0581817241 C#CN(CC(Cl)C[OH2+])C(N)O Intermediate Fragment 
140 177.0425316601 C#CN1CC(Cl)C([OH2+])NC1O
141 89.0233204401 O=CC(=[OH+])CO
142 71.0127557561 CC(=O)C#[O+]
143 73.0284058201 CC(=[OH+])C=O
144 93.0546205681 OCC([OH2+])CO
145 75.0440558841 CC(=[OH+])CO
146 163.0268815961 CN1C=C(Cl)C(=[OH+])NC1O
147 103.0389705041 C=C(O)C(=[OH+])CO
148 245.0323609001 OC(=C=CN1C=C(Cl)C(O)NC1O)C#C[OH2+]
149 227.0217962161 C#CC(O)=C=CN1C=C(Cl)C(=[OH+])NC1O
150 227.0217962161 O=C1NC(O)N(CC#CC#C[OH2+])C=C1Cl
151 203.0217962161 OC#CCN1C=C(Cl)C(=[OH+])NC1O
152 201.0061461521 OC#CCN1C=C(Cl)C(=[OH+])N=C1O
153 198.9904960881 O=C1N=C(O)N([CH+]C#CO)C=C1Cl
154 245.0323609001 NC(O)N(C=C=C(O)C#C[OH2+])C=C(Cl)C=O Intermediate Fragment 
155 207.0530963441 OC#CCN1CC(Cl)C([OH2+])NC1O
156 205.0374462801 OC#CCN1C=C(Cl)C([OH2+])NC1O
157 203.0217962161 OC#CC=NC=C(Cl)C(=[OH+])NCO Intermediate Fragment 
158 203.0217962161 NC(=[OH+])C(Cl)=CN(C=O)CC#CO Intermediate Fragment 
159 203.0217962161 N=C(O)N(C=C(Cl)C=[OH+])CC#CO Intermediate Fragment 
160 175.0268815961 NC(O)[NH+](C#CCl)CC#CO
161 203.0217962161 OC#CCN(C=CCl)C(O)N=C=[OH+] Intermediate Fragment 
162 132.0210679441 OC#CC=[NH+]CCCl
163 203.0217962161 CN([CH+]C#CO)C(O)=NC(O)=CCl Intermediate Fragment 
164 201.0061461521 N=C(O)N(C=C(Cl)C#[O+])CC#CO Intermediate Fragment 
165 201.0061461521 O=C(N=C=[OH+])N(C=CCl)CC#CO Intermediate Fragment 
166 63.0440558841 OCC[OH2+]
167 263.0429255841 OC(=C=C(O)N1CC(Cl)C(O)NC1O)C#C[OH2+] Intermediate Fragment 
168 195.0530963441 C=C([OH2+])N1CC(Cl)C(O)NC1O
169 193.0374462801 C=C([OH2+])N1C=C(Cl)C(O)NC1O
170 186.9904960881 [CH+]=C(O)N1C=C(Cl)C(=O)N=C1O
171 186.9904960881 C=C([OH2+])N=C=C(Cl)C(=O)N=C=O Intermediate Fragment 
172 186.9904960881 [CH+]=C(O)N(C=CCl)C(=O)N=C=O Intermediate Fragment 
173 68.9971056921 [O+]#CC#CO
174 179.0217962161 OC1NC(O)N(C=[OH+])C=C1Cl
175 172.9748460241 O=C1N=C(O)N(C#[O+])C=C1Cl
176 172.9748460241 O=C=NC(=O)C(Cl)=CN=C=[OH+] Intermediate Fragment 
177 172.9748460241 O=C=NC(=O)N(C#[O+])C=CCl Intermediate Fragment 
178 129.9690323721 O=CN(C#[O+])C#CCl
179 69.0334912001 C#CC(=C)[OH2+]
180 69.0334912001 C#CC=C[OH2+]
181 91.0753560121 CC(O)CC[OH2+]
182 73.0647913281 C=C([OH2+])CC
183 221.0323609001 OC#CC(=[OH+])N1CC(Cl)C(O)NC1O
184 219.0167108361 OC#CC(=[OH+])N1C=C(Cl)C(O)NC1O
185 201.0061461521 C#CC(=[OH+])N1C=C(Cl)C(=O)NC1O
186 219.0167108361 OC#CC(=[OH+])N=C=C(Cl)C(O)NCO Intermediate Fragment 
187 219.0167108361 NC(O)N(C=C(Cl)C=O)C(=[OH+])C#CO Intermediate Fragment 
188 219.0167108361 O=CNC(O)N(C=CCl)C(=[OH+])C#CO Intermediate Fragment 
189 217.0010607721 O=C1NC(O)N(C(=[OH+])C#CO)C=C1Cl
190 198.9904960881 C#CC(=[OH+])N1C=C(Cl)C(=O)N=C1O
191 217.0010607721 O=C(NCO)C(Cl)=C=NC(=[OH+])C#CO Intermediate Fragment 
192 217.0010607721 N=C(O)N(C=C(Cl)C=O)C(=[OH+])C#CO Intermediate Fragment 
193 263.0429255841 OC=C=C(OC#C[OH2+])N1CC(Cl)C(O)NC1O Intermediate Fragment 
194 233.0323609001 C=C([OH+]C#CO)N1C=C(Cl)C(O)NC1O
195 263.0429255841 CN(C(O)NC(O)=CCl)C1C=C(O)C(=C=[OH+])O1 Intermediate Fragment 
196 170.0447841561 C[NH+](C=O)C1C=C(O)C(=C=O)O1
197 142.0498695361 C[NH2+]C1C=C(O)C(=C=O)O1
198 144.0655196001 C[NH2+]C1C=C(O)C(=CO)O1
199 144.0655196001 C[NH2+]C=C=C(O)C(=O)CO Intermediate Fragment 
200 114.0549549161 C=[NH+]C1=CC(O)CO1
201 142.0498695361 C[NH2+]C=C=C(O)C(=O)C=O Intermediate Fragment 
202 263.0429255841 OCNC(O)N(C=CCl)C1C=C(O)C(=C=[OH+])O1 Intermediate Fragment 
203 235.0480109641 NC(O)[NH+](CCCl)C1C=C(O)C(=C=O)O1
204 233.0323609001 NC(O)[NH+](C=CCl)C1C=C(O)C(=C=O)O1
205 218.0214618681 O=C=C1OC([NH+](C=CCl)CO)C=C1O
206 192.0421973121 OC=C1OC([NH2+]CCCl)C=C1O
207 174.0316326281 C=C1OC(=[NH+]CCCl)C=C1O
208 128.0342194721 [NH3+]C1C=C(O)C(=C=O)O1
209 130.0498695361 [NH3+]C1C=C(O)C(=CO)O1
210 132.0655196001 [NH3+]C1C=C(O)C(CO)O1
211 192.0421973121 C=C(O)C(=C=O)OC[NH2+]CCCl Intermediate Fragment 
212 105.0546205681 C=C(O)C([OH2+])CO
213 192.0421973121 O=C(CO)C(O)=C=C[NH2+]CCCl Intermediate Fragment 
214 102.0105032601 C#C[NH+]=CCCl
215 99.9948531961 C#C[NH+]=C=CCl
216 192.0421973121 OC=CC(O)=C=C(O)[NH2+]CCCl Intermediate Fragment 
217 120.0210679441 C=C(O)[NH+]=CCCl
218 174.0316326281 OC#CC(O)=C=C[NH2+]CCCl
219 146.0003325001 O=C(C#CO)[NH+]=CCCl
220 190.0265472481 O=C=C1OC([NH2+]CCCl)C=C1O
221 188.0108971841 O=C=C1OC(=[NH+]CCCl)C=C1O
222 263.0429255841 NC(O)N(C=C(Cl)CO)C1C=C(O)C(=C=[OH+])O1 Intermediate Fragment 
223 175.0713332521 NC(O)[NH2+]C1C=C(O)C(=CO)O1
224 183.0400331241 C=[N+](C(=N)O)C1C=C(O)C(=C=O)O1
225 185.0556831881 C[NH+](C(=N)O)C1C=C(O)C(=C=O)O1
226 140.0342194721 C[NH+]=C1C=C(O)C(=C=O)O1
227 187.0713332521 C[NH+](C(N)O)C1C=C(O)C(=C=O)O1
228 187.0713332521 C[NH+](C=C=C(O)C(=O)C=O)C(N)O Intermediate Fragment 
229 231.0167108361 NC(O)[NH+](C#CCl)C1C=C(O)C(=C=O)O1
230 220.0371119321 O=C=C1OC([NH2+]CC(Cl)CO)C=C1O
231 220.0371119321 OC#CC(O)=C=C(O)[NH2+]CC(Cl)CO Intermediate Fragment 
232 218.0214618681 O=C=C1OC(=[NH+]CC(Cl)CO)C=C1O
233 263.0429255841 NC(O)C(Cl)=CN(CO)C1C=C(O)C(=C=[OH+])O1 Intermediate Fragment 
234 235.0480109641 NC(O)C(Cl)C[NH2+]C1C=C(O)C(=C=O)O1
235 235.0480109641 NC(O)C(Cl)C[NH2+]C(O)=C=C(O)C#CO Intermediate Fragment 
236 263.0429255841 OCNC(O)C(Cl)CN=C1C=C(O)C(=C=[OH+])O1 Intermediate Fragment 
237 216.0058118041 O=C=C1OC(=[NH+]C=C(Cl)CO)C=C1O
238 216.0058118041 O=CC(=O)C(O)=C=C=[NH+]C=C(Cl)CO Intermediate Fragment 
239 231.0167108361 NC(O)C(Cl)=C[NH+]=C1C=C(O)C(=C=O)O1
240 233.0323609001 NC(O)C(Cl)C[NH+]=C1C=C(O)C(=C=O)O1
241 233.0323609001 NC(O)C(Cl)C[NH+]=C=C=C(O)C(=O)C=O Intermediate Fragment 
242 233.0323609001 NC(O)C(Cl)C=[NH+]C(O)=C=C(O)C#CO Intermediate Fragment 
243 263.0429255841 CC(Cl)C(O)NC(O)N=C1C=C(O)C(=C=[OH+])O1 Intermediate Fragment 
244 261.0272755201 OC1=CC(N2C=C(Cl)C(O)NC2O)OC1=C=[OH+]
