#In-silico ESI-MS/MS [M+H]+ Spectra
#PREDICTED BY CFM-ID 4.0.8
#SMILES=O1[C@H](CO)[C@@H](C[C@@H]1n1cc(c(=O)n(c1=O)CC1C(CCOC1O)O)C)O
#InChiKey=GKEHLHMGNPRHOQ-QJOYOCSASA-N
energy0
139.05020 35.36 34 (11.087)
239.10263 23.61 37 36 168 26 13 71 (4.0521 3.1181 0.13498 0.056365 0.038073 0.0030399)
257.11320 100.00 3 40 72 39 65 78 61 52 151 76 70 68 66 59 152 (29.472 1.0573 0.3507 0.11586 0.11405 0.091342 0.041234 0.034628 0.026064 0.016947 0.011894 0.010445 0.0082361 0.0063163 0.00075098)
355.14998 25.83 163 5 159 156 171 232 162 158 16 170 269 (6.1121 0.65119 0.54228 0.40595 0.19363 0.12143 0.031843 0.024513 0.0079837 0.0068607 0.0019516)
373.16054 73.63 0 270 242 172 234 278 256 275 241 266 254 239 264 265 255 262 263 253 (21.624 0.51234 0.51144 0.25559 0.070457 0.035681 0.022081 0.015802 0.013596 0.0081759 0.0043692 0.0040403 0.0036892 0.0030768 0.0020966 0.0011152 0.00043486 0.00041909)
energy1
43.01784 6.25 102 (1.1937)
45.03349 12.16 103 (2.3229)
57.03349 12.42 96 (2.372)
59.04914 5.79 111 (1.1056)
99.04406 32.12 107 9 100 (4.2479 1.4243 0.46169)
117.05462 9.63 33 115 101 97 108 112 114 (1.0542 0.30605 0.2009 0.18344 0.070751 0.017465 0.0060708)
125.03455 17.36 30 (3.3153)
139.05020 100.00 34 (19.096)
141.06585 55.64 25 (10.626)
229.11828 7.29 50 54 (1.232 0.15935)
239.10263 97.17 37 36 71 13 26 168 (13.049 5.1369 0.22219 0.092752 0.052445 0.0030703)
241.11828 8.32 160 157 154 (0.92137 0.66655 0.00028976)
257.11320 48.82 3 40 72 70 61 52 39 78 66 59 65 76 68 151 152 (7.7597 0.7331 0.18816 0.11015 0.1068 0.098829 0.091098 0.086573 0.052293 0.045235 0.022394 0.01858 0.0078356 0.0012703 0.00057103)
337.13941 5.62 14 161 15 169 (0.63405 0.28854 0.10343 0.046865)
345.16563 5.57 259 260 273 4 (0.70119 0.29543 0.062702 0.0039757)
energy2
43.01784 20.44 102 (1.7249)
45.03349 36.30 103 (3.0629)
55.01784 20.76 206 (1.7513)
57.03349 61.23 96 (5.1657)
59.04914 47.32 111 (3.992)
71.04914 22.84 227 228 (1.3348 0.59178)
87.04406 10.32 139 90 105 (0.82248 0.041499 0.0064765)
101.05971 12.72 10 121 123 (0.53898 0.47375 0.060522)
111.04406 19.74 142 141 (1.5624 0.10332)
113.05971 21.12 132 131 135 (1.6511 0.101 0.02993)
115.07536 10.58 127 129 126 (0.77117 0.064915 0.056218)
125.03455 54.99 30 (4.6391)
127.05020 16.46 31 (1.3889)
131.07027 22.15 18 134 138 140 133 (1.2786 0.34747 0.19155 0.030117 0.02066)
137.03455 13.90 80 (1.1724)
139.05020 100.00 34 (8.4367)
141.06585 70.07 25 (5.9114)
143.08150 21.66 35 (1.8273)
146.08117 13.59 23 (1.1465)
155.04512 12.39 209 (1.0456)
169.06077 13.25 210 179 (0.5679 0.55028)
183.07642 20.46 180 75 (1.4383 0.28755)
212.09173 15.28 42 (1.2893)
239.10263 41.43 36 37 13 26 71 168 (1.756 0.77587 0.70433 0.11817 0.10393 0.037079)
241.08190 28.96 38 144 (2.2734 0.16981)
257.11320 61.56 3 40 52 78 72 59 61 70 66 39 76 68 65 152 151 (1.5092 1.2375 0.67447 0.34556 0.31864 0.2364 0.22745 0.14368 0.14189 0.094793 0.09395 0.09269 0.076503 0.00063996 2.7637e-05)
283.12885 24.12 185 182 183 (1.8465 0.14868 0.039325)
285.14450 48.17 240 (4.0638)
313.13941 14.91 237 (1.2578)
315.15506 9.96 238 (0.84024)

0 373.1605421801 Cc1cn(C2CC(O)C(C[OH2+])O2)c(=O)n(CC2C(O)CCOC2O)c1=O
1 341.1343274321 CC1=CN(C2=CC(O)=CO2)C(O)N(CC2C(O)CCOC2O)C1=[OH+]
2 343.1499774961 CC1=CN(C2=CC(O)=CO2)C(O)N(CC2C(O)CCOC2O)C1[OH2+]
3 257.1131980641 CC1=C([OH2+])N(CC2C(O)CCOC2O)C(=O)N=C1
4 345.1656275601 CC1CN(C2=CC(O)=CO2)C(O)N(CC2C(O)CCOC2O)C1[OH2+]
5 355.1499774961 C=C1OC(N2C=C(C)C(=[OH+])N(CC3C(O)CCOC3O)C2O)C=C1O
6 259.1288481281 CC1=C([OH2+])N(CC2C(O)CCOC2O)C(O)N=C1
7 255.0975480001 CC1=C([OH2+])N(C=C2C(O)CCOC2O)C(=O)N=C1
8 253.0818979361 CC1=C([OH2+])N(C=C2C(O)=CCOC2O)C(=O)N=C1
9 99.0440558841 C=C1OC=CC1[OH2+]
10 101.0597059481 C=C1OCCC1[OH2+]
11 225.0869833161 C=C1OC(N2C=C(C)C(=[OH+])NC2O)C=C1O
12 237.0869833161 C=C1OC(N2C=C(C)C(=[OH+])N(C)C2=O)C=C1O
13 239.1026333801 C=C1OC(N2C=C(C)C(=[OH+])N(C)C2O)C=C1O
14 337.1394128121 C=C1OC(N2C=C(C)C(=[OH+])N(CC3CCCOC3O)C2=O)C=C1O
15 337.1394128121 C=C1C=CC(N2C=C(C)C(=[OH+])N(CC3C(O)CCOC3O)C2=O)O1
16 355.1499774961 CC(=O)C(O)=C=CN1C=C(C)C(=[OH+])N(CC2C(O)CCOC2O)C1O Intermediate Fragment 
17 263.1601482561 CC1CNC(O)N(CC2C(O)CCOC2O)C1[OH2+]
18 131.0702706321 C=C1C(O)CCOC1[OH2+]
19 145.0971540761 CC1C=NC(O)N(C)C1[OH2+]
20 147.1128041401 CC1CNC(O)N(C)C1[OH2+]
21 245.1495835721 CC1C=NC(O)N(CC2CCCOC2O)C1[OH2+]
22 263.1601482561 CC(C=NC(O)NCC1C(O)CCOC1O)C[OH2+] Intermediate Fragment 
23 146.0811696641 [NH2+]=CC1C(O)CCOC1O
24 261.1444981921 CC1C=NC(O)N(CC2C(O)CCOC2O)C1[OH2+]
25 141.0658539481 CC1=C([OH2+])N(C)C(=O)N=C1
26 239.1026333801 CC1=CN(C=C2C(O)CCOC2O)C(=[OH+])N=C1
27 129.0546205681 C=C1C(O)=CCOC1[OH2+]
28 127.0389705041 C=C1C(=[OH+])OCC=C1O
29 125.0233204401 [CH+]=C1C(=O)OCC=C1O
30 125.0345538201 [CH2+]C1=C(O)N=C(O)N=C1
31 127.0502038841 CC1=C([OH2+])N=C(O)N=C1
32 129.0658539481 CC1=C([OH2+])NC(O)N=C1
33 117.0546205681 OC1=CC([OH2+])OCC1
34 139.0502038841 [CH2+]N1C(=O)N=CC(C)=C1O
35 143.0815040121 CC1=C([OH2+])N(C)C(O)N=C1
36 239.1026333801 CC1=C([OH2+])N(C=C2COCCC2O)C(=O)N=C1
37 239.1026333801 CC1=C([OH2+])N(C=C2CCCOC2O)C(=O)N=C1
38 241.0818979361 O=C1N=CC=C([OH2+])N1C=C1C(O)CCOC1O
39 257.1131980641 CC(=C=N)C(=[OH+])N(C=O)CC1C(O)CCOC1O Intermediate Fragment 
40 257.1131980641 CC(=C=NC=O)C(=[OH+])NCC1C(O)CCOC1O Intermediate Fragment 
41 214.1073844121 C=C(C)C(=O)[NH+]=CC1C(O)CCOC1O
42 212.0917343481 C=C(C)C(=O)[NH+]=C=C1C(O)CCOC1O
43 210.0760842841 C=C(C)C(=O)[NH+]=C=C1C(O)=CCOC1O
44 202.1073844121 CC=C(O)[NH+]=CC1C(O)CCOC1O
45 200.0917343481 CC=C(O)[NH+]=C=C1C(O)CCOC1O
46 196.0604342201 CC=C(O)[NH+]=C=C1C(=O)OCC=C1O
47 148.0968197281 [NH3+]CC1C(O)CCOC1O
48 112.0393048521 CC(=C=[NH+]C=O)C=O
49 118.0862550441 CC(C=[NH+]CO)CO
50 229.1182834441 CC(C#[NH+])=C(O)NCC1C(O)CCOC1O
51 255.0975480001 CC(=C=[NH+]C=O)C(=O)N=CC1C(O)CCOC1O
52 257.1131980641 CC(=C=NC(O)=NCC1C(O)CCOC1O)C=[OH+] Intermediate Fragment 
53 227.1026333801 CC=C=[NH+]C(O)=NC=C1C(O)CCOC1O
54 229.1182834441 CC=C=[NH+]C(O)=NCC1C(O)CCOC1O
55 84.0443902321 CC(C#[NH+])=CO
56 172.0604342201 O=C=[NH+]C=C1C(O)CCOC1O
57 174.0760842841 O=C=[NH+]CC1C(O)CCOC1O
58 255.0975480001 CC(=C=[NH+]C(O)=NC=C1C(O)CCOC1O)C=O
59 257.1131980641 CC=C=NC(=O)N(C=[OH+])CC1C(O)CCOC1O Intermediate Fragment 
60 200.0553488401 O=C[NH+](C=O)C=C1C(O)=CCOC1O
61 257.1131980641 C=NC(=O)N(C=C1C(O)CCOC1O)C([OH2+])=CC Intermediate Fragment 
62 203.1026333801 C=[NH+]C(O)=NCC1C(O)CCOC1O
63 201.0869833161 C=[NH+]C(O)=NC=C1C(O)CCOC1O
64 199.0713332521 C=[NH+]C(O)=NC=C1C(O)=CCOC1O
65 257.1131980641 C=C(C)C(=[OH+])N(C=C1C(O)CCOC1O)C(N)=O Intermediate Fragment 
66 257.1131980641 CCOC(O)C(=CN1C(=O)N=CC(C)=C1[OH2+])CO Intermediate Fragment 
67 211.0713332521 CC1=C([OH2+])N(C=C(C=O)CO)C(=O)N=C1
68 257.1131980641 COC(O)C(=CN1C(=O)N=CC(C)=C1[OH2+])C(C)O Intermediate Fragment 
69 225.0869833161 C=C(O)C(=CN1C(=O)N=CC(C)=C1[OH2+])CO
70 257.1131980641 CCC(O)C(=CN1C(=O)N=CC(C)=C1[OH2+])C(O)O Intermediate Fragment 
71 239.1026333801 CC=C(O)C(=CN1C(=O)N=CC(C)=C1[OH2+])CO
72 257.1131980641 CC1=C([OH2+])N(C=C(CO)C(O)CCO)C(=O)N=C1 Intermediate Fragment 
73 77.0597059481 OCCC[OH2+]
74 181.0607685681 CC1=C([OH2+])N(C#CCO)C(=O)N=C1
75 183.0764186321 CC1=C([OH2+])N(C=CCO)C(=O)N=C1
76 257.1131980641 CC1=C([OH2+])N(C=CC(O)CCOCO)C(=O)N=C1 Intermediate Fragment 
77 227.1026333801 CC1=C([OH2+])N(C=CC(O)CCO)C(=O)N=C1
78 257.1131980641 CC1=C([OH2+])N(C=CC(O)OCCCO)C(=O)N=C1 Intermediate Fragment 
79 153.0658539481 C=CN1C(=O)N=CC(C)=C1[OH2+]
80 137.0345538201 C=C1C=NC(=O)N([CH2+])C1=O
81 237.0869833161 CC1=C([OH2+])N(C=C2C=CCOC2O)C(=O)N=C1
82 255.0975480001 CC(=C=N)C(=[OH+])N(C=O)C=C1C(O)CCOC1O Intermediate Fragment 
83 228.0866489681 CC=C(O)[NH+](C=O)C=C1C(O)=CCOC1O
84 255.0975480001 CC=C(O)C(=CN1C(=O)N=CC(C)=C1[OH2+])C(O)O Intermediate Fragment 
85 237.0869833161 C=C=C(O)C(=CN1C(=O)N=CC(C)=C1[OH2+])CO
86 111.0076703761 O=C1C=COC1=C=[OH+]
87 113.0233204401 OC1C=COC1=C=[OH+]
88 113.0233204401 C=C=C(O)C(=O)C=[OH+] Intermediate Fragment 
89 115.0389705041 OC1CCOC1=C=[OH+]
90 87.0440558841 [OH2+]C1=COCC1
91 97.0284058201 [CH+]=C1OCC=C1O
92 97.0284058201 [OH+]=C=C1C=CCO1
93 115.0389705041 OCC=C(O)C#C[OH2+] Intermediate Fragment 
94 115.0389705041 CC=C(O)C(=O)C=[OH+] Intermediate Fragment 
95 97.0284058201 C=C=C(O)C#C[OH2+]
96 57.0334912001 C=C=C[OH2+]
97 117.0546205681 OC1CCOC1=C[OH2+]
98 85.0284058201 [OH2+]C1=COC=C1
99 89.0597059481 [OH2+]C1CCOC1
100 99.0440558841 [OH+]=C=C1CCCO1
101 117.0546205681 OCCC(O)C#C[OH2+] Intermediate Fragment 
102 43.0178411361 C#C[OH2+]
103 45.0334912001 C=C[OH2+]
104 47.0491412641 CC[OH2+]
105 87.0440558841 CC(O)C#C[OH2+]
106 89.0597059481 CC(O)C=C[OH2+]
107 99.0440558841 CC=C(O)C#C[OH2+]
108 117.0546205681 OCCCOC#C[OH2+] Intermediate Fragment 
109 73.0284058201 OC#CC[OH2+]
110 75.0440558841 OC=CC[OH2+]
111 59.0491412641 CC=C[OH2+]
112 117.0546205681 CCOC(=C=[OH+])CO Intermediate Fragment 
113 91.0389705041 OCC(=[OH+])CO
114 117.0546205681 COC(=C=[OH+])C(C)O Intermediate Fragment 
115 117.0546205681 CCC(O)C(=O)C=[OH+] Intermediate Fragment 
116 61.0647913281 CCC[OH2+]
117 59.0127557561 OC=C=[OH+]
118 61.0284058201 OCC=[OH+]
119 29.0385765801 C=[CH3+]
120 119.0702706321 OC1CCOC1C[OH2+]
121 101.0597059481 [OH2+]C=C1CCCO1
122 119.0702706321 OCCC(O)C=C[OH2+] Intermediate Fragment 
123 101.0597059481 CCC(O)C#C[OH2+]
124 119.0702706321 OCCCOC=C[OH2+] Intermediate Fragment 
125 133.0859206961 CC1C(O)CCOC1[OH2+]
126 115.0753560121 C=C1COCCC1[OH2+]
127 115.0753560121 C=C1CCCOC1[OH2+]
128 133.0859206961 C=C(C[OH2+])C(O)CCO Intermediate Fragment 
129 115.0753560121 C=C(C[OH2+])C(O)=CC
130 133.0859206961 C=C(C(O)[OH2+])C(O)CC Intermediate Fragment 
131 113.0597059481 C=C1COCC=C1[OH2+]
132 113.0597059481 C=C1C=CCOC1[OH2+]
133 131.0702706321 C=C(C[OH2+])C(O)=CCO Intermediate Fragment 
134 131.0702706321 C=C(C(O)=CC)C(O)[OH2+] Intermediate Fragment 
135 113.0597059481 C=C=C(O)C(=C)C[OH2+]
136 85.0647913281 C#CC([OH2+])CC
137 83.0491412641 C#CC([OH2+])=CC
138 131.0702706321 C=COC([OH2+])C(=C)CO Intermediate Fragment 
139 87.0440558841 C=C(C=[OH+])CO
140 131.0702706321 C#CC([OH2+])OCCCO Intermediate Fragment 
141 111.0440558841 [CH+]=C1COCC=C1O
142 111.0440558841 C=C1C=CCOC1=[OH+]
143 129.0546205681 C=COC(=[OH+])C(=C)CO Intermediate Fragment 
144 241.0818979361 CC1=CN(C2C=C(O)C(=C=[OH+])O2)C(O)NC1O
145 243.0975480001 CC1CN(C2C=C(O)C(=C=[OH+])O2)C(O)NC1O
146 243.0975480001 CC1CN(C(O)=C=C(O)C#C[OH2+])C(O)NC1O Intermediate Fragment 
147 245.1131980641 CC1CN(C2CC(O)C(=C=[OH+])O2)C(O)NC1O
148 247.1288481281 CC1CN(C2CC(O)C(=C[OH2+])O2)C(O)NC1O
149 255.0975480001 CC1=CN(C2C=C(O)C(=C=[OH+])O2)C(O)N(C)C1O
150 255.0975480001 CC1=CN(C=C=C(O)C(=O)C=[OH+])C(O)N(C)C1O Intermediate Fragment 
151 257.1131980641 CC1CN(C2C=C(O)C(=C=[OH+])O2)C(O)N(C)C1O
152 257.1131980641 CC1CN(C(O)=C=C(O)C#C[OH2+])C(O)N(C)C1O Intermediate Fragment 
153 259.1288481281 CC1CN(C2CC(O)C(=C=[OH+])O2)C(O)N(C)C1O
154 241.1182834441 C=C1OC(N2C=C(C)C([OH2+])N(C)C2O)C=C1O
155 261.1444981921 CC1CN(C2CC(O)C(=C[OH2+])O2)C(O)N(C)C1O
156 355.1499774961 CC1=CN(C2C=C(O)C(=C=[OH+])O2)C(O)N(CC2COCCC2O)C1O
157 241.1182834441 CC1=C([OH2+])N(CC2COCCC2O)C(=O)N=C1
158 355.1499774961 CC1=CN(C=C=C(O)C(=O)C=[OH+])C(O)N(CC2COCCC2O)C1O Intermediate Fragment 
159 355.1499774961 CC1=CN(C2C=C(O)C(=C=[OH+])O2)C(O)N(CC2CCCOC2O)C1O
160 241.1182834441 CC1=C([OH2+])N(CC2CCCOC2O)C(=O)N=C1
161 337.1394128121 CC1=CN(C2C=C(O)C(=C=[OH+])O2)C(O)N(CC2CCCOC2)C1=O
162 355.1499774961 CC1=CN(C=C=C(O)C(=O)C=[OH+])C(O)N(CC2CCCOC2O)C1O Intermediate Fragment 
163 355.1499774961 CC1=CN(C2C=CC(=C=[OH+])O2)C(O)N(CC2C(O)CCOC2O)C1O
164 323.1237627481 CC1=CN(C2=CC=CO2)C(=O)N(CC2C(O)CCOC2O)C1=[OH+]
165 325.1394128121 CC1=CN(C2=CC=CO2)C(O)N(CC2C(O)CCOC2O)C1=[OH+]
166 327.1550628761 CC1=CN(C2=CC=CO2)C(O)N(CC2C(O)CCOC2O)C1[OH2+]
167 237.0869833161 CC1=CN(C2C=CC(=C=[OH+])O2)C(O)N(C)C1=O
168 239.1026333801 CC1=CN(C2C=CC(=C=[OH+])O2)C(O)N(C)C1O
169 337.1394128121 CC1=CN(C2C=CC(=C=[OH+])O2)C(O)N(CC2CCCOC2O)C1=O
170 355.1499774961 C=C(OC(C)=C=[OH+])N1C=C(C)C(=O)N(CC2C(O)CCOC2O)C1O Intermediate Fragment 
171 355.1499774961 CC1=CN(C=C=CC(=O)C=[OH+])C(O)N(CC2C(O)CCOC2O)C1O Intermediate Fragment 
172 373.1605421801 CC1CN(C(O)=C=C(O)C#C[OH2+])C(O)N(CC2C(O)CCOC2O)C1O Intermediate Fragment 
173 331.1499774961 CC1=CN(C([OH2+])C#CO)C(O)N(CC2C(O)CCOC2O)C1O
174 329.1343274321 CC1=CN(C([OH2+])C#CO)C(O)N(CC2C(O)CCOC2O)C1=O
175 327.1186773681 CC1=CN(C([OH2+])C#CO)C(=O)N(CC2C(O)CCOC2O)C1=O
176 305.1707129401 C=C([OH2+])N1CC(C)C(O)N(CC2C(O)CCOC2O)C1O
177 303.1550628761 C=C([OH2+])N1C=C(C)C(O)N(CC2C(O)CCOC2O)C1O
178 301.1394128121 C=C([OH2+])N1C=C(C)C(=O)N(CC2C(O)CCOC2O)C1O
179 169.0607685681 C=C([OH2+])N1C=C(C)C(=O)N=C1O
180 183.0764186321 C=C([OH2+])N1C=C(C)C(=O)N(C)C1=O
181 185.0920686961 C=C([OH2+])N1C=C(C)C(=O)N(C)C1O
182 283.1288481281 C=C([OH2+])N1C=C(C)C(=O)N(CC2COCCC2O)C1=O
183 283.1288481281 C=C([OH2+])N1C=C(C)C(=O)N(CC2CCCOC2O)C1=O
184 285.1081126841 C=C([OH2+])N1C=CC(=O)N(CC2C(O)CCOC2O)C1=O
185 283.1288481281 C#CN1C=C(C)C(=[OH+])N(CC2C(O)CCOC2O)C1O
186 301.1394128121 C=C([OH2+])N=C=C(C)C(=O)N(CO)CC1C(O)CCOC1O Intermediate Fragment 
187 301.1394128121 C=C([OH2+])N(C=O)C=C(C)C(=O)NCC1C(O)CCOC1O Intermediate Fragment 
188 271.1288481281 C=C(O)[NH+]=C=C(C)C(=O)NCC1C(O)CCOC1O
189 301.1394128121 C=C([OH2+])N(C=C(C)C=O)C(O)=NCC1C(O)CCOC1O Intermediate Fragment 
190 301.1394128121 C=C([OH2+])N(C=CC)C(=O)N(C=O)CC1C(O)CCOC1O Intermediate Fragment 
191 301.1394128121 C=C([OH2+])N1C=C(C)C(=O)N(CC(CO)C(O)CCO)C1=O Intermediate Fragment 
192 301.1394128121 C=C([OH2+])N1C=C(C)C(=O)N(CCC(O)OCCCO)C1=O Intermediate Fragment 
193 299.1237627481 C=C([OH2+])N1C=C(C)C(=O)N(CC2C(O)CCOC2O)C1=O
194 181.0607685681 [CH+]=C(O)N1C=C(C)C(=O)N(C)C1=O
195 281.1131980641 C=C([OH2+])N1C=C(C)C(=O)N(C=C2COCCC2O)C1=O
196 281.1131980641 C=C([OH2+])N1C=C(C)C(=O)N(C=C2CCCOC2O)C1=O
197 281.1131980641 C#CN1C=C(C)C(=[OH+])N(CC2C(O)CCOC2O)C1=O
198 299.1237627481 C=C([OH2+])N=C=C(C)C(=O)N(C=O)CC1C(O)CCOC1O Intermediate Fragment 
199 299.1237627481 C=C([OH2+])N(C=O)C=C(C)C(=O)N=CC1C(O)CCOC1O Intermediate Fragment 
200 269.1131980641 C=C(O)[NH+]=C=C(C)C(=O)N=CC1C(O)CCOC1O
201 299.1237627481 C=C([OH2+])N(C=CC)C(=O)N(C=O)C=C1C(O)CCOC1O Intermediate Fragment 
202 299.1237627481 C=C([OH2+])N1C=C(C)C(=O)N(C=CC(O)OCCCO)C1=O Intermediate Fragment 
203 297.1081126841 C=C([OH2+])N1C=C(C)C(=O)N(C=C2C(O)CCOC2O)C1=O
204 68.9971056921 [O+]#CC#CO
205 71.0127557561 O=CC#C[OH2+]
206 55.0178411361 C#CC=[OH+]
207 289.1394128121 CC1=CN(C[OH2+])C(O)N(CC2C(O)CCOC2O)C1=O
208 287.1237627481 CC1=CN(C[OH2+])C(=O)N(CC2C(O)CCOC2O)C1=O
209 155.0451185041 CC1=CN(C=[OH+])C(O)=NC1=O
210 169.0607685681 CC1=CN(C=[OH+])C(=O)N(C)C1=O
211 269.1131980641 CC1=CN(C)C(=O)N(C=C2C(O)CCOC2O)C1=[OH+]
212 287.1237627481 CC(=CN=C[OH2+])C(=O)N(C=O)CC1C(O)CCOC1O Intermediate Fragment 
213 285.1081126841 CC1=CN(C[OH2+])C(=O)N(C=C2C(O)CCOC2O)C1=O
214 167.0451185041 CC1=CN(C#[O+])C(=O)N(C)C1=O
215 267.0975480001 CC1=CN(C[OH2+])C(=O)N(C=C2COCC=C2O)C1=O
216 267.0975480001 CC1=CN(C)C(=O)N(C=C2C(O)=CCOC2O)C1=[OH+]
217 285.1081126841 CC(=CN=C[OH2+])C(=O)N(C=O)C=C1C(O)CCOC1O Intermediate Fragment 
218 285.1081126841 CC(=CN(C=O)C[OH2+])C(=O)N=C=C1C(O)CCOC1O Intermediate Fragment 
219 285.1081126841 CC=CN(C[OH2+])C(=O)N(C=O)C=C1C(O)=CCOC1O Intermediate Fragment 
220 285.1081126841 CC=C(O)C(=CN1C(=O)C(C)=CN(C[OH2+])C1=O)C(O)O Intermediate Fragment 
221 285.1081126841 CC1=CN(C[OH2+])C(=O)N(C#CC(O)OCCCO)C1=O Intermediate Fragment 
222 283.0924626201 CC1=CN(C[OH2+])C(=O)N(C=C2C(O)=CCOC2O)C1=O
223 265.0818979361 CC1=CN(C)C(=O)N(C=C2C(=O)OCC=C2O)C1=[OH+]
224 283.0924626201 C=C=C(O)C(=CN1C(=O)C(C)=CN(C[OH2+])C1=O)C(O)O Intermediate Fragment 
225 69.0334912001 C#CC(=C)[OH2+]
226 69.0334912001 C=CC#C[OH2+]
227 71.0491412641 C#CC(C)[OH2+]
228 71.0491412641 CCC#C[OH2+]
229 91.0753560121 CC(O)CC[OH2+]
230 73.0647913281 C=CC(C)[OH2+]
231 73.0647913281 CCC=C[OH2+]
232 355.1499774961 CC1=CN(C=C=C(O)C#C[OH2+])C(O)N(CC2C(O)CCOC2O)C1O
233 371.1448921161 CC1=CN(C([OH2+])=C=C(O)C#CO)C(O)N(CC2C(O)CCOC2O)C1O
234 373.1605421801 CC1CN(C(=C=CO)OC#C[OH2+])C(O)N(CC2C(O)CCOC2O)C1O Intermediate Fragment 
235 343.1499774961 C=C([OH+]C#CO)N1C=C(C)C(O)N(CC2C(O)CCOC2O)C1O
236 311.1237627481 CC1=CN(CC#CO)C(=O)N(CC2C(O)CCOC2O)C1=[OH+]
237 313.1394128121 CC1=CN(CC#CO)C(O)N(CC2C(O)CCOC2O)C1=[OH+]
238 315.1550628761 CC1=CN(CC#CO)C(O)N(CC2C(O)CCOC2O)C1[OH2+]
239 373.1605421801 C=C(OC(=C=[OH+])CO)N1C=C(C)C(O)N(CC2C(O)CCOC2O)C1O Intermediate Fragment 
240 285.1444981921 C#CN1C=C(C)C([OH2+])N(CC2C(O)CCOC2O)C1O
241 373.1605421801 C=C(O)C(=C=[OH+])OCN1C=C(C)C(O)N(CC2C(O)CCOC2O)C1O Intermediate Fragment 
242 373.1605421801 CC1CN(C=C=C(O)C(=O)C=[OH+])C(O)N(CC2C(O)CCOC2O)C1O Intermediate Fragment 
243 317.1707129401 CC1CN(CC#CO)C(O)N(CC2C(O)CCOC2O)C1[OH2+]
244 63.0440558841 OCC[OH2+]
245 289.1757983201 C=CN1CC(C)C([OH2+])N(CC2C(O)CCOC2O)C1O
246 287.1601482561 C#CN1CC(C)C([OH2+])N(CC2C(O)CCOC2O)C1O
247 89.0233204401 O=CC(=[OH+])CO
248 93.0546205681 OCC([OH2+])CO
249 75.0440558841 CC(=[OH+])CO
250 271.1288481281 CC1=CN(C)C(=O)N(CC2C(O)CCOC2O)C1=[OH+]
251 105.0546205681 CC(O)C(=[OH+])CO
252 371.1448921161 CC1=CN(C=C=C(O)C(=[OH+])C=O)C(O)N(CC2C(O)CCOC2O)C1O
253 373.1605421801 CC=C(O)N(CC1C(O)CCOC1O)C(O)N(C)C1C=C(O)C(=C=[OH+])O1 Intermediate Fragment 
254 373.1605421801 CC=CN(C1C=C(O)C(=C=[OH+])O1)C(O)N(CO)CC1C(O)CCOC1O Intermediate Fragment 
255 373.1605421801 CC(=CN(C(O)NCC1C(O)CCOC1O)C1C=C(O)C(=C=[OH+])O1)CO Intermediate Fragment 
256 373.1605421801 CC(=CN(CO)C1C=C(O)C(=C=[OH+])O1)C(O)NCC1C(O)CCOC1O Intermediate Fragment 
257 198.0760842841 CC=C[NH+](CO)C1C=C(O)C(=C=O)O1
258 200.0917343481 CCC[NH+](CO)C1C=C(O)C(=C=O)O1
259 345.1656275601 CC(C[NH2+]C1C=C(O)C(=C=O)O1)C(O)NCC1C(O)CCOC1O
260 345.1656275601 CC(C[NH2+]C(O)=C=C(O)C#CO)C(O)NCC1C(O)CCOC1O Intermediate Fragment 
261 343.1499774961 CC(C[NH+]=C1C=C(O)C(=C=O)O1)C(O)NCC1C(O)CCOC1O
262 373.1605421801 CC(CN=C1C=C(O)C(=C=[OH+])O1)C(O)N(CO)CC1C(O)CCOC1O Intermediate Fragment 
263 373.1605421801 CC(C)C(O)N(CC1C(O)CCOC1O)C(O)N=C1C=C(O)C(=C=[OH+])O1 Intermediate Fragment 
264 373.1605421801 CCOC(O)C(CO)CN1C(O)C(C)=CN(C2C=C(O)C(=C=[OH+])O2)C1O Intermediate Fragment 
265 373.1605421801 COC(O)C(CN1C(O)C(C)=CN(C2C=C(O)C(=C=[OH+])O2)C1O)C(C)O Intermediate Fragment 
266 373.1605421801 CCC(O)C(CN1C(O)C(C)=CN(C2C=C(O)C(=C=[OH+])O2)C1O)C(O)O Intermediate Fragment 
267 313.1030273041 CC1=CN(C2C=C(O)C(=C=[OH+])O2)C(O)N(CCC(O)O)C1=O
268 315.1186773681 CC1=CN(C2C=C(O)C(=C=[OH+])O2)C(O)N(CCC(O)O)C1O
269 355.1499774961 CCC(O)C(CO)CN1C(=O)C(C)=CN(C2C=C(O)C(=C=[OH+])O2)C1O
270 373.1605421801 CC1=CN(C2C=C(O)C(=C=[OH+])O2)C(O)N(CC(CO)C(O)CCO)C1O Intermediate Fragment 
271 299.1237627481 CC1=CN(C2C=C(O)C(=C=[OH+])O2)C(O)N(CCCO)C1O
272 301.1394128121 CC1CN(C2C=C(O)C(=C=[OH+])O2)C(O)N(CCCO)C1O
273 345.1656275601 CC1CN(C2C=C(O)C(=C=[OH+])O2)C(O)N(CCC(O)CCO)C1O
274 343.1499774961 CC1=CN(C2C=C(O)C(=C=[OH+])O2)C(O)N(CCC(O)CCO)C1O
275 373.1605421801 CC1=CN(C2C=C(O)C(=C=[OH+])O2)C(O)N(CCC(O)CCOCO)C1O Intermediate Fragment 
276 105.0546205681 OC=CC[OH+]CO
277 325.1394128121 CCC(O)CCN1C(=O)C(C)=CN(C2C=C(O)C(=C=[OH+])O2)C1O
278 373.1605421801 CC1=CN(C2C=C(O)C(=C=[OH+])O2)C(O)N(CCC(O)OCCCO)C1O Intermediate Fragment 
279 317.1343274321 CC1CN(C2C=C(O)C(=C=[OH+])O2)C(O)N(CCC(O)O)C1O
280 43.0542266441 CC=[CH3+]
281 305.1707129401 CC1CN(C2CC(O)C(=C[OH2+])O2)C(O)N(CCCO)C1O
282 303.1550628761 CC1CN(C2CC(O)C(=C=[OH+])O2)C(O)N(CCCO)C1O
283 297.1081126841 CC1=CN(C2C=C(O)C(=C=[OH+])O2)C(O)N(CCCO)C1=O
284 269.1131980641 CCN1C(O)C(C)=CN(C2C=C(O)C(=C=[OH+])O2)C1O
285 267.0975480001 CCN1C(=O)C(C)=CN(C2C=C(O)C(=C=[OH+])O2)C1O
