#In-silico ESI-MS/MS [M+H]+ Spectra
#PREDICTED BY CFM-ID 4.0.8
#SMILES=O1[C@H](CO)[C@@H](C[C@@H]1n1ccc([n+](c1=O)CCC(=O)O)N)O
#InChiKey=ZKNYMPDXGBYPDD-NQMVMOMDSA-O
energy0
112.05054 6.30 29 (1.8869)
124.05054 24.48 36 140 (7.3283 5.0873e-05)
126.06619 9.35 30 (2.7996)
138.06619 6.04 40 (1.8073)
166.06110 6.68 81 (1.9993)
168.07675 38.49 42 32 139 (11.442 0.079132 0.0009513)
184.07167 41.71 2 84 53 93 101 99 100 (11.686 0.42486 0.18585 0.16888 0.017175 0.0031811 0.0010235)
186.08732 100.00 4 54 68 44 77 73 76 (25.643 1.5602 1.0669 0.85679 0.71121 0.089307 0.0098198)
282.10845 6.98 8 170 158 14 13 16 17 (0.59286 0.53378 0.46756 0.41443 0.054998 0.01606 0.010383)
300.11901 28.84 0 184 171 213 212 160 200 176 183 199 (7.4583 0.73863 0.16202 0.10428 0.091324 0.027968 0.022973 0.020605 0.006689 0.00041066)
energy1
73.02841 3.98 21 165 (1.2728 0.084663)
97.03964 4.95 65 (1.6881)
99.04406 4.08 120 11 116 (0.88576 0.42799 0.078959)
112.05054 13.96 29 (4.7636)
124.05054 100.00 36 140 (34.118 0.00090844)
126.06619 9.63 30 (3.2852)
129.06585 3.59 59 (1.2251)
138.06619 5.26 40 (1.796)
140.08184 4.30 41 (1.4683)
143.04512 3.06 70 46 (0.55875 0.4858)
168.07675 26.21 42 32 139 (8.6885 0.24049 0.014054)
169.06077 4.04 43 79 (1.1109 0.26642)
182.05602 9.57 9 106 104 105 107 108 (2.5477 0.27331 0.1703 0.15048 0.087108 0.034904)
184.07167 14.23 2 53 84 93 100 99 101 (4.0415 0.36574 0.26626 0.1306 0.025851 0.022531 0.0041855)
186.08732 18.79 4 68 76 44 73 54 77 (4.8157 0.70391 0.34491 0.23692 0.16286 0.11045 0.036201)
210.08732 3.14 15 179 (0.96245 0.10767)
240.09788 4.17 175 173 153 154 (1.1463 0.20122 0.062579 0.011082)
282.10845 4.47 170 158 8 14 13 16 17 (0.97892 0.2316 0.20432 0.039276 0.029218 0.023073 0.01789)
energy2
45.03349 8.55 118 (0.87606)
59.04914 10.02 126 (1.0265)
67.02907 7.83 49 (0.80201)
69.04472 9.18 50 (0.9408)
71.06037 34.40 26 (3.5257)
73.02841 37.29 21 165 (3.269 0.55262)
75.04406 25.12 20 166 (2.5609 0.01352)
88.03930 8.90 63 (0.91195)
90.05495 8.98 62 (0.92071)
95.02399 71.29 64 (7.3061)
97.03964 29.14 65 (2.9858)
99.04406 12.86 11 116 120 (0.9679 0.21211 0.13778)
99.05529 39.61 66 (4.0595)
101.05971 11.71 131 132 135 (0.59814 0.57636 0.025685)
112.05054 57.34 29 (5.8762)
114.06619 17.89 22 (1.8338)
124.05054 100.00 36 140 (9.7512 0.49661)
126.06619 44.95 30 (4.6062)
129.06585 14.90 59 (1.5267)
138.06619 29.49 40 (3.0226)
140.08184 8.83 41 (0.90443)
156.07675 19.52 51 145 (1.144 0.85626)
168.07675 39.85 42 139 32 (3.107 0.55499 0.42177)
169.06077 10.03 43 79 (0.7962 0.23195)
184.07167 65.48 84 93 2 53 100 99 101 (3.6163 1.1879 0.98899 0.38562 0.28381 0.12912 0.11857)
185.09207 14.38 210 (1.4732)
214.11862 16.84 181 (1.7253)
282.10845 28.31 170 158 17 8 16 13 14 (2.7121 0.18932 1.373e-05 1.2355e-05 8.4033e-06 6.7241e-06 5.5799e-06)

0 300.1190117161 NC1=[N+](CCC(=O)O)C(=O)N(C2CC(O)C(CO)O2)C=C1
1 268.0927969681 [NH3+]C1C=CN(C2=CC(O)=CO2)C(=O)N1C=CC(O)O
2 184.0716676001 [NH3+]C1=CC=NC(=O)N1C=CC(O)O
3 270.1084470321 [NH3+]C1C=CN(C2=CC(O)=CO2)C(=O)N1CCC(O)O
4 186.0873176641 [NH3+]C1=CC=NC(=O)N1CCC(O)O
5 270.1084470321 [NH3+]C(=C=CN(C=O)C1=CC(O)=CO1)NCCC(O)O Intermediate Fragment 
6 242.1135324121 NC(C=C=[NH+]C1=CC(O)=CO1)NCCC(O)O
7 272.1240970961 [NH3+]C1C=CN(C2=CC(O)=CO2)C(O)N1CCC(O)O
8 282.1084470321 C=C1OC(N2C=CC([NH3+])N(C=CC(O)O)C2=O)C=C1O
9 182.0560175361 [NH3+]C1=CC=NC(=O)N1C#CC(O)O
10 180.0403674721 [NH3+]C1=CC=NC(=O)N1C#CC(=O)O
11 99.0440558841 C=C1OC=CC1[OH2+]
12 264.0978823481 C=C1C=CC(N2C=CC([NH3+])N(C#CC(O)O)C2=O)O1
13 282.1084470321 C#COC(=C=CO)N1C=CC([NH3+])N(CCC(O)O)C1=O Intermediate Fragment 
14 282.1084470321 C=C(CO)OC(=C)N1C=CC([NH3+])N(C#CC(O)O)C1=O Intermediate Fragment 
15 210.0873176641 C#CN1C=CC([NH3+])N(C=CC(O)O)C1=O
16 282.1084470321 C=C1OC(N(C=O)C=C=C([NH3+])N=CCC(O)O)C=C1O Intermediate Fragment 
17 282.1084470321 C=C1OC(=NC=C=C([NH3+])N(C=O)CCC(O)O)C=C1O Intermediate Fragment 
18 190.1186177921 [NH3+]C1CC=NC(O)N1CCC(O)O
19 77.0597059481 CCC(O)[OH2+]
20 75.0440558841 C=CC(O)[OH2+]
21 73.0284058201 C#CC(O)[OH2+]
22 114.0661882961 [NH3+]C1=CC=NC(O)N1
23 128.0818383601 CN1C([NH3+])=CC=NC1O
24 130.0974884241 CN1C([NH3+])CC=NC1O
25 190.1186177921 [NH3+]CC=C=NC(O)NCCC(O)O Intermediate Fragment 
26 71.0603746441 [NH+]#CCCN
27 190.1186177921 C=NC(O)N(CCC(O)O)C(=C)[NH3+] Intermediate Fragment 
28 188.1029677281 [NH3+]C1=CC=NC(O)N1CCC(O)O
29 112.0505382321 [NH3+]C1=CC=NC(O)=N1
30 126.0661882961 CN1C(=O)N=CC=C1[NH3+]
31 188.1029677281 [NH3+]C=C=C=NC(O)NCCC(O)O Intermediate Fragment 
32 168.0767529801 [NH3+]C1=CC=NCN1C#CC(O)O
33 71.0127557561 C#CC(O)=[OH+]
34 116.0818383601 [NH3+]C1CC=NC(O)N1
35 61.0284058201 C=C(O)[OH2+]
36 124.0505382321 [CH2+]N1C(=O)N=CC=C1N
37 49.0284058201 OC[OH2+]
38 47.0127557561 OC=[OH+]
39 44.9971056921 O=C=[OH+]
40 138.0661882961 C=CN1C(=O)N=CC=C1[NH3+]
41 140.0818383601 CCN1C(=O)N=CC=C1[NH3+]
42 168.0767529801 [NH3+]C1=CC=NC(=O)N1C=CCO
43 169.0607685681 OC(O)C=CN1C=CC=NC1=[OH+]
44 186.0873176641 N=C=C=C([NH3+])N(C=O)CCC(O)O Intermediate Fragment 
45 159.0764186321 C=C(N)[NH+](C=O)C=CC(O)O
46 143.0451185041 NC[NH+](C#CC(=O)O)C=O
47 118.0498695361 O=C=[NH+]CCC(O)O
48 116.0342194721 O=C=[NH+]C=CC(O)O
49 67.0290745161 N=C=CC#[NH+]
50 69.0447245801 [NH+]#CC=CN
51 156.0767529801 [NH+]#CC=C(N)N=CCC(O)O
52 158.0924030441 [NH+]#CC=C(N)NCCC(O)O
53 184.0716676001 [NH+]#CC=C(N)N(C=O)C=CC(O)O
54 186.0873176641 [NH3+]C(=C=C=NC=O)NCCC(O)O Intermediate Fragment 
55 143.0815040121 C#CC(N)=[NH+]CCC(O)O
56 141.0658539481 C#CC(N)=[NH+]C=CC(O)O
57 139.0502038841 C#CC(N)=[NH+]C#CC(O)O
58 131.0815040121 C=C(N)[NH+]=CCC(O)O
59 129.0658539481 C=C(N)[NH+]=C=CC(O)O
60 115.0502038841 NC=[NH+]C#CC(O)O
61 70.0287401681 C#C[NH2+]C=O
62 90.0549549161 [NH2+]=CCC(O)O
63 88.0393048521 [NH+]#CCC(O)O
64 95.0239891361 N=C=C=C=[NH+]C=O
65 97.0396392001 NC=C=C=[NH+]C=O
66 99.0552892641 NC=C=C=[NH+]CO
67 101.0709393281 NCC=C=[NH+]CO
68 186.0873176641 [NH3+]C=C=C=NC(O)=NCCC(O)O Intermediate Fragment 
69 54.0338255481 C#CC=[NH2+]
70 143.0451185041 C=[NH+]C(O)=NC#CC(O)O
71 145.0607685681 C=[NH+]C(O)=NC=CC(O)O
72 75.0916747721 NCCC[NH3+]
73 186.0873176641 C=C=NC(=O)N(C=CC(O)O)C[NH3+] Intermediate Fragment 
74 117.0658539481 NC=[NH+]C=CC(O)O
75 119.0815040121 NC=[NH+]CCC(O)O
76 186.0873176641 C=NC(=O)N(C=CC(O)O)C(=C)[NH3+] Intermediate Fragment 
77 186.0873176641 C=C=C([NH3+])N(C=CC(O)O)C(N)=O Intermediate Fragment 
78 131.0451185041 [NH3+]C(=O)N=C=CC(O)O
79 169.0607685681 C#CC(N)[NH+](C#CC(O)O)C=O
80 136.0505382321 C#CN1C(=O)N=CC=C1[NH3+]
81 166.0611029161 [NH3+]C1=CC=NC(=O)N1C#CCO
82 167.0451185041 OC(O)C#CN1C=CC=NC1=[OH+]
83 157.0607685681 C=C(N)[NH+](C#CC(O)O)C=O
84 184.0716676001 [NH3+]C(=C=C=NC=O)N=CCC(O)O Intermediate Fragment 
85 137.0345538201 C#CC(N)=[NH+]C#CC(=O)O
86 127.0502038841 C=C(N)[NH+]=C=C=C(O)O
87 113.0345538201 N=C[NH+]=C=CC(=O)O
88 111.0189037561 N#C[NH+]=C=CC(=O)O
89 72.0443902321 C#C[NH2+]CO
90 92.0706049801 [NH3+]CCC(O)O
91 93.0083390721 N=C=C=C=NC#[O+]
92 154.0611029161 [NH+]#CC=C(N)N=C=CC(O)O
93 184.0716676001 [NH3+]C=C=C=NC(O)=NC=CC(O)O Intermediate Fragment 
94 56.0494756121 C#CC[NH3+]
95 141.0294684401 C=[NH+]C(O)=NC#CC(=O)O
96 157.0607685681 C=C=[NH+]C(O)=NC=CC(O)O
97 73.0760247081 NCCC=[NH2+]
98 114.0185694081 O=C=[NH+]C#CC(O)O
99 184.0716676001 C=C=NC(=O)N(C#CC(O)O)C[NH3+] Intermediate Fragment 
100 184.0716676001 C=NC(=O)N(C#CC(O)O)C(=C)[NH3+] Intermediate Fragment 
101 184.0716676001 C=C=C([NH3+])N(C#CC(O)O)C(N)=O Intermediate Fragment 
102 164.0454528521 [NH3+]C1=CC=NC(=O)N1C#CC=O
103 165.0294684401 O=C(O)C#CN1C=CC=NC1=[OH+]
104 182.0560175361 N=C=C=C([NH3+])N(C#CC(O)O)C=O Intermediate Fragment 
105 182.0560175361 [NH3+]C(=C=C=NC=O)N=C=CC(O)O Intermediate Fragment 
106 182.0560175361 [NH3+]C=C=C=NC(O)=NC#CC(O)O Intermediate Fragment 
107 182.0560175361 C=C=NC(=O)N(C#CC(=O)O)C[NH3+] Intermediate Fragment 
108 182.0560175361 C=NC(=O)N(C#CC(=O)O)C(=C)[NH3+] Intermediate Fragment 
109 155.0451185041 C=C(N)[NH+](C#CC(=O)O)C=O
110 113.0233204401 OC1C=COC1=C=[OH+]
111 115.0389705041 OC1CCOC1=C=[OH+]
112 87.0440558841 [OH2+]C1=COCC1
113 115.0389705041 CC=C(O)C(=O)C=[OH+] Intermediate Fragment 
114 117.0546205681 OC1CCOC1=C[OH2+]
115 89.0597059481 [OH2+]C1CCOC1
116 99.0440558841 [OH+]=C=C1CCCO1
117 117.0546205681 OCCC(O)C#C[OH2+] Intermediate Fragment 
118 45.0334912001 C=C[OH2+]
119 89.0597059481 CC(O)C=C[OH2+]
120 99.0440558841 CC=C(O)C#C[OH2+]
121 117.0546205681 OCCCOC#C[OH2+] Intermediate Fragment 
122 117.0546205681 CCOC(=C=[OH+])CO Intermediate Fragment 
123 91.0389705041 OCC(=[OH+])CO
124 117.0546205681 COC(=C=[OH+])C(C)O Intermediate Fragment 
125 117.0546205681 CCC(O)C(=O)C=[OH+] Intermediate Fragment 
126 59.0491412641 CC=C[OH2+]
127 57.0334912001 CC#C[OH2+]
128 61.0284058201 OCC=[OH+]
129 29.0385765801 C=[CH3+]
130 119.0702706321 OC1CCOC1C[OH2+]
131 101.0597059481 C=C1OCCC1[OH2+]
132 101.0597059481 [OH2+]C=C1CCCO1
133 119.0702706321 OCCC(O)C=C[OH2+] Intermediate Fragment 
134 87.0440558841 CC(O)C#C[OH2+]
135 101.0597059481 CCC(O)C#C[OH2+]
136 119.0702706321 OCCCOC=C[OH2+] Intermediate Fragment 
137 224.0665822201 [NH3+]C1=NC(O)N(C2C=C(O)C(=C=O)O2)C=C1
138 224.0665822201 [NH3+]C1=NC(O)N(C=C=C(O)C(=O)C=O)C=C1 Intermediate Fragment 
139 168.0767529801 [NH3+]C1=NC(O)N(C=C=CO)C=C1
140 124.0505382321 [CH2+]N1C=CC(N)=NC1=O
141 226.0822322841 [NH3+]C1C=CN(C2C=C(O)C(=C=O)O2)C(O)N1
142 226.0822322841 [NH3+]C1C=CN(C=C=C(O)C(=O)C=O)C(O)N1 Intermediate Fragment 
143 228.0978823481 [NH3+]C1CCN(C2C=C(O)C(=C=O)O2)C(O)N1
144 228.0978823481 [NH3+]C1CCN(C(O)=C=C(O)C#CO)C(O)N1 Intermediate Fragment 
145 156.0767529801 C=C(O)N1C=CC([NH3+])=NC1O
146 228.0978823481 [NH3+]C1CCN(C=C=C(O)C(=O)C=O)C(O)N1 Intermediate Fragment 
147 230.1135324121 [NH3+]C1CCN(C2CC(O)C(=C=O)O2)C(O)N1
148 212.1029677281 C=C1OC(N2C=CC([NH3+])NC2O)C=C1O
149 230.1135324121 [NH3+]C1CCN(C(O)C=C(O)C#CO)C(O)N1 Intermediate Fragment 
150 230.1135324121 [NH3+]C1CCN(CC=C(O)C(=O)C=O)C(O)N1 Intermediate Fragment 
151 238.0822322841 CN1C(=O)N(C2C=C(O)C(=C=O)O2)C=CC1[NH3+]
152 238.0822322841 CN1C(=O)N(C=C=C(O)C(=O)C=O)C=CC1[NH3+] Intermediate Fragment 
153 240.0978823481 CN1C([NH3+])C=CN(C2C=C(O)C(=C=O)O2)C1O
154 240.0978823481 CN1C([NH3+])C=CN(C=C=C(O)C(=O)C=O)C1O Intermediate Fragment 
155 252.0978823481 CCN1C(=O)N(C2C=C(O)C(=C=O)O2)C=CC1[NH3+]
156 254.1135324121 CCN1C([NH3+])C=CN(C2C=C(O)C(=C=O)O2)C1O
157 256.1291824761 CCN1C([NH3+])CCN(C2C=C(O)C(=C=O)O2)C1O
158 282.1084470321 [NH3+]C1C=CN(C2C=C(O)C(=C=O)O2)C(=O)N1CCCO
159 283.0924626201 O=C1N(CCC(O)O)CC=CN1C1C=C(O)C(=C=[OH+])O1
160 300.1190117161 [NH3+]C1C=CN(C(O)=C=C(O)C#CO)C(O)N1CCC(O)O Intermediate Fragment 
161 256.0927969681 [NH3+]C1C=CN(C(O)C#CO)C(=O)N1C=CC(O)O
162 228.0978823481 C=C(O)N1C=CC([NH3+])N(C=CC(O)O)C1=O
163 228.0978823481 C=C(O)N(C=O)C=C=C([NH3+])N=CCC(O)O Intermediate Fragment 
164 200.1029677281 C=C(O)[NH+]=C=C=C(N)NCCC(O)O
165 73.0284058201 OCC#C[OH2+]
166 75.0440558841 OCC=C[OH2+]
167 77.0597059481 OCCC[OH2+]
168 214.0822322841 [NH3+]C1C=CN(CO)C(=O)N1C#CC(O)O
169 212.0665822201 [NH3+]C1C=CN(CO)C(=O)N1C#CC(=O)O
170 282.1084470321 [NH3+]C1C=CN(C=C=C(O)C#CO)C(=O)N1CCC(O)O
171 300.1190117161 [NH3+]C1C=CN(C(=C=CO)OC#CO)C(O)N1CCC(O)O Intermediate Fragment 
172 258.1084470321 [NH3+]C1C=CN(C(O)C#CO)C(=O)N1CCC(O)O
173 240.0978823481 C#CC(O)N1C=CC([NH3+])N(C=CC(O)O)C1=O
174 272.1240970961 C=C(OC#CO)N1C=CC([NH3+])N(CCC(O)O)C1O
175 240.0978823481 [NH3+]C1C=CN(CC#CO)C(=O)N1C=CC(O)O
176 300.1190117161 C=C(OC(=C=O)CO)N1C=CC([NH3+])N(CCC(O)O)C1=O Intermediate Fragment 
177 226.0822322841 C=C(O)N1C=CC([NH3+])N(C#CC(O)O)C1=O
178 208.0716676001 C#CN1C=CC([NH3+])N(C#CC(O)O)C1=O
179 210.0873176641 C#CN=C=C=C([NH3+])N(C=O)CCC(O)O Intermediate Fragment 
180 212.1029677281 C#CN1C=CC([NH3+])N(CCC(O)O)C1=O
181 214.1186177921 C#CN1C=CC([NH3+])N(CCC(O)O)C1O
182 216.1342678561 C#CN1CCC([NH3+])N(CCC(O)O)C1O
183 300.1190117161 C=C(O)C(=C=O)OCN1C=CC([NH3+])N(CCC(O)O)C1=O Intermediate Fragment 
184 300.1190117161 [NH3+]C1C=CN(C=C=C(O)C(=O)C=O)C(O)N1CCC(O)O Intermediate Fragment 
185 244.1291824761 [NH3+]C1C=CN(CC#CO)C(O)N1CCC(O)O
186 242.1135324121 [NH3+]C1C=CN(CC#CO)C(=O)N1CCC(O)O
187 242.1135324121 [NH3+]C(=C=CN(C=O)CC#CO)NCCC(O)O Intermediate Fragment 
188 238.0822322841 [NH3+]C1C=CN(CC#CO)C(=O)N1C#CC(O)O
189 59.0127557561 O=C=C[OH2+]
190 41.0021910721 [CH+]=C=O
191 43.0178411361 C=C=[OH+]
192 63.0440558841 OCC[OH2+]
193 89.0233204401 O=CC(=[OH+])CO
194 93.0546205681 OCC([OH2+])CO
195 202.1186177921 CN1C=CC([NH3+])N(CCC(O)O)C1=O
196 200.1029677281 CN1C=CC([NH3+])N(C=CC(O)O)C1=O
197 198.0873176641 CN1C=CC([NH3+])N(C#CC(O)O)C1=O
198 196.0716676001 CN1C=CC([NH3+])N(C#CC(=O)O)C1=O
199 300.1190117161 C=CN(C(=O)N(C[NH3+])CCC(O)O)C1C=C(O)C(=C=O)O1 Intermediate Fragment 
200 300.1190117161 [NH3+]C=C=CN(C(O)NCCC(O)O)C1C=C(O)C(=C=O)O1 Intermediate Fragment 
201 273.1081126841 C=C[NH+](C(O)NCCC(O)O)C1C=C(O)C(=C=O)O1
202 213.0869833161 NCC=C[NH+](CO)C1C=C(O)C(=C=O)O1
203 186.0760842841 CC[NH+](CO)C1C=C(O)C(=C=O)O1
204 189.1233688241 NCCC[NH2+]C1CC(O)C(=CO)O1
205 187.1077187601 NCCC[NH2+]C1CC(O)C(=C=O)O1
206 169.0971540761 C=C1OC(=[NH+]CCCN)C=C1O
207 144.0655196001 C[NH2+]C1CC(O)C(=C=O)O1
208 169.0971540761 NCCC[NH2+]C1C=CC(=C=O)O1
209 187.1077187601 NCCC[NH2+]C(O)C=C(O)C#CO Intermediate Fragment 
210 185.0920686961 NCCC[NH2+]C1C=C(O)C(=C=O)O1
211 183.0764186321 NCCC[NH+]=C1C=C(O)C(=C=O)O1
212 300.1190117161 [NH3+]C(=C=CN(CO)C1C=C(O)C(=C=O)O1)NCCC(O)O Intermediate Fragment 
213 300.1190117161 [NH3+]C(C=CN=C1C=C(O)C(=C=O)O1)N(CO)CCC(O)O Intermediate Fragment 
214 175.1077187601 C#CC(N)[NH+](CO)CCC(O)O
215 156.0655196001 CC[NH2+]C1C=C(O)C(=C=O)O1
216 268.0927969681 NC(C#C[NH+]=C1C=C(O)C(=C=O)O1)NCCC(O)O
217 272.1240970961 NC(CC[NH+]=C1C=C(O)C(=C=O)O1)NCCC(O)O
