#In-silico ESI-MS/MS [M+H]+ Spectra
#PREDICTED BY CFM-ID 4.0.8
#SMILES=[C@H]1(C[C@@H](O[C@@H]1CO)n1ccc2[n+](c1=O)CCCN2)O
#InChiKey=IUGYSAMDCWFJDA-FXPVBKGRSA-O
energy0
152.08184 100.00 2 45 37 82 90 62 93 83 81 80 49 (57.709 1.2822 0.3192 0.12377 0.098865 0.0883 0.030961 0.01956 0.013713 0.011639 0.0099393)
154.09749 29.51 4 38 50 32 63 53 46 55 54 52 (16.147 0.89795 0.21487 0.10598 0.096981 0.073564 0.027501 0.024362 0.017634 0.012122)
268.12918 12.57 0 146 176 172 167 177 185 143 133 186 184 175 (6.2485 1.0455 0.068421 0.041525 0.037932 0.022244 0.021952 0.0089711 0.0082797 0.0029983 0.00022379 0.00010807)
energy1
123.05529 3.56 65 51 (1.7195 0.080725)
124.05054 5.10 58 84 (2.2349 0.3474)
124.08692 8.26 35 (4.1821)
150.06619 13.74 8 102 94 101 104 78 99 100 98 (5.3982 0.54594 0.40286 0.27444 0.12348 0.11075 0.038837 0.038202 0.020275)
152.08184 100.00 2 45 62 90 37 83 49 80 93 81 82 (41.514 2.9941 1.9797 1.6352 0.9294 0.79681 0.47162 0.11288 0.10504 0.045082 0.031408)
154.09749 24.52 4 63 38 50 46 54 55 32 52 53 (10.341 0.71891 0.36965 0.21231 0.20323 0.1971 0.15226 0.1454 0.042154 0.029252)
178.09749 4.67 13 135 (2.2625 0.098797)
energy2
45.03349 7.48 114 (1.7349)
56.04948 9.28 27 (2.1531)
85.07602 15.71 43 (3.6429)
97.03964 5.55 64 (1.2874)
97.07602 29.47 24 (6.8343)
99.04406 4.86 10 111 117 (0.53048 0.51979 0.07578)
101.05971 6.01 128 129 132 (0.70153 0.66653 0.024766)
107.06037 9.36 41 (2.1717)
109.07602 54.80 40 (12.711)
111.09167 5.59 39 (1.2957)
112.05054 8.09 57 (1.8773)
122.07127 9.36 68 (2.1699)
123.05529 6.31 65 51 (1.4232 0.04022)
124.05054 6.91 58 84 (1.3437 0.25967)
124.08692 100.00 35 (23.193)
126.10257 5.58 36 (1.2952)
136.08692 8.82 31 (2.0458)
152.08184 42.06 45 2 62 37 90 49 80 81 83 82 93 (5.1165 1.5992 0.72795 0.62124 0.50193 0.39631 0.31628 0.2467 0.10408 0.078194 0.046307)
154.09749 6.75 38 4 50 55 32 63 46 52 53 54 (0.35626 0.29099 0.2249 0.21984 0.1405 0.1399 0.074111 0.07079 0.024692 0.022429)
158.12879 5.85 19 25 23 21 22 20 (0.79125 0.29487 0.10114 0.066341 0.060885 0.042908)

0 268.1291824761 O=C1N(C2CC(O)C(CO)O2)C=CC2=[N+]1CCCN2
1 236.1029677281 OC1=CC(N2C=CC3NCC=CN3C2=[OH+])OC1
2 152.0818383601 [OH+]=C1N=CC=C2NCCCN12
3 238.1186177921 OC1=CC(N2C=CC3NCCCN3C2=[OH+])OC1
4 154.0974884241 [OH2+]C1N=CC=C2NCCCN21
5 238.1186177921 OC1=CC(N(C=[OH+])C=C=C2NCCCN2)OC1 Intermediate Fragment 
6 240.1342678561 OC1=CC(N2C=CC3NCCCN3C2[OH2+])OC1
7 250.1186177921 C=C1OC(N2C=CC3NCCCN3C2=[OH+])C=C1O
8 150.0661882961 [OH+]=C1N=CC=C2NCC=CN12
9 148.0505382321 [OH+]=C1N=CC=C2N=CC=CN12
10 99.0440558841 C=C1OC=CC1[OH2+]
11 232.1080531081 C=C1C=CC(N2C=CC3NCC=CN3C2=[OH+])O1
12 250.1186177921 C=C(CO)OC(=C)N1C=CC2NCC=CN2C1=[OH+] Intermediate Fragment 
13 178.0974884241 C#CN1C=CC2NCCCN2C1=[OH+]
14 250.1186177921 C#COC(=C=CO)N1C=CC2NCCCN2C1[OH2+] Intermediate Fragment 
15 222.1237031721 C#C[OH+]C(=C)N1C=CC2NCCCN2C1O
16 208.1080531081 OC#CCN1C=CC2NCCCN2C1=[OH+]
17 250.1186177921 C=C1OC(N(C=[OH+])C=C=C2NCCCN2)C=C1O Intermediate Fragment 
18 250.1186177921 C=C1OC(N2C=CC(N)N(C=CC)C2=[OH+])C=C1O Intermediate Fragment 
19 158.1287885521 [OH2+]C1NCCC2NCCCN12
20 158.1287885521 N=CCC1NCCCN1C[OH2+] Intermediate Fragment 
21 158.1287885521 [OH2+]CN=CCC1NCCCN1 Intermediate Fragment 
22 158.1287885521 CC=NC([OH2+])N1CCCNC1 Intermediate Fragment 
23 158.1287885521 C=NC([OH2+])N1CCCNC1C Intermediate Fragment 
24 97.0760247081 [CH3+]=C1N=CCCN1
25 158.1287885521 NCCCN1CCC=NC1[OH2+] Intermediate Fragment 
26 58.0651256761 C=CC[NH3+]
27 56.0494756121 C#CC[NH3+]
28 156.1131384881 [OH2+]C1N=CCC2NCCCN12
29 156.1131384881 C=NC([OH2+])N1CCCNC1=C Intermediate Fragment 
30 99.0916747721 [CH3+]=C1NCCCN1
31 136.0869237401 C1=CN2C[NH+]=CC=C2NC1
32 154.0974884241 N=C=C=C1NCCCN1C[OH2+] Intermediate Fragment 
33 137.0709393281 C#CC1NCC=CN1C=[OH+]
34 125.0709393281 C=C1NCC=CN1C=[OH+]
35 124.0869237401 [NH+]#CC=C1NCCCN1
36 126.1025738041 [NH+]#CCC1NCCCN1
37 152.0818383601 [NH+]#CC=C1NCCCN1C=O
38 154.0974884241 [OH2+]CN=C=C=C1NCCCN1 Intermediate Fragment 
39 111.0916747721 [CH2+]#CC1NCCCN1
40 109.0760247081 [CH2+]#CC1=NCCCN1
41 107.0603746441 [CH2+]#CC1=NC=CCN1
42 95.0603746441 [CH3+]=C1N=CC=CN1
43 85.0760247081 C1=[NH+]CCCN1
44 83.0603746441 C1=C[NH+]=CNC1
45 152.0818383601 O=C[NH+]=C=C=C1NCCCN1
46 154.0974884241 C=C=NC(=[OH+])N1CCCNC1 Intermediate Fragment 
47 87.0916747721 C1CNC[NH2+]C1
48 111.0552892641 [OH+]=CN1C=CC=NC1
49 152.0818383601 C=C=[NH+]C(=O)N1C=CCNC1
50 154.0974884241 C=NC(=[OH+])N1CCCNC1=C Intermediate Fragment 
51 123.0552892641 C=C1N=CC=CN1C=[OH+]
52 154.0974884241 C=C=C1NCCCN1C(N)=[OH+] Intermediate Fragment 
53 154.0974884241 CCNC1=CC=NC(=[OH+])N1C Intermediate Fragment 
54 154.0974884241 CCN1C(=[OH+])N=CC=C1NC Intermediate Fragment 
55 154.0974884241 CCCN1C(=[OH+])N=CC=C1N Intermediate Fragment 
56 43.0542266441 CC=[CH3+]
57 112.0505382321 [NH3+]C1=CC=NC(O)=N1
58 124.0505382321 [CH2+]N1C(=O)N=CC=C1N
59 128.0818383601 CN1C([NH3+])=CC=NC1O
60 138.0661882961 C=CN1C(=O)N=CC=C1[NH3+]
61 137.0709393281 CC=CN1C=CC=NC1=[OH+]
62 152.0818383601 CC=CN1C(=O)N=CC=C1[NH3+]
63 154.0974884241 NCCCN1C=CC=NC1=[OH+] Intermediate Fragment 
64 97.0396392001 [OH2+]C1=NC=CC=N1
65 123.0552892641 C=CN1C=CC=NC1=[OH+]
66 134.0712736761 C1=CN2C[NH+]=CC=C2N=C1
67 135.0552892641 C#CC1N=CC=CN1C=[OH+]
68 122.0712736761 [NH+]#CC=C1N=CCCN1
69 105.0447245801 [CH2+]#CC1=NC=CC=N1
70 46.0287401681 [NH3+]C=O
71 93.0447245801 [CH+]=C1N=CC=CN1
72 58.0287401681 C=[NH+]C=O
73 81.0447245801 C1=C[NH+]=CN=C1
74 68.0130901041 C#C[NH+]=C=O
75 70.0287401681 C#C[NH2+]C=O
76 72.0443902321 C#C[NH2+]CO
77 120.0556236121 [NH+]#CC=C1N=CC=CN1
78 150.0661882961 O=C[NH+]=C=C=C1N=CCCN1
79 126.0661882961 [NH3+]C(=O)N1C=CC=NC1
80 152.0818383601 C=NC(=[OH+])N1C=CCNC1=C Intermediate Fragment 
81 152.0818383601 C=C=C1NCC=CN1C(N)=[OH+] Intermediate Fragment 
82 152.0818383601 C=CNC1=CC=NC(=[OH+])N1C Intermediate Fragment 
83 152.0818383601 C=CN1C(=[OH+])N=CC=C1NC Intermediate Fragment 
84 124.0505382321 C=[NH+]C1=CC=NC(O)=N1
85 126.0661882961 C[NH2+]C1=CC=NC(O)=N1
86 41.0385765801 [CH2+]#CC
87 126.0661882961 CN1C(=O)N=CC=C1[NH3+]
88 136.0505382321 C#CN1C(=O)N=CC=C1[NH3+]
89 135.0552892641 CC#CN1C=CC=NC1=[OH+]
90 152.0818383601 NCC=CN1C=CC=NC1=[OH+] Intermediate Fragment 
91 109.0396392001 [CH2+]N1C=CC=NC1=O
92 125.0709393281 CCN1C=CC=NC1=[OH+]
93 152.0818383601 C=CCNC1=CC=NC([OH2+])=N1 Intermediate Fragment 
94 150.0661882961 N=C=C=C1NCC=CN1C=[OH+] Intermediate Fragment 
95 133.0396392001 C#CC1N=CC=CN1C#[O+]
96 42.0338255481 CC#[NH+]
97 103.0290745161 [C+]#CC1=NC=CC=N1
98 150.0661882961 C=C=NC(=[OH+])N1C=CC=NC1 Intermediate Fragment 
99 150.0661882961 C=NC(=[OH+])N1C=CC=NC1=C Intermediate Fragment 
100 150.0661882961 C=C=C1N=CC=CN1C(N)=[OH+] Intermediate Fragment 
101 150.0661882961 C=CN1C(=[OH+])N=CC=C1N=C Intermediate Fragment 
102 150.0661882961 C=C=CN1C(=[OH+])N=CC=C1N Intermediate Fragment 
103 133.0396392001 [CH2+]C#CN1C=CC=NC1=O
104 150.0661882961 NC=C=CN1C=CC=NC1=[OH+] Intermediate Fragment 
105 115.0389705041 OC1C=COC1=C[OH2+]
106 87.0440558841 [OH2+]C1C=COC1
107 115.0389705041 C=C=C(O)C(=O)C[OH2+] Intermediate Fragment 
108 115.0389705041 O=C=C=C(O)CC[OH2+] Intermediate Fragment 
109 117.0546205681 OC1C=COC1C[OH2+]
110 89.0597059481 [OH2+]C1CCOC1
111 99.0440558841 [OH2+]C=C1C=CCO1
112 117.0546205681 C=COC(=C[OH2+])CO Intermediate Fragment 
113 91.0389705041 OCC(=[OH+])CO
114 45.0334912001 C=C[OH2+]
115 117.0546205681 C=C=C(O)C(O)C[OH2+] Intermediate Fragment 
116 29.0385765801 C=[CH3+]
117 99.0440558841 C=C=C(O)C=C[OH2+]
118 59.0491412641 CC=C[OH2+]
119 57.0334912001 CC#C[OH2+]
120 61.0284058201 OCC=[OH+]
121 117.0546205681 OC=C=C(O)CC[OH2+] Intermediate Fragment 
122 43.0178411361 C#C[OH2+]
123 87.0440558841 C=C(O)C=C[OH2+]
124 89.0597059481 C=C(O)CC[OH2+]
125 47.0491412641 CC[OH2+]
126 117.0546205681 OC=C=COCC[OH2+] Intermediate Fragment 
127 119.0702706321 OC1CCOC1C[OH2+]
128 101.0597059481 CC1OCC=C1[OH2+]
129 101.0597059481 [OH2+]CC1C=CCO1
130 119.0702706321 CC=C(O)C(O)C[OH2+] Intermediate Fragment 
131 119.0702706321 OCC=C(O)CC[OH2+] Intermediate Fragment 
132 101.0597059481 C=C=C(O)CC[OH2+]
133 268.1291824761 C=C(OC(=C=[OH+])CO)N1C=CC2NCCCN2C1O Intermediate Fragment 
134 176.0818383601 C#CN1C=CC2NCC=CN2C1=[OH+]
135 178.0974884241 C#CN=C=C=C1NCCCN1C[OH2+] Intermediate Fragment 
136 180.1131384881 C#CN1C=CC2NCCCN2C1[OH2+]
137 184.1444386161 C=CN1CCC2NCCCN2C1[OH2+]
138 75.0440558841 OCC=C[OH2+]
139 194.0924030441 C=C([OH2+])N1C=CC2NCC=CN2C1=O
140 196.1080531081 C=C([OH2+])N1C=CC2NCCCN2C1=O
141 196.1080531081 C=C([OH2+])N(C=O)C=C=C1NCCCN1 Intermediate Fragment 
142 168.1131384881 C=C(O)[NH+]=C=CC1NCCCN1
143 268.1291824761 C=C(O)C(=C=[OH+])OCN1C=CC2NCCCN2C1O Intermediate Fragment 
144 164.0818383601 CN1C=CC2N=CC=CN2C1=[OH+]
145 182.0924030441 O=C1N(C=[OH+])C=CC2NCCCN12
146 268.1291824761 O=C(C=[OH+])C(O)=C=CN1CCC2NCCCN2C1O Intermediate Fragment 
147 182.1287885521 C#CN1CCC2NCCCN2C1[OH2+]
148 89.0233204401 O=CC(=[OH+])CO
149 73.0284058201 OCC#C[OH2+]
150 93.0546205681 OCC([OH2+])CO
151 168.1131384881 CN1C=CC2NCCCN2C1=[OH+]
152 166.0974884241 CN1C=CC2NCC=CN2C1=[OH+]
153 250.1186177921 OC(=C=CN1C=CC2NCCCN2C1O)C#C[OH2+]
154 222.1237031721 CC(O)=C=CN1C=CC2NCCCN2C1=[OH+]
155 232.1080531081 C#CC(O)=C=CN1C=CC2NCCCN2C1=[OH+]
156 232.1080531081 O=C1N(CC#CC#C[OH2+])C=CC2NCCCN12
157 212.1393532361 OC#CCN1CCC2NCCCN2C1[OH2+]
158 210.1237031721 OC#CCN1C=CC2NCCCN2C1[OH2+]
159 192.1131384881 C#CCN1C=CC2NCCCN2C1=[OH+]
160 210.1237031721 OC#CCN(C=C=C1NCCCN1)C[OH2+] Intermediate Fragment 
161 182.1287885521 OC#CC=[NH+]CCC1NCCCN1
162 208.1080531081 OC#CC=NC=C=C1NCCCN1C[OH2+] Intermediate Fragment 
163 208.1080531081 OC#CCN(C=[OH+])C=C=C1NCCCN1 Intermediate Fragment 
164 206.0924030441 OC#CCN1C=CC2NCC=CN2C1=[OH+]
165 59.0127557561 O=C=C[OH2+]
166 63.0440558841 OCC[OH2+]
167 268.1291824761 OC(=C=C(O)N1CCC2NCCCN2C1O)C#C[OH2+] Intermediate Fragment 
168 77.0597059481 OCCC[OH2+]
169 184.1080531081 OC1N(C=[OH+])C=CC2NCCCN21
170 180.0767529801 O=C1N(C=[OH+])C=CC2NCC=CN12
171 224.1029677281 OC#CC(=[OH+])N1C=CC2NCCCN2C1O
172 268.1291824761 OC=C=C(OC#C[OH2+])N1CCC2NCCCN2C1O Intermediate Fragment 
173 226.1186177921 OC#CC(=[OH+])N1CCC2NCCCN2C1O
174 208.1080531081 C#CC(=[OH+])N1C=CC2NCCCN2C1O
175 268.1291824761 C=CN(C1C=C(O)C(=C=[OH+])O1)C(O)N1CCCNC1 Intermediate Fragment 
176 268.1291824761 OCN(C=CC1NCCCN1)C1C=C(O)C(=C=[OH+])O1 Intermediate Fragment 
177 268.1291824761 OCN1CCCNC1CCN=C1C=C(O)C(=C=[OH+])O1 Intermediate Fragment 
178 143.1178895201 C=CC1NCCCN1C[OH2+]
179 139.0865893921 C#CC1NCCCN1C=[OH+]
180 142.0498695361 C[NH2+]C1C=C(O)C(=C=O)O1
181 144.0655196001 C[NH2+]C1C=C(O)C(=CO)O1
182 236.1029677281 O=C=C1OC(=[NH+]C=CC2NCCCN2)C=C1O
183 240.1342678561 O=C=C1OC([NH2+]CCC2NCCCN2)C=C1O
184 268.1291824761 CCNC1C=CN(C2C=C(O)C(=C=[OH+])O2)C(O)N1C Intermediate Fragment 
185 268.1291824761 CCCN1C(N)C=CN(C2C=C(O)C(=C=[OH+])O2)C1O Intermediate Fragment 
186 268.1291824761 NCCCN1CC=CN(C2C=C(O)C(=C=[OH+])O2)C1O Intermediate Fragment 
