#In-silico ESI-MS/MS [M+H]+ Spectra
#PREDICTED BY CFM-ID 4.0.8
#SMILES=[nH]1c(nc2c(c1=O)nc(n2[C@@H]1O[C@H](CO)[C@@H](C1)O)Nc1ccc2-c3c(C(=O)c4c2c1ccc4)cccc3)N
#InChiKey=DGIIZDHLXPMARL-VAMGGRTRSA-N
energy0
395.12510 33.29 10 49 24 31 35 18 52 58 32 48 61 54 44 60 37 56 59 47 40 46 183 (22.798 0.08783 0.040224 0.030913 0.016858 0.0098552 0.009089 0.0079105 0.0071724 0.0070746 0.0065042 0.0041962 0.0037525 0.0027314 0.0024848 0.0016359 0.0012531 0.00071654 0.00060401 0.00036382 2.5198e-08)
511.17244 100.00 0 163 128 160 196 98 217 103 120 229 121 150 126 220 147 228 243 248 127 226 124 193 227 194 237 241 123 192 (67.771 0.97821 0.20928 0.092674 0.035571 0.028775 0.016621 0.010019 0.0091205 0.0088054 0.0085729 0.0073337 0.006925 0.0062164 0.0056164 0.0042238 0.0033538 0.0023427 0.0020793 0.001402 0.0012437 0.0010077 0.00099226 0.00094042 0.00045578 0.00041808 0.00032077 0.00027227)
energy1
378.09855 5.28 17 19 42 34 (2.935 0.542 0.027241 0.011225)
393.10945 2.97 9 30 51 43 55 45 57 (1.9391 0.030798 0.0049593 0.0019684 0.0018375 0.00032529 0.00025004)
395.12510 100.00 10 24 18 31 49 54 32 52 61 35 40 58 60 47 48 59 56 44 37 46 183 (63.644 0.92328 0.54605 0.4052 0.30184 0.13457 0.12059 0.093584 0.075345 0.074302 0.067987 0.042407 0.03415 0.029376 0.025838 0.024498 0.014575 0.0085275 0.0075594 0.0023627 0.00044868)
493.16188 5.69 68 129 94 82 79 1 96 72 75 83 85 73 86 (2.4742 0.55125 0.39583 0.081916 0.079744 0.066182 0.031097 0.027495 0.022151 0.019513 0.015947 0.015715 0.0070873)
511.17244 6.99 0 163 128 103 150 196 120 147 121 160 220 98 217 227 126 248 243 229 237 124 193 228 226 241 123 194 127 192 (3.1459 1.1584 0.16106 0.040223 0.034097 0.023699 0.023409 0.012988 0.012495 0.010431 0.0079226 0.0065861 0.00406 0.0023394 0.0014854 0.0014737 0.00087302 0.00084807 0.00051613 0.00051418 0.00046366 0.00036247 0.00024243 0.000131 0.00011858 0.00011555 5.8946e-05 3.8326e-05)
energy2
43.01784 4.13 174 (0.90061)
45.03349 7.32 167 (1.5952)
55.01784 4.21 176 (0.91703)
57.03349 22.04 177 (4.8046)
75.04406 7.63 115 (1.6629)
79.05423 3.44 218 (0.74877)
89.05971 8.64 149 (1.8822)
246.09134 6.78 12 92 91 (0.95104 0.35284 0.17284)
367.13019 4.92 50 23 (1.0507 0.021439)
378.09855 6.45 17 19 42 34 (1.3611 0.019027 0.016206 0.0090323)
393.10945 10.93 9 55 45 30 51 43 57 (2.1566 0.070062 0.042248 0.042172 0.032438 0.019288 0.019022)
395.12510 100.00 10 24 54 32 18 49 183 44 40 37 31 35 56 48 52 59 61 60 47 46 58 (11.174 3.4537 1.2265 1.2068 1.0166 0.58272 0.49478 0.48301 0.424 0.37115 0.22096 0.22008 0.21796 0.11055 0.1081 0.098652 0.093019 0.080052 0.08004 0.076305 0.056989)
399.15640 3.51 63 (0.76563)
401.17205 6.96 64 (1.517)
409.14075 4.36 154 (0.95099)
419.12510 12.19 142 (2.6562)
421.14075 42.10 80 (9.1766)
423.12001 7.95 180 182 181 (0.72401 0.56532 0.44268)
424.12918 4.17 102 (0.90954)
437.13566 10.31 153 151 152 (1.0218 0.77509 0.45014)
439.15131 5.34 215 155 (1.1405 0.024508)
441.16696 9.30 214 156 (1.1461 0.87992)
443.18262 4.04 157 (0.87992)
451.15131 21.92 77 136 162 134 135 (1.3754 1.1895 0.96015 0.82631 0.42614)
465.16696 6.10 213 87 (1.1513 0.17794)
467.14623 4.24 84 (0.92383)
481.16188 5.35 66 207 158 208 206 (0.38963 0.25397 0.24417 0.15178 0.1275)
483.17753 5.90 212 159 67 210 211 209 118 117 (0.52051 0.33494 0.20039 0.089088 0.072986 0.058604 0.0082242 0.00078472)
491.14623 4.15 191 (0.90347)
509.15679 10.96 119 195 216 225 146 190 (1.4359 0.24726 0.2368 0.22873 0.16129 0.077891)

0 511.1724442561 Nc1nc2c(nc([NH2+]c3ccc4c5c(cccc35)C(=O)c3ccccc3-4)n2C2CC(O)C(CO)O2)c(=O)[nH]1
1 493.1618795721 NC1=NC=C2N=C([NH+]=C3C=CC4=C5CCCCC5=C(O)C5=C4C3=CC=C5)N(C3C=C(O)C(=C=O)O3)C2=N1
2 379.1301855201 N=C1N=C2N=C([NH+]=C3C=CC4=C5C=CC=CC5=C(O)C5=C4C3=CC=C5)N=C2CN1
3 117.0546205681 OC1CCOC1=C[OH2+]
4 99.0440558841 C=C1OCC=C1[OH2+]
5 117.0546205681 CCC(O)C(=O)C=[OH+] Intermediate Fragment 
6 99.0440558841 CC=C(O)C#C[OH2+]
7 117.0546205681 O=CCC(O)C=C[OH2+] Intermediate Fragment 
8 115.0389705041 OC1CCOC1=C=[OH+]
9 393.1094500761 NC1=NC(=O)C2=NC([NH+]=C3C=CC4=C5C=CC=CC5=C(O)C5=C4C3=CC=C5)=NC2=N1
10 395.1251001401 NC1=NC(=O)C2=NC([NH+]=C3C=CC4=C5CCC=CC5=C(O)C5=C4C3=CC=C5)=NC2=N1
11 377.1145354561 N=C1N=CC2=NC([NH+]=C3C=CC4=C5C=CC=CC5=C(O)C5=C4C3=CC=C5)=NC2=N1
12 246.0913404241 [NH2+]=C1C=CC2=C3C=CC=CC3=C(O)C3=CC=CC1=C32
13 150.0410361681 [NH3+]C1=NC(=O)C2=NC=NC2=N1
14 231.0804413921 [OH+]=C1C2=CC=CC3=C2C(=CC=C3)C2=C1C=CC=C2
15 165.0519352001 NC1=NC(=O)C2=NC([NH3+])=NC2=N1
16 377.1145354561 NC1=NC(=O)C2=NC([NH+]=C3C=CC4=C5C=CC=CC5=CC5=C4C3=CC=C5)=NC2=N1
17 378.0985510441 O=C1N=CN=C2N=C([NH+]=C3C=CC4=C5C=CC=CC5=C(O)C5=C4C3=CC=C5)N=C12
18 395.1251001401 N=C(N)N=C1NC([NH+]=C2C=CC3=C4C=CC=CC4=C(O)C4=C3C2=CC=C4)=NC1=C=O Intermediate Fragment 
19 378.0985510441 N=C=NC1=C(C#[O+])N=C(N=C2C=CC3=C4C=CC=CC4=C(O)C4=C3C2=CC=C4)N1
20 353.1033020761 [NH2+]=C1N=C(N=C2C=CC3=C4C=CC=CC4=C(O)C4=C3C2=CC=C4)N=C1C=O
21 351.0876520121 N=C1N=C(N=C2C=CC3=C4C=CC=CC4=C(O)C4=C3C2=CC=C4)N=C1C#[O+]
22 336.0767529801 O=C1C2=CC=CC3=C2C(=CC=C3N=C2N=CC(C#[O+])=N2)C2=C1C=CC=C2
23 367.1301855201 NC(=[NH2+])N=C1C=NC(N=C2C=CC3=C4C=CC=CC4=C(O)C4=C3C2=CC=C4)=N1
24 395.1251001401 NC(=NC=O)N=C1C=NC([NH+]=C2C=CC3=C4C=CC=CC4=C(O)C4=C3C2=CC=C4)=N1 Intermediate Fragment 
25 352.1192864881 N=C=[NH+]C1C=NC(N=C2C=CC3=C4C=CC=CC4=C(O)C4=C3C2=CC=C4)=N1
26 350.1036364241 N=C=[N+]=C1C=NC(N=C2C=CC3=C4C=CC=CC4=C(O)C4=C3C2=CC=C4)=N1
27 327.1240375201 [NH2+]=C1C=NC(N=C2C=CC3=C4CCC=CC4=C(O)C4=C3C2=CC=C4)=N1
28 325.1083874561 [NH2+]=C1C=NC(N=C2C=CC3=C4C=CC=CC4=C(O)C4=C3C2=CC=C4)=N1
29 310.0974884241 OC1=C2C=CC=CC2=C2C=CC(=[N+]=C3N=CC=N3)C3=CC=CC1=C32
30 393.1094500761 NC(=NC#[O+])N=C1C=NC(N=C2C=CC3=C4C=CC=CC4=C(O)C4=C3C2=CC=C4)=N1
31 395.1251001401 NC(N)=NC(=O)C1=NC(=[N+]=C2C=CC3=C4C=CC=CC4=C(O)C4=C3C2=CC=C4)N=C1 Intermediate Fragment 
32 395.1251001401 N=C=NC(O)=C1N=C([NH+]=C2C=CC3=C4C=CC=CC4=C(O)C4=C3C2=CC=C4)NC1=N Intermediate Fragment 
33 368.1142011081 N=C1N=C(N=C2C=CC3=C4C=CC=CC4=C(O)C4=C3C2=CC=C4)N=C1C([NH3+])=O
34 378.0985510441 N=C=NC(=O)C1=NC(=[N+]=C2C=CC3=C4C=CC=CC4=C(O)C4=C3C2=CC=C4)N=C1
35 395.1251001401 N=C=NC1=C(C(N)=O)N=C([NH+]=C2C=CC3=C4C=CC=CC4=C(O)C4=C3C2=CC=C4)N1 Intermediate Fragment 
36 353.1033020761 NC(=O)C1=NC(=[N+]=C2C=CC3=C4C=CC=CC4=C(O)C4=C3C2=CC=C4)N=C1
37 395.1251001401 N=C(N=C1C=NC(N)=NC1=O)[NH+]=C1C=CC2=C3C=CC=CC3=C(O)C3=C2C1=CC=C3 Intermediate Fragment 
38 271.0865893921 [NH+]#CN=C1C=CC2=C3C=CC=CC3=C(O)C3=CC=CC1=C32
39 125.0457872001 NC1=NC(=O)C(=[NH2+])C=N1
40 395.1251001401 NC1=NC(O)=C(N=C=[NH+]C2=CC=C3C4=C(C=CC=C4)C(=O)C4=CC=CC2=C43)C(N)=N1 Intermediate Fragment 
41 140.0566862321 NC1=NC(=O)C(=[NH2+])C(N)=N1
42 378.0985510441 NC1=NC(=O)C(=[N+]=C=NC2=CC=C3C4=C(C=CC=C4)C(=O)C4=CC=CC2=C43)C=N1
43 393.1094500761 NC1=NC(=O)C(=[N+]=C=NC2=CC=C3C4=C(C=CC=C4)C(=O)C4=CC=CC2=C43)C(N)=N1
44 395.1251001401 NC1=NC(O)=C(N)C(N=C=[NH+]C2=CC=C3C4=C(C=CC=C4)C(=O)C4=CC=CC2=C43)=N1 Intermediate Fragment 
45 393.1094500761 NC1=NC(=O)C(=[NH2+])C(N=C=NC2=CC=C3C4=C(C=CC=C4)C(=O)C4=CC=CC2=C43)=N1
46 395.1251001401 C=C1C2=C(C=CC=C2)C(=O)C2=C1C(C(C)=[NH+]C1=NC3=NC(N)=NC(=O)C3=N1)=CC=C2 Intermediate Fragment 
47 395.1251001401 C=CC(=[NH+]C1=NC2=NC(N)=NC(=O)C2=N1)C1=CC=CC2=C1C=C1C=CC=CC1=C2O Intermediate Fragment 
48 395.1251001401 NC1=NC(O)=C2N=C([NH+]=C=C=C=C3C4=C(C=CC=C4)C(=O)C4=C3CCC=C4)NC2=N1 Intermediate Fragment 
49 395.1251001401 NC1=NC(O)=C2N=C([NH+]=C3C=CC(=C4C=CC=CC4=C=O)C4=CC=CC=C43)NC2=N1 Intermediate Fragment 
50 367.1301855201 NC1=NC(=O)C2=NC([NH+]=C3C=CC(=C4C=CC=CC4)C4=CC=CC=C43)=NC2=N1
51 393.1094500761 NC1=NC(=O)C2=NC([NH+]=C3C=CC(=C4C=CC=CC4=C=O)C4=CC=CC=C43)=NC2=N1
52 395.1251001401 NC1=NC(=O)C2=NC([NH+]=C3C=CCC4=C(C(=O)C5=CC=CC=C5)C=CC=C34)=NC2=N1 Intermediate Fragment 
53 317.0781499481 NC1=NC(=O)C2=NC(N=C3C=CCC4=C(C#[O+])C=CC=C34)=NC2=N1
54 395.1251001401 NC1=NC(=O)C2=NC([NH+]=C3C=CC(=C4C=CC=CC4)C4=C3C=CCC4=C=O)=NC2=N1 Intermediate Fragment 
55 393.1094500761 NC1=NC(=O)C2=NC(N=C3C=CC(=C4C=CC=CC4)C4=C(C#[O+])C=CC=C34)=NC2=N1
56 395.1251001401 C=C=C1C(=[NH+]C2=NC3=NC(N)=NC(=O)C3=N2)C=CC2=C3C=CC=CC3=C(O)C(C)=C12 Intermediate Fragment 
57 393.1094500761 [CH+]=C=C1C(=NC2=NC3=NC(N)=NC(=O)C3=N2)C=CC2=C3C=CC=CC3=C(O)C(C)=C12
58 395.1251001401 C=C=CC1=C2C=CC(=[NH+]C3=NC4=C(O)N=C(N)N=C4N3)C3=CC=CC(=C32)C(=O)C1=C Intermediate Fragment 
59 395.1251001401 C=C=C1C(=O)C2=C3C(=CC=C2)C(=[NH+]C2=NC4=C(O)N=C(N)N=C4N2)C=CC3=C1C=C Intermediate Fragment 
60 395.1251001401 C=C=C=CC1=C(O)C2=C3C(=C1)C=CC(=[NH+]C1=NC4=C(O)N=C(N)N=C4N1)C3=CC=C2 Intermediate Fragment 
61 395.1251001401 C=C=C=CC1=C2C=CC(=[NH+]C3=NC4=C(O)N=C(N)N=C4N3)C3=CC=CC(=C32)C(O)=C1 Intermediate Fragment 
62 397.1407502041 NC1=NC(=O)C2=NC([NH+]=C3C=CC4=C5CCCCC5=C(O)C5=C4C3=CC=C5)=NC2=N1
63 399.1564002681 NC1=NC(=O)C2=NC([NH+]=C3C=CC4=C5CCCCC5=C(O)C5=C4C3=CCC5)=NC2=N1
64 401.1720503321 NC1=NC(=O)C2=NC([NH+]=C3C=CC4=C5CCCCC5=C(O)C5=C4C3CCC5)=NC2=N1
65 479.1462295081 NC1=NC(O)=C2N=C([NH+]=C3C=CC4=C5C=CC=CC5=C(O)C5=C4C3=CC=C5)N(C3CC(O)=CO3)C2=N1
66 481.1618795721 NC1=NC(O)=C2N=C([NH+]=C3C=CC4=C5CCC=CC5=C(O)C5=C4C3=CC=C5)N(C3CC(O)=CO3)C2=N1
67 483.1775296361 NC1=NC(O)=C2N=C([NH+]=C3C=CC4=C5CCCCC5=C(O)C5=C4C3=CC=C5)N(C3CC(O)=CO3)C2=N1
68 493.1618795721 C=C1OC(N2C([NH+]=C3C=CC4=C5CCC=CC5=C(O)C5=C4C3=CC=C5)=NC3=C(O)N=C(N)N=C32)C=C1O
69 475.1513148881 C=C1C=CC(N2C([NH+]=C3C=CC4=C5C=CC=CC5=C(O)C5=C4C3=CC=C5)=NC3=C(O)N=C(N)N=C32)O1
70 475.1513148881 C=C1OC(N2C([NH+]=C3C=CC4=C5C=CC=CC5=CC5=C4C3=CC=C5)=NC3=C(O)N=C(N)N=C32)C=C1O
71 476.1353304761 C=C1OC(N2C([NH+]=C3C=CC4=C5C=CC=CC5=C(O)C5=C4C3=CC=C5)=NC3=C(O)N=CN=C32)C=C1O
72 493.1618795721 C=C1OC(N2C([NH+]=C3C=CC4=C5CCC=CC5=C(O)C5=C4C3=CC=C5)=NC(=C=O)C2=NC(=N)N)C=C1O Intermediate Fragment 
73 493.1618795721 C=C1OC(N2C(=NC(N)=NC=O)C=NC2=[NH+]C2=CC=C3C4=C(C=CCC4)C(=O)C4=CC=CC2=C43)C=C1O Intermediate Fragment 
74 423.1451668881 C=C1OC(N2C(=[NH2+])C=NC2=NC2=CC=C3C4=C(C=CCC4)C(=O)C4=CC=CC2=C43)C=C1O
75 493.1618795721 CC(=O)C(O)=CCN1C([NH+]=C2C=CC3=C4C=CC=CC4=C(O)C4=C3C2=CC=C4)=NC2=C(O)N=C(N)N=C21 Intermediate Fragment 
76 475.1513148881 C#CC(O)=CCN1C([NH+]=C2C=CC3=C4C=CC=CC4=C(O)C4=C3C2=CC=C4)=NC2=C(O)N=C(N)N=C21
77 451.1513148881 NC1=NC(O)=C2N=C([NH+]=C3C=CC4=C5CCC=CC5=C(O)C5=C4C3=CC=C5)N(CC#CO)C2=N1
78 449.1356648241 NC1=NC(O)=C2N=C([NH+]=C3C=CC4=C5C=CC=CC5=C(O)C5=C4C3=CC=C5)N(CC#CO)C2=N1
79 493.1618795721 C=C(C=O)OC(C)N1C([NH+]=C2C=CC3=C4C=CC=CC4=C(O)C4=C3C2=CC=C4)=NC2=C(O)N=C(N)N=C21 Intermediate Fragment 
80 421.1407502041 C=CN1C([NH+]=C2C=CC3=C4C=CC=CC4=C(O)C4=C3C2=CC=C4)=NC2=C(O)N=C(N)N=C21
81 423.1564002681 CCN1C([NH+]=C2C=CC3=C4C=CC=CC4=C(O)C4=C3C2=CC=C4)=NC2=C(O)N=C(N)N=C21
82 493.1618795721 C#COC(C=C=O)N1C([NH+]=C2C=CC3=C4CCCCC4=C(O)C4=C3C2=CC=C4)=NC2=C(O)N=C(N)N=C21 Intermediate Fragment 
83 493.1618795721 C#CC(O)=CC(=O)N1C([NH+]=C2C=CC3=C4CCCCC4=C(O)C4=C3C2=CC=C4)=NC2=C(O)N=C(N)N=C21 Intermediate Fragment 
84 467.1462295081 NC1=NC(O)=C2N=C([NH+]=C3C=CC4=C5CCCCC5=C(O)C5=C4C3=CC=C5)N(C(=O)C#CO)C2=N1
85 493.1618795721 C=C1OC(N2C([NH+]=C3C=CC(=C4CCC=CC4=C=O)C4=CC=CC=C43)=NC3=C(O)N=C(N)N=C32)C=C1O Intermediate Fragment 
86 493.1618795721 C=C1OC(N2C([NH+]=C3C=CC(=C4C=CC=CC4)C4=C3C=CCC4=C=O)=NC3=C(O)N=C(N)N=C32)C=C1O Intermediate Fragment 
87 465.1669649521 C=C1OC(N2C([NH+]=C3C=CC(=C4C=CC=CC4)C4=CC=CC=C43)=NC3=C(O)N=C(N)N=C32)CC1=O
88 252.1382906161 [NH2+]=C1C=CC2=C3CCCCC3=C(O)C3=C2C1=CCC3
89 250.1226405521 [NH2+]=C1C=CC2=C3CCCCC3=C(O)C3=CC=CC1=C32
90 248.1069904881 [NH2+]=C1C=CC2=C3CCC=CC3=C(O)C3=CC=CC1=C32
91 246.0913404241 [NH2+]=C1C=CC(=C2C=CC=CC2=C=O)C2=C1C=CC=C2 Intermediate Fragment 
92 246.0913404241 N=C1C=CC(=C2C=CC=CC2)C2=C1C=CC=C2C#[O+] Intermediate Fragment 
93 266.0883802841 [NH3+]C1=NC(O)=C2N=CN(C3CC(O)C(=CO)O3)C2=N1
94 493.1618795721 NC1=NC(O)=C2N=C([NH+]=C3C=CC4=C5CCCCC5=CC5=C4C3=CC=C5)N(C3C=C(O)C(=C=O)O3)C2=N1
95 379.1301855201 NC1=NC(=O)C2=NC([NH+]=C3C=CC4=C5CCC=CC5=CC5=C4C3=CC=C5)=NC2=N1
96 493.1618795721 NC1=NC(O)=C2N=C([NH+]=C3C=CC4=C5CCC=CC5=CC5=C4C3=CC=C5)N(CC=C(O)C(=O)C=O)C2=N1 Intermediate Fragment 
97 494.1458951601 O=C=C1OC(N2C([NH+]=C3C=CC4=C5CCCCC5=C(O)C5=C4C3=CC=C5)=NC3=C(O)N=CN=C32)C=C1O
98 511.1724442561 N=C(N)N=C1C(=C=O)N=C([NH+]=C2C=CC3=C4CCCCC4=C(O)C4=C3C2=CCC4)N1C1C=C(O)C(=C=O)O1 Intermediate Fragment 
99 494.1458951601 NC=[NH+]C1=C(C=O)N=C(N=C2C=CC3=C4CCC=CC4=C(O)C4=C3C2=CC=C4)N1C1C=C(O)C(=C=O)O1
100 469.1506461921 [NH2+]=C1C(=C=O)N=C(N=C2C=CC3=C4CCCCC4=C(O)C4=C3C2=CCC4)N1C1C=C(O)C(=C=O)O1
101 452.1240970961 O=C=C1OC(N2C=C(C=O)N=C2[NH+]=C2C=CC3=C4CCC=CC4=C(O)C4=C3C2=CC=C4)C=C1O
102 424.1291824761 O=C=C1OC(N2C=CN=C2[NH+]=C2C=CC3=C4CCC=CC4=C(O)C4=C3C2=CC=C4)CC1=O
103 511.1724442561 NC(=NC=O)N=C1C=NC(=[NH+]C2=CC=C3C4=C(CCCC4)C(=O)C4=C3C2=CCC4)N1C1C=C(O)C(=C=O)O1 Intermediate Fragment 
104 468.1666306041 NC=[NH+]C1=CN=C(N=C2C=CC3=C4CCCCC4=C(O)C4=C3C2=CC=C4)N1C1C=C(O)C(=C=O)O1
105 441.1557315721 [NH2+]=C1C=NC(=NC2=CC=C3C4=C(CCCC4)C(=O)C4=C3C2=CCC4)N1C1C=C(O)C(=C=O)O1
106 468.1666306041 NC=[NH+]C1=CN=C(N=C2C=CC3=C4CCC=CC4=C(O)C4=C3C2=CC=C4)N1CC=C(O)C(=O)C=O Intermediate Fragment 
107 468.1666306041 NC=[NH+]C1=CN=C(N=C2C=CC3=C4CCCCC4=C(O)C4=C3C2=CC=C4)N1C(=O)C=C(O)C#CO Intermediate Fragment 
108 466.1509805401 NC=[NH+]C1=CN=C(N=C2C=CC3=C4CCC=CC4=C(O)C4=C3C2=CC=C4)N1C1C=C(O)C(=C=O)O1
109 466.1509805401 NC=[NH+]C1=CN=C(N=C2C=CC3=C4C=CC=CC4=C(O)C4=C3C2=CC=C4)N1CC=C(O)C(=O)C=O Intermediate Fragment 
110 464.1353304761 NC=[NH+]C1=CN=C(N=C2C=CC3=C4C=CC=CC4=C(O)C4=C3C2=CC=C4)N1C1C=C(O)C(=C=O)O1
111 443.1713816361 [NH2+]=C1C=NC(=NC2=CC=C3C4=C(CCCC4)C(=O)C4=C3C2CCC4)N1C1C=C(O)C(=C=O)O1
112 423.1451668881 [NH2+]=C1C=NC(=NC2=CC=C3C4=C(CCCC4)C(=O)C4=CC=CC2=C43)N1C1C=CC(=C=O)O1
113 441.1557315721 [NH2+]=C1C=NC(=NC2=CC=C3C4=C(CCCC4)C(=O)C4=CC=CC2=C43)N1CC=C(O)C(=O)C=O Intermediate Fragment 
114 441.1557315721 [NH2+]=C1C=NC(=NC2=CC=C3C4=C(CCCC4)C(=O)C4=C3C2=CCC4)N1C(=O)C=C(O)C#CO Intermediate Fragment 
115 75.0440558841 OCC=C[OH2+]
116 426.1448325401 O=C=C1OC(N2C=CN=C2[NH+]=C2C=CC3=C4CCCCC4=C(O)C4=C3C2=CC=C4)CC1=O
117 483.1775296361 NC(=[NH2+])N=C1C=NC(=NC2=CC=C3C4=C(CCCC4)C(=O)C4=C3C2=CCC4)N1C1C=C(O)C(=C=O)O1
118 483.1775296361 NC(=[NH2+])N=C1C=NC(=NC2=CC=C3C4=C(CCCC4)C(=O)C4=C3C2=CCC4)N1C(=O)C=C(O)C#CO Intermediate Fragment 
119 509.1567941921 NC(N=C1C=NC(=NC2=CC=C3C4=C(CCCC4)C(=O)C4=CC=CC2=C43)N1C1C=C(O)C(=C=O)O1)=[NH+]C=O
120 511.1724442561 NC(N)=NC(=O)C1=CN(C2C=C(O)C(=C=O)O2)C([NH+]=C2C=CC3=C4CCCCC4=C(O)C4=C3C2=CC=C4)=N1 Intermediate Fragment 
121 511.1724442561 N=C1C(=C(O)N=CN)N=C([NH+]=C2C=CC3=C4CCCCC4=C(O)C4=C3C2=CC=C4)N1C1C=C(O)C(=C=O)O1 Intermediate Fragment 
122 467.1349961281 [NH2+]=C1C(=C=O)N=C(N=C2C=CC3=C4CCCCC4=C(O)C4=C3C2=CC=C4)N1C1C=C(O)C(=C=O)O1
123 511.1724442561 N=C([NH+]=C1C=CC2=C3CCCCC3=C(O)C3=C2C1=CC=C3)N(C1=NC(N)=NC(O)=C1)C1C=C(O)C(=C=O)O1 Intermediate Fragment 
124 511.1724442561 NC1=NC(O)=C(N=C(N=C2C=C(O)C(=C=O)O2)[NH+]=C2C=CC3=C4CCCCC4=C(O)C4=C3C2=CCC4)C=N1 Intermediate Fragment 
125 127.0614372641 NC1=NC(=O)C([NH3+])C=N1
126 511.1724442561 NC1=NC(O)=C(N=C=[NH+]C2=CC=C3C4=C(CCCC4)C(=O)C4=C3C2CCC4)C(N=C2C=C(O)C(=C=O)O2)=N1 Intermediate Fragment 
127 511.1724442561 NC1=NC(O)=C(N)C(N(C=[NH+]C2=CC=C3C4=C(CCCC4)C(=O)C4=CC=CC2=C43)C2C=C(O)C(=C=O)O2)=N1 Intermediate Fragment 
128 511.1724442561 NC1=NC(O)=C2N=C([NH+]=C3C=CC4=C5CCCCC5=C(O)C5=C4C3=CC=C5)N(CC=C(O)C(=O)C=O)C2=N1 Intermediate Fragment 
129 493.1618795721 NC1=NC(O)=C2N=C([NH+]=C3C=CC4=C5CCC=CC5=C(O)C5=C4C3=CC=C5)N(CC=C(O)C#CO)C2=N1
130 455.1826150161 NC1=NC(O)=C2N=C([NH+]=C3C=CC4=C5CCCCC5=C(O)C5=C4C3=CCC5)N(CC#CO)C2=N1
131 453.1669649521 NC1=NC(O)=C2N=C([NH+]=C3C=CC4=C5CCCCC5=C(O)C5=C4C3=CC=C5)N(CC#CO)C2=N1
132 435.1564002681 C#CCN1C([NH+]=C2C=CC3=C4CCC=CC4=C(O)C4=C3C2=CC=C4)=NC2=C(O)N=C(N)N=C21
133 433.1407502041 C#CCN1C([NH+]=C2C=CC3=C4C=CC=CC4=C(O)C4=C3C2=CC=C4)=NC2=C(O)N=C(N)N=C21
134 451.1513148881 NC(=NC=O)N=C1C=NC(=[NH+]C2=CC=C3C4=C(C=CCC4)C(=O)C4=CC=CC2=C43)N1CC#CO Intermediate Fragment 
135 451.1513148881 NC1=NC(O)=C(N=C(N=CC#CO)[NH+]=C2C=CC3=C4CCC=CC4=C(O)C4=C3C2=CC=C4)C=N1 Intermediate Fragment 
136 451.1513148881 NC1=NC(O)=C2N=C([NH+]=C3C=CC(=C4C=CC=CC4)C4=C3C=CCC4=C=O)N(CC#CO)C2=N1 Intermediate Fragment 
137 423.1564002681 NC1=NC(O)=C2N=C([NH+]=C3C=CC(=C4C=CC=CC4)C4=CC=CC=C43)N(CC=C=O)C2=N1
138 449.1356648241 NC1=NC(O)=C2N=C(N=C3C=CC(=C4C=CC=CC4)C4=C3C=CCC4=C=O)N([CH+]C#CO)C2=N1 Intermediate Fragment 
139 63.0440558841 OCC[OH2+]
140 427.1877003961 CCN1C([NH+]=C2C=CC3=C4CCCCC4=C(O)C4=C3C2=CC=C4)=NC2=C(O)N=C(N)N=C21
141 425.1720503321 CCN1C([NH+]=C2C=CC3=C4CCC=CC4=C(O)C4=C3C2=CC=C4)=NC2=C(O)N=C(N)N=C21
142 419.1251001401 C#CN1C([NH+]=C2C=CC3=C4C=CC=CC4=C(O)C4=C3C2=CC=C4)=NC2=C(O)N=C(N)N=C21
143 91.0389705041 OCC(=[OH+])CO
144 93.0546205681 OCC([OH2+])CO
145 405.1094500761 [CH2+]N1C(=NC2=CC=C3C4=C(C=CC=C4)C(=O)C4=CC=CC2=C43)N=C2C(=O)N=C(N)N=C21
146 509.1567941921 NC1=NC(O)=C2N=C([NH+]=C3C=CC4=C5CCC=CC5=C(O)C5=C4C3=CC=C5)N(CC=C(O)C(=O)C=O)C2=N1
147 511.1724442561 C=C(O)C(=C=O)OCN1C([NH+]=C2C=CC3=C4CCCCC4=C(O)C4=C3C2=CC=C4)=NC2=C(O)N=C(N)N=C21 Intermediate Fragment 
148 407.1251001401 CN1C2=NC(N)=NC(=O)C2=NC1=[NH+]C1=CC=C2C3=C(C=CC=C3)C(=O)C3=CC=CC1=C32
149 89.0597059481 CC(O)C=C[OH2+]
150 511.1724442561 CC(OC(=C=O)C=O)N1C([NH+]=C2C=CC3=C4CCCCC4=C(O)C4=C3C2=CC=C4)=NC2=C(O)N=C(N)N=C21 Intermediate Fragment 
151 437.1356648241 CC(=O)N1C([NH+]=C2C=CC3=C4C=CC=CC4=C(O)C4=C3C2=CC=C4)=NC2=C(O)N=C(N)N=C21
152 437.1356648241 CC(=O)N1C(=NC(N)=NC=O)C=NC1=[NH+]C1=CC=C2C3=C(C=CC=C3)C(=O)C3=CC=CC1=C32 Intermediate Fragment 
153 437.1356648241 [CH2+]C(=O)N1C(N=C2C=CC(=C3C=CC=CC3)C3=C2C=CCC3=C=O)=NC2=C(O)N=C(N)N=C21 Intermediate Fragment 
154 409.1407502041 CC(=O)N1C2=NC(N)=NC(=O)C2=NC1=[NH+]C1=CC=C(C2=CC=CC=C2)C2=C1C=CC=C2
155 439.1513148881 CC(=O)N1C([NH+]=C2C=CC3=C4CCC=CC4=C(O)C4=C3C2=CC=C4)=NC2=C(O)N=C(N)N=C21
156 441.1669649521 CC(=O)N1C([NH+]=C2C=CC3=C4CCCCC4=C(O)C4=C3C2=CC=C4)=NC2=C(O)N=C(N)N=C21
157 443.1826150161 CC(=O)N1C([NH+]=C2C=CC3=C4CCCCC4=C(O)C4=C3C2=CCC4)=NC2=C(O)N=C(N)N=C21
158 481.1618795721 CC(OC#CO)N1C([NH+]=C2C=CC3=C4CCC=CC4=C(O)C4=C3C2=CC=C4)=NC2=C(O)N=C(N)N=C21
159 483.1775296361 CC(OC#CO)N1C([NH+]=C2C=CC3=C4CCCCC4=C(O)C4=C3C2=CC=C4)=NC2=C(O)N=C(N)N=C21
160 511.1724442561 NC1=NC(O)=C2N=C([NH+]=C3C=CC4=C5CCCCC5=C(O)C5=C4C3=CCC5)N(C(C=C=O)OC#CO)C2=N1 Intermediate Fragment 
161 469.1618795721 NC1=NC(O)=C2N=C([NH+]=C3C=CC4=C5CCCCC5=C(O)C5=C4C3=CCC5)N(C(=O)C#CO)C2=N1
162 451.1513148881 C#CC(=O)N1C([NH+]=C2C=CC3=C4CCCCC4=C(O)C4=C3C2=CC=C4)=NC2=C(O)N=C(N)N=C21
163 511.1724442561 NC1=NC(O)=C2N=C([NH+]=C3C=CC4=C5CCCCC5=C(O)C5=C4C3=CCC5)N(C(=O)C=C(O)C#CO)C2=N1 Intermediate Fragment 
164 465.1305794441 NC1=NC(O)=C2N=C([NH+]=C3C=CC4=C5CCC=CC5=C(O)C5=C4C3=CC=C5)N(C(=O)C#CO)C2=N1
165 447.1200147601 NC1=NC(O)=C2N=C(N=C3C=CC4=C5C=CC=CC5=C(O)C5=C4C3=CC=C5)N([CH+]C#CO)C2=N1
166 465.1305794441 NC1=NC(O)=C2N=C([NH+]=C3C=CC(=C4C=CC=CC4)C4=C3C=CCC4=C=O)N(C(=O)C#CO)C2=N1 Intermediate Fragment 
167 45.0334912001 C=C[OH2+]
168 47.0491412641 CC[OH2+]
169 29.0385765801 C=[CH3+]
170 435.1200147601 [CH2+]C(=O)N1C(N=C2C=CC3=C4C=CC=CC4=C(O)C4=C3C2=CC=C4)=NC2=C(O)N=C(N)N=C21
171 68.9971056921 [O+]#CC#CO
172 41.0021910721 [C+]#CO
173 71.0127557561 O=CC#C[OH2+]
174 43.0178411361 C#C[OH2+]
175 73.0284058201 OCC#C[OH2+]
176 55.0178411361 C#CC=[OH+]
177 57.0334912001 C#CC[OH2+]
178 427.1513148881 NC1=NC(O)=C2N=C([NH+]=C3C=CC4=C5CCCCC5=C(O)C5=C4C3=CC=C5)N(C=O)C2=N1
179 425.1356648241 NC1=NC(O)=C2N=C([NH+]=C3C=CC4=C5CCC=CC5=C(O)C5=C4C3=CC=C5)N(C=O)C2=N1
180 423.1200147601 NC1=NC(O)=C2N=C([NH+]=C3C=CC4=C5C=CC=CC5=C(O)C5=C4C3=CC=C5)N(C=O)C2=N1
181 423.1200147601 NC(=NC=O)N=C1C=NC(=[NH+]C2=CC=C3C4=C(C=CC=C4)C(=O)C4=CC=CC2=C43)N1C=O Intermediate Fragment 
182 423.1200147601 NC1=NC(O)=C2N=C(N=C3C=CC(=C4C=CC=CC4)C4=C3C=CCC4=C=O)N(C#[O+])C2=N1 Intermediate Fragment 
183 395.1251001401 NC1=NC(=O)C2=NC(=[NH+]C3=CC=C(C4=CC=CC=C4)C4=C3C=CC=C4)N(C=O)C2=N1
184 421.1043646961 NC1=NC(O)=C2N=C(N=C3C=CC4=C5C=CC=CC5=C(O)C5=C4C3=CC=C5)N(C#[O+])C2=N1
185 87.0440558841 CC(O)C#C[OH2+]
186 69.0334912001 C=CC#C[OH2+]
187 91.0753560121 CC(O)CC[OH2+]
188 73.0647913281 C=CC(C)[OH2+]
189 73.0647913281 CCC=C[OH2+]
190 509.1567941921 NC1=NC(O)=C2N=C([NH+]=C3C=CC4=C5CCCCC5=C(O)C5=C4C3=CC=C5)N(C(=O)C=C(O)C#CO)C2=N1
191 491.1462295081 NC1=NC(O)=C2N=C([NH+]=C3C=CC4=C5C=CC=CC5=C(O)C5=C4C3=CC=C5)N(CC=C(O)C#CO)C2=N1
192 511.1724442561 C=C1C2=C(CCCC2)C(=O)C2=C1C(C(C)=[NH+]C1=NC3=C(O)N=C(N)N=C3N1C1C=C(O)C(=C=O)O1)=CC=C2 Intermediate Fragment 
193 511.1724442561 C=CC(=[NH+]C1=NC2=C(O)N=C(N)N=C2N1C1C=C(O)C(=C=O)O1)C1=CC=CC2=C1C=C1CCCCC1=C2O Intermediate Fragment 
194 511.1724442561 NC1=NC(O)=C2N=C([NH+]=C=C=C=C3C4=C(CCCC4)C(=O)C4=C3CCCC4)N(C3C=C(O)C(=C=O)O3)C2=N1 Intermediate Fragment 
195 509.1567941921 NC1=NC(O)=C2N=C([NH+]=C=C=C=C3C4=C(CCC=C4)C(=O)C4=C3CCCC4)N(C3C=C(O)C(=C=O)O3)C2=N1
196 511.1724442561 NC1=NC(O)=C2N=C([NH+]=C3C=CC(=C4CCCCC4=C=O)C4=CCCC=C43)N(C3C=C(O)C(=C=O)O3)C2=N1 Intermediate Fragment 
197 401.0992793161 NC1=NC(O)=C2N=C([NH+]=C3C=CCC4=CC=CC=C43)N(C3=CC(=O)C(=C=O)O3)C2=N1
198 291.0988853921 NC1=NC(=O)C2=NC([NH+]=C3C=CCC4=CC=CC=C43)=NC2=N1
199 403.1149293801 NC1=NC(O)=C2N=C([NH+]=C3C=CCC4=CC=CC=C43)N(C3CC(=O)C(=C=O)O3)C2=N1
200 403.1149293801 NC1=NC(O)=C2N=C([NH+]=C3C=CCC4=CC=CC=C43)N(C=C=C(O)C(=O)C=O)C2=N1 Intermediate Fragment 
201 405.1305794441 NC1=NC(O)=C2N=C([NH+]=C3C=CCC4=CCCC=C43)N(C3CC(=O)C(=C=O)O3)C2=N1
202 407.1462295081 NC1=NC(O)=C2N=C([NH+]=C3C=CCC4=CCCCC43)N(C3CC(=O)C(=C=O)O3)C2=N1
203 407.1462295081 NC1=NC(O)=C2N=C([NH+]=C3C=CCC4=CCCCC43)N(C(=O)C=C(O)C#CO)C2=N1 Intermediate Fragment 
204 479.1462295081 NC1=NC(O)=C2N=C([NH+]=C3C=CC(=C4C=CC=CC4)C4=CC=CC=C43)N(C3C=C(O)C(=C=O)O3)C2=N1
205 479.1462295081 NC1=NC(O)=C2N=C([NH+]=C3C=CC(=C4C=CC=CC4)C4=CC=CC=C43)N(C=C=C(O)C(=O)C=O)C2=N1 Intermediate Fragment 
206 481.1618795721 NC1=NC(O)=C2N=C([NH+]=C3C=CC(=C4C=CCCC4)C4=CC=CC=C43)N(C3C=C(O)C(=C=O)O3)C2=N1
207 481.1618795721 NC1=NC(O)=C2N=C([NH+]=C3C=CC(=C4C=CC=CC4)C4=CC=CC=C43)N(CC=C(O)C(=O)C=O)C2=N1 Intermediate Fragment 
208 481.1618795721 NC1=NC(O)=C2N=C([NH+]=C3C=CC(=C4C=CCCC4)C4=CC=CC=C43)N(C(=O)C=C(O)C#CO)C2=N1 Intermediate Fragment 
209 483.1775296361 NC1=NC(O)=C2N=C([NH+]=C3C=CC(=C4CCCCC4)C4=CC=CC=C43)N(C3C=C(O)C(=C=O)O3)C2=N1
210 483.1775296361 NC1=NC(O)=C2N=C([NH+]=C3C=CC(=C4C=CCCC4)C4=CC=CC=C43)N(CC=C(O)C(=O)C=O)C2=N1 Intermediate Fragment 
211 483.1775296361 CC(OC(=C=O)C=O)N1C([NH+]=C2C=CC(=C3C=CCCC3)C3=CC=CC=C32)=NC2=C(O)N=C(N)N=C21 Intermediate Fragment 
212 483.1775296361 NC1=NC(O)=C2N=C([NH+]=C3C=CC(=C4CCCCC4)C4=CC=CC=C43)N(C(=O)C=C(O)C#CO)C2=N1 Intermediate Fragment 
213 465.1669649521 NC1=NC(O)=C2N=C([NH+]=C3C=CC(=C4C=CC=CC4)C4=CC=CC=C43)N(CC=C(O)C#CO)C2=N1
214 441.1669649521 NC1=NC(O)=C2N=C([NH+]=C3C=CC(=C4CCCCC4)C4=CC=CC=C43)N(C(=O)C#CO)C2=N1
215 439.1513148881 NC1=NC(O)=C2N=C([NH+]=C3C=CC(=C4C=CCCC4)C4=CC=CC=C43)N(C(=O)C#CO)C2=N1
216 509.1567941921 NC1=NC(O)=C2N=C([NH+]=C3C=CC(=C4CCCCC4=C=O)C4=CC=CC=C43)N(C3C=C(O)C(=C=O)O3)C2=N1
217 511.1724442561 NC1=NC(O)=C2N=C([NH+]=C3C=CCC4=C(C(=O)C5=CCCCC5)C=CC=C34)N(C3C=C(O)C(=C=O)O3)C2=N1 Intermediate Fragment 
218 79.0542266441 C1=CC=[CH2+]C=C1
219 107.0491412641 [OH+]=CC1=CC=CC=C1
220 511.1724442561 NC1=NC(O)=C2N=C([NH+]=C3C=CC(=C4CCCCC4)C4=C3C=CCC4=C=O)N(C3C=C(O)C(=C=O)O3)C2=N1 Intermediate Fragment 
221 429.0941939361 NC1=NC(O)=C2N=C([NH+]=C3C=CCC4=C3C=CCC4=C=O)N(C3=CC(=O)C(=C=O)O3)C2=N1
222 319.0938000121 NC1=NC(=O)C2=NC([NH+]=C3C=CCC4=C(C=O)C=CC=C34)=NC2=N1
223 431.1098440001 NC1=NC(O)=C2N=C([NH+]=C3C=CCC4=C3C=CCC4=C=O)N(C3CC(=O)C(=C=O)O3)C2=N1
224 433.1254940641 NC1=NC(O)=C2N=C([NH+]=C3C=CCC4=C3CCCC4=C=O)N(C3CC(=O)C(=C=O)O3)C2=N1
225 509.1567941921 NC1=NC(O)=C2N=C([NH+]=C3C=CC(=C4C=CCCC4)C4=C3C=CCC4=C=O)N(C3C=C(O)C(=C=O)O3)C2=N1
226 511.1724442561 C=C=C1C(=[NH+]C2=NC3=C(O)N=C(N)N=C3N2C2C=C(O)C(=C=O)O2)C=CC2=C3CCCCC3=C(O)C(C)=C12 Intermediate Fragment 
227 511.1724442561 CC=C=C1C2=CC(O)=C3CCCCC3=C2C=CC1=[NH+]C1=NC2=C(O)N=C(N)N=C2N1C1C=C(O)C(=C=O)O1 Intermediate Fragment 
228 511.1724442561 C=C=CC1=C2CC(=[NH+]C3=NC4=C(O)N=C(N)N=C4N3C3C=C(O)C(=C=O)O3)C=CC2=C2CCCCC2=C1O Intermediate Fragment 
229 511.1724442561 CCCC1=C2C=CC(=[NH+]C3=NC4=C(O)N=C(N)N=C4N3C3C=C(O)C(=C=O)O3)C3=CC=CC(=C32)C(O)=C1C Intermediate Fragment 
230 495.1411441281 C=CC1=C2C=CC(=[NH+]C3=NC4=C(O)N=C(N)N=C4N3C3C=C(O)C(=C=O)O3)C3=CC=CC(=C32)C(O)=C1C
231 485.1567941921 CC1=C(O)C2=C3C(=CCC2)C(=[NH+]C2=NC4=C(O)N=C(N)N=C4N2C2C=C(O)C(=C=O)O2)C=CC3=C1C
232 485.1567941921 CC1=C(O)C2=C3C(=CCC2)C(=[NH+]C2=NC4=C(O)N=C(N)N=C4N2C(=O)C=C(O)C#CO)C=CC3=C1C Intermediate Fragment 
233 483.1411441281 CC1=C(O)C2=C3C(=CC=C2)C(=[NH+]C2=NC4=C(O)N=C(N)N=C4N2C2C=C(O)C(=C=O)O2)C=CC3=C1C
234 369.1094500761 C=C1C(=O)C2=C3C(=CC=C2)C(=[NH+]C2=NC4=NC(N)=NC(=O)C4=N2)C=CC3=C1C
235 483.1411441281 CC1=C(O)C2=C3C(=CC=C2)C(=[NH+]C2=NC4=C(O)N=C(N)N=C4N2C=C=C(O)C(=O)C=O)C=CC3=C1C Intermediate Fragment 
236 481.1254940641 [CH2+]C1=C(O)C2=C3C(=CC=C2)C(=NC2=NC4=C(O)N=C(N)N=C4N2C2C=C(O)C(=C=O)O2)C=CC3=C1C
237 511.1724442561 CCC1=C(O)C2=C3C(=CC=C2)C(=[NH+]C2=NC4=C(O)N=C(N)N=C4N2C2C=C(O)C(=C=O)O2)C=CC3=C1CC Intermediate Fragment 
238 485.1567941921 CCC1=C2C=CC(=[NH+]C3=NC4=C(O)N=C(N)N=C4N3C3C=C(O)C(=C=O)O3)C3=CCCC(=C32)C(O)=C1
239 369.1094500761 C#CC1=C2C=CC(=[NH+]C3=NC4=C(O)N=C(N)N=C4N3)C3=CC=CC(=C32)C(O)=C1
240 485.1567941921 CCC1=C2C=CC(=[NH+]C3=NC4=C(O)N=C(N)N=C4N3C(=O)C=C(O)C#CO)C3=CCCC(=C32)C(O)=C1 Intermediate Fragment 
241 511.1724442561 CCCC1=C(O)C2=C3C(=CC=C2)C(=[NH+]C2=NC4=C(O)N=C(N)N=C4N2C2C=C(O)C(=C=O)O2)C=CC3=C1C Intermediate Fragment 
242 467.1098440001 [CH2+]C1=C2C=CC(=NC3=NC4=C(O)N=C(N)N=C4N3C3C=C(O)C(=C=O)O3)C3=CC=CC(=C32)C(O)=C1
243 511.1724442561 CCCCC1=C(O)C2=C3C(=C1)C=CC(=[NH+]C1=NC4=C(O)N=C(N)N=C4N1C1C=C(O)C(=C=O)O1)C3=CC=C2 Intermediate Fragment 
244 457.1254940641 NC1=NC(O)=C2N=C([NH+]=C3C=CC4=CC=C(O)C5=C4C3=CCC5)N(C3CC(=O)C(=C=O)O3)C2=N1
245 459.1411441281 NC1=NC(O)=C2N=C([NH+]=C3C=CC4=CC=C(O)C5=C4C3CCC5)N(C3CC(=O)C(=C=O)O3)C2=N1
246 461.1567941921 NC1=NC(O)=C2N=C([NH+]=C3C=CC4=CC=C(O)C5CCCC3C45)N(C3CC(=O)C(=C=O)O3)C2=N1
247 485.1567941921 CCC1=C(O)C2=C3C(=C1)C=CC(=[NH+]C1=NC4=C(O)N=C(N)N=C4N1C1C=C(O)C(=C=O)O1)C3=CCC2
248 511.1724442561 CCCCC1=C2C=CC(=[NH+]C3=NC4=C(O)N=C(N)N=C4N3C3C=C(O)C(=C=O)O3)C3=CC=CC(=C32)C(O)=C1 Intermediate Fragment 
