#In-silico ESI-MS/MS [M+H]+ Spectra
#PREDICTED BY CFM-ID 4.0.8
#SMILES=[C@H]1(C[C@@H](O[C@@H]1CO)n1cc(c(=O)n(c1=O)C1c2c(C(C(C1O)O)O)c1c(cc2)c2c(cc1C)cccc2)C)O
#InChiKey=OXPSWJXDJIIVRP-ZRIAPFGMSA-N
energy0
293.11722 6.97 9 136 130 148 164 172 169 170 171 (3.1321 0.28628 0.1209 0.03307 0.012401 0.0053069 0.0030322 0.0025917 0.00021958)
391.16523 5.78 40 57 (2.9735 0.0063896)
401.14958 30.56 26 25 24 18 (7.8012 5.01 2.9142 0.035658)
419.16015 100.00 4 41 29 66 83 73 89 50 77 80 84 79 64 85 87 82 88 (43.21 3.7717 2.8422 0.50674 0.39743 0.36552 0.15936 0.11684 0.064287 0.029521 0.025528 0.024818 0.021345 0.016945 0.013078 0.0074815 0.0056168)
517.19693 4.32 193 191 189 2 190 13 224 230 229 (1.1864 0.35966 0.2342 0.22642 0.20247 0.009698 0.0061186 0.00082206 0.0004734)
535.20749 11.05 0 241 265 286 259 206 312 284 290 264 299 194 298 319 204 296 314 318 285 311 260 315 310 262 (5.4164 0.055949 0.05117 0.046765 0.038966 0.027211 0.01325 0.012401 0.010347 0.0099961 0.0062254 0.0020573 0.0019245 0.0018396 0.0017923 0.0016523 0.00094759 0.0006858 0.00040567 0.00039089 0.0002356 0.00015332 6.7389e-05 5.2492e-05)
energy1
99.04406 4.82 6 103 98 (0.68778 0.60051 0.24413)
127.05020 8.09 16 (2.5742)
273.09101 7.55 173 175 174 (1.3849 0.7013 0.31629)
275.10666 9.25 160 162 161 (1.6087 0.95602 0.37918)
277.12231 10.27 121 123 122 (1.9989 0.96388 0.30496)
291.10157 9.72 10 179 178 177 180 (3.0443 0.015088 0.013637 0.013252 0.0069531)
293.11722 22.34 9 148 130 136 170 164 172 169 171 (5.774 0.57776 0.33011 0.30622 0.05474 0.028704 0.017964 0.016003 0.0033586)
295.13287 7.69 8 128 137 131 153 149 159 150 125 158 154 152 155 157 (2.3285 0.02824 0.026528 0.023467 0.012131 0.0094808 0.0073414 0.0034776 0.0028629 0.001389 0.0013336 0.0010843 0.00085939 0.00074804)
336.12303 4.59 35 (1.4602)
401.14958 100.00 26 24 25 18 (19.721 8.758 3.3092 0.032757)
403.12885 6.10 27 28 (1.1633 0.7791)
419.16015 61.76 4 41 77 73 66 64 29 50 83 89 80 79 88 84 82 85 87 (16.63 0.63964 0.49623 0.3932 0.32646 0.29821 0.29232 0.15236 0.15181 0.091866 0.076461 0.036037 0.017381 0.016688 0.013568 0.010754 0.0093605)
energy2
45.03349 13.94 101 (1.1877)
57.03349 14.85 105 (1.265)
71.04914 14.58 269 251 252 (0.70578 0.34321 0.1932)
125.03455 58.03 15 (4.9431)
127.05020 18.51 16 (1.577)
203.08553 11.39 147 (0.97033)
205.10118 24.72 146 (2.106)
233.09609 30.11 135 168 (1.9058 0.65859)
235.11174 22.95 127 142 (1.2956 0.65912)
247.07536 9.39 165 (0.80001)
251.10666 10.93 75 (0.93087)
263.10666 19.11 134 167 (1.5156 0.11213)
265.12231 21.20 129 166 (1.7277 0.077917)
273.09101 18.08 173 175 174 (0.78513 0.43365 0.32167)
275.10666 53.43 162 160 161 (2.257 1.6113 0.68309)
277.08592 34.52 163 (2.9406)
277.12231 64.58 121 123 122 (2.8024 2.0813 0.61717)
279.10157 17.31 124 (1.4747)
287.07027 24.92 20 (2.1226)
289.08592 13.32 19 (1.1342)
291.10157 14.49 10 177 179 178 180 (0.81869 0.16399 0.15477 0.062392 0.034177)
293.11722 100.00 9 148 130 136 164 169 170 172 171 (3.8788 1.6443 1.1767 0.70028 0.45973 0.2508 0.17241 0.14029 0.094721)
295.13287 43.67 8 137 131 128 125 149 159 150 153 155 158 152 157 154 (2.4329 0.35789 0.27269 0.15017 0.10935 0.066928 0.060021 0.054459 0.054216 0.049299 0.034462 0.031245 0.027289 0.019158)
329.12845 11.66 81 (0.99325)
359.13902 17.44 71 (1.4854)
419.16015 33.96 4 50 41 66 64 73 77 29 80 89 83 79 85 88 82 87 84 (0.97763 0.60252 0.31837 0.19076 0.13544 0.1326 0.099505 0.093439 0.087954 0.04688 0.042346 0.039378 0.038505 0.026917 0.024404 0.021314 0.014964)
433.17580 18.18 202 216 (1.4408 0.10738)
449.17071 54.61 205 (4.6515)
449.20710 19.55 198 302 (1.5103 0.15535)
451.22275 19.55 199 301 (1.5103 0.15535)

0 535.2074923721 Cc1cn(C2CC(O)C(C[OH2+])O2)c(=O)n(C2c3ccc4c(c(C)cc5ccccc54)c3C(O)C(O)C2O)c1=O
1 503.1812776241 CC1=CN(C2C=C(O)CO2)C(=O)N(C2=C3C=CC4=C(C(C)=CC5=C4CCCC5)C3=C(O)C(O)=C2O)C1=[OH+]
2 517.1969276881 C=C1OC(N2C=C(C)C(=[OH+])N(C3=C4C=CC5=C(C4=C(O)C(O)=C3O)C(C)CC3=C5CCCC3)C2=O)C=C1O
3 421.1757983201 CC1=C([OH2+])N(C2=C3C=CC4=C(C3=C(O)C(O)=C2O)C(C)CC2=C4CCCC2)C(=O)N=C1
4 419.1601482561 CC1=CC2=C(CCCC2)C2=C1C1=C(O)C(O)=C(O)C(N3C(=O)N=CC(C)=C3[OH2+])=C1C=C2
5 417.1444981921 CC1=CC2=C(CCC=C2)C2=C1C1=C(O)C(O)=C(O)C(N3C(=O)N=CC(C)=C3[OH2+])=C1C=C2
6 99.0440558841 C=C1OC=CC1[OH2+]
7 297.1485209521 CC1CC2CCCCC2C2=C1C1=C(O)C(=O)C(=[OH+])C=C1C=C2
8 295.1328708881 CC1CC2=C(CCCC2)C2=C1C1=C(O)C(=O)C(=[OH+])C=C1C=C2
9 293.1172208241 CC1=CC2=C(CCCC2)C2=C1C1=C(O)C(=O)C(=[OH+])C=C1C=C2
10 291.1015707601 CC1=CC2=C(CCC=C2)C2=C1C1=C(O)C(=O)C(=[OH+])C=C1C=C2
11 225.0869833161 C=C1OC(N2C=C(C)C(=[OH+])NC2O)=CC1O
12 499.1863630041 C=C1C=CC(N2C=C(C)C(=[OH+])N(C3=C4C=CC5=C(C(C)=CC6=C5CCCC6)C4=C(O)C(O)=C3O)C2=O)O1
13 517.1969276881 C#COC(=C=CO)N1C=C(C)C(=[OH+])N(C2=C3C=CC4=C(C3=C(O)C(O)=C2O)C(C)CC2CCCCC42)C1=O Intermediate Fragment 
14 425.2070984481 CC1=C([OH2+])N(C2=C3CCC4=C(C3=C(O)C(O)=C2O)C(C)CC2CCCCC42)C(=O)N=C1
15 125.0345538201 C=C1C=NC(O)=NC1=[OH+]
16 127.0502038841 CC1C=NC(O)=NC1=[OH+]
17 423.1914483841 CC1=C([OH2+])N(C2=C3C=CC4=C(C3=C(O)C(O)=C2O)C(C)CC2CCCCC42)C(=O)N=C1
18 401.1495835721 CC1=CN(C2=C3C=CC4=C(C(C)=CC5=C4CCC=C5)C3=C(O)C(O)=C2O)C(=[OH+])N=C1
19 289.0859206961 CC1=CC2=C(C=CC=C2)C2=C1C1=C(O)C(=O)C(=[OH+])C=C1C=C2
20 287.0702706321 [CH2+]C1=CC2=C(C=CC=C2)C2=C1C1=C(O)C(=O)C(=O)C=C1C=C2
21 123.0189037561 [CH+]=C1C=NC(O)=NC1=O
22 129.0658539481 CC1C=NC(O)NC1=[OH+]
23 131.0815040121 CC1C=NC(O)NC1[OH2+]
24 401.1495835721 CC1=CC2=C(CCC=C2)C2=C1C1=C(O)C(O)=CC(N3C(=O)N=CC(C)=C3[OH2+])=C1C=C2
25 401.1495835721 CC1=CC2=C(CCC=C2)C2=C1C1=C(O)C=C(O)C(N3C(=O)N=CC(C)=C3[OH2+])=C1C=C2
26 401.1495835721 CC1=CC2=C(CCC=C2)C2=C1C1=CC(O)=C(O)C(N3C(=O)N=CC(C)=C3[OH2+])=C1C=C2
27 403.1288481281 CC1=C([OH2+])N(C2=C3C=CC4=C(C=CC5=C4CCC=C5)C3=C(O)C(O)=C2O)C(=O)N=C1
28 403.1288481281 CC1=CC2=C(CCC=C2)C2=C1C1=C(O)C(O)=C(O)C(N3C(=O)N=CC=C3[OH2+])=C1C=C2
29 419.1601482561 CC(=C=N)C(=[OH+])N(C=O)C1=C2C=CC3=C(C(C)=CC4=C3CCCC4)C2=C(O)C(O)=C1O Intermediate Fragment 
30 402.1335991601 C=C(C)C(=O)[NH+](C=O)C1=C2C=CC3=C(C(C)=CC4=C3C=CC=C4)C2=C(O)C(O)=C1O
31 392.1492492241 CC=C(O)[NH+](C=O)C1=C2C=CC3=C(C(C)=CC4=C3CCC=C4)C2=C(O)C(O)=C1O
32 368.1492492241 CC1CC2=C(CCCC2)C2=C1C1=C(O)C(O)=C(O)C([NH+](C=O)C=O)=C1C=C2
33 362.1022990321 CC1=CC2=C(C=CC=C2)C2=C1C1=C(O)C(O)=C(O)C([NH+](C=O)C=O)=C1C=C2
34 338.1386845401 CC1CC2=C(CCCC2)C2=C1C1=C(O)C(O)=C(O)C([NH+]=C=O)=C1C=C2
35 336.1230344761 CC1=CC2=C(CCCC2)C2=C1C1=C(O)C(O)=C(O)C([NH+]=C=O)=C1C=C2
36 334.1073844121 CC1=CC2=C(CCC=C2)C2=C1C1=C(O)C(O)=C(O)C([NH+]=C=O)=C1C=C2
37 332.0917343481 CC1=CC2=C(C=CC=C2)C2=C1C1=C(O)C(O)=C(O)C([NH+]=C=O)=C1C=C2
38 82.0287401681 CC(=C=O)C#[NH+]
39 84.0443902321 CC(C#[NH+])=CO
40 391.1652336361 CC(C#[NH+])=C(O)N=C1C(=O)C(O)=C(O)C2=C1C=CC1=C2C(C)CC2=C1CCCC2
41 419.1601482561 CC(=C=NC=O)C(=[OH+])N=C1C(=O)C(O)=C(O)C2=C1C=CC1=C2C(C)CC2=C1CCCC2 Intermediate Fragment 
42 376.1543346041 C=C(C)C(=O)[NH+]=C1C(=O)C(O)=C(O)C2=C1C=CC1=C2C(C)=CC2=C1CCCC2
43 374.1386845401 C=C(C)C(=O)[NH+]=C1C(=O)C(O)=C(O)C2=C1C=CC1=C2C(C)=CC2=C1CCC=C2
44 372.1230344761 C=C(C)C(=O)[NH+]=C1C(=O)C(O)=C(O)C2=C1C=CC1=C2C(C)=CC2=C1C=CC=C2
45 364.1543346041 CC=C(O)[NH+]=C1C(=O)C(O)=C(O)C2=C1C=CC1=C2C(C)=CC2=C1CCCC2
46 362.1386845401 CC=C(O)[NH+]=C1C(=O)C(O)=C(O)C2=C1C=CC1=C2C(C)=CC2=C1CCC=C2
47 360.1230344761 CC=C(O)[NH+]=C1C(=O)C(O)=C(O)C2=C1C=CC1=C2C(C)=CC2=C1C=CC=C2
48 358.1073844121 C=C=C(O)[NH+]=C1C(=O)C(O)=C(O)C2=C1C=CC1=C2C(C)=CC2=C1C=CC=C2
49 417.1444981921 CC(=C=[NH+]C=O)C(=O)N=C1C(=O)C(O)=C(O)C2=C1C=CC1=C2C(C)=CC2=C1CCCC2
50 419.1601482561 CC(=C=NC(O)=NC1=C2C=CC3=C(C(C)=CC4=C3CCCC4)C2=C(O)C(O)=C1O)C=[OH+] Intermediate Fragment 
51 351.1339335081 CC1=CC2=C(CCCC2)C2=C1C1=C(O)C(=O)C(=O)C(N=C([NH3+])O)=C1C=C2
52 359.1026333801 C#[N+]C(O)=NC1=C2C=CC3=C(C(C)=CC4=C3C=CC=C4)C2=C(O)C(O)=C1O
53 361.1182834441 C=[NH+]C(O)=NC1=C2C=CC3=C(C(C)=CC4=C3C=CC=C4)C2=C(O)C(O)=C1O
54 363.1339335081 C=[NH+]C(O)=NC1=C2C=CC3=C(C(C)=CC4=C3CCC=C4)C2=C(O)C(O)=C1O
55 365.1495835721 C=[NH+]C(O)=NC1=C2C=CC3=C(C(C)=CC4=C3CCCC4)C2=C(O)C(O)=C1O
56 389.1495835721 CC=C=[NH+]C(O)=NC1=C2C=CC3=C(C(C)=CC4=C3CCC=C4)C2=C(O)C(O)=C1O
57 391.1652336361 CC=C=[NH+]C(O)=NC1=C2C=CC3=C(C(C)=CC4=C3CCCC4)C2=C(O)C(O)=C1O
58 304.0968197281 CC1=CC2=C(C=CC=C2)C2=C1C1=C(C=C2)C(=[NH2+])C(=O)C(O)=C1O
59 306.1124697921 CC1=CC2=C(CCC=C2)C2=C1C1=C(C=C2)C(=[NH2+])C(=O)C(O)=C1O
60 308.1281198561 CC1=CC2=C(CCCC2)C2=C1C1=C(C=C2)C(=[NH2+])C(=O)C(O)=C1O
61 310.1437699201 CC1CC2=C(CCCC2)C2=C1C1=C(C=C2)C(=[NH2+])C(=O)C(O)=C1O
62 330.0760842841 [CH2+]C1=CC2=C(C=CC=C2)C2=C1C1=C(O)C(O)=C(O)C(N=C=O)=C1C=C2
63 417.1444981921 CC(=C=[NH+]C(O)=NC1=C2C=CC3=C(C(C)=CC4=C3CCC=C4)C2=C(O)C(O)=C1O)C=O
64 419.1601482561 CC=C=NC(=O)N(C=[OH+])C1=C2C=CC3=C(C(C)=CC4=C3CCCC4)C2=C(O)C(O)=C1O Intermediate Fragment 
65 364.1179490961 CC1=CC2=C(CCC=C2)C2=C1C1=C(O)C(O)=C(O)C([NH+](C=O)C=O)=C1C=C2
66 419.1601482561 CC1=C([OH2+])N(C(C(O)=C=O)=C2C=CC3=C(C2=C=O)C(C)CC2=C3CCCC2)C(=O)N=C1 Intermediate Fragment 
67 221.0960914561 CC1=CC2=C(C=CC=C2)C2=C1C(C=[OH+])=CC=C2
68 199.0713332521 CC1C=NC(=O)N(CC(O)=CO)C1=[OH+]
69 201.0869833161 CC1C=NC(=O)N(CC(O)CO)C1=[OH+]
70 389.1495835721 CC1=CC2=C(CCCC2)C2=C1C(=C=O)C(=C(C=O)N1C(=O)N=CC(C)=C1[OH2+])C=C2
71 359.1390188881 CC1=CC2=C(CCC=C2)C2=C1C(=C=O)C(=CN1C(=O)N=CC(C)=C1[OH2+])C=C2
72 357.1233688241 CC1=CC2=C(C=CC=C2)C2=C1C(=C=O)C(=CN1C(=O)N=CC(C)=C1[OH2+])C=C2
73 419.1601482561 CC1=CC2=C(CCCC2)C2=C1C(=C(O)C=O)C(=C(C=O)N1C(=O)N=CC(C)=C1[OH2+])C=C2 Intermediate Fragment 
74 253.1223062041 CC1=CC2=C(CCCC2)C2=C1C(C(O)=C=[OH+])=CC=C2
75 251.1066561401 CC1=CC2=C(CCC=C2)C2=C1C(C(O)=C=[OH+])=CC=C2
76 249.0910060761 CC1=CC2=C(C=CC=C2)C2=C1C(C(O)=C=[OH+])=CC=C2
77 419.1601482561 CC1=CC2=C(CCCC2)C2=C1C(=C(O)C(O)=C=O)C(=CN1C(=O)N=CC(C)=C1[OH2+])C=C2 Intermediate Fragment 
78 363.1703190161 CC1=C([OH2+])N(C=C2C=CC3=C(C2=C=O)C(C)CC2=C3CCCC2)C(=O)N=C1
79 419.1601482561 CC1=CC2=C(CCC=C2)C2=C1C(C(O)=C(O)C(=O)CN1C(=O)N=CC(C)=C1[OH2+])=CC=C2 Intermediate Fragment 
80 419.1601482561 CC1=CC2=C(CCCC2)C2=CCC(=C(C(=O)C(O)=C=O)N3C(=O)N=CC(C)=C3[OH2+])C=C12 Intermediate Fragment 
81 329.1284542041 C=C1C=NC(=O)N(C=C2C=C3C(C)=CC4=C(C=CC=C4)C3=CC2)C1=[OH+]
82 419.1601482561 C#CC1=C(C2=C(C)CCCC2)C=CC2=C(N3C(=O)N=CC(C)=C3[OH2+])C(O)=C(O)C(O)=C12 Intermediate Fragment 
83 419.1601482561 CC(=CC1=CCCC=C1)C1=CC=CC2=C(N3C(=O)N=CC(C)=C3[OH2+])C(O)=C(O)C(O)=C12 Intermediate Fragment 
84 419.1601482561 C=C(C)C1=C(C2=CC=CCC2)C=CC2=C(N3C(=O)N=CC(C)=C3[OH2+])C(O)=C(O)C(O)=C21 Intermediate Fragment 
85 419.1601482561 C=CCC1=C(C)C=C(C)C2=C1C=CC1=C(N3C(=O)N=CC(C)=C3[OH2+])C(O)=C(O)C(O)=C12 Intermediate Fragment 
86 393.1444981921 CC1=CC(C)=C(C)C2=C1C1=C(O)C(O)=C(O)C(N3C(=O)N=CC(C)C3=[OH+])=C1C=C2
87 419.1601482561 C=CC1=C(CC)C2=C(C(C)=C1)C1=C(O)C(O)=C(O)C(N3C(=O)N=CC(C)=C3[OH2+])=C1C=C2 Intermediate Fragment 
88 419.1601482561 CC=CC1=C(C)C2=C(C(C)=C1)C1=C(O)C(O)=C(O)C(N3C(=O)N=CC(C)=C3[OH2+])=C1C=C2 Intermediate Fragment 
89 419.1601482561 C=CCCC1=CC=C(C)C2=C1C=CC1=C(N3C(=O)N=CC(C)=C3[OH2+])C(O)=C(O)C(O)=C12 Intermediate Fragment 
90 417.1444981921 CC(=C=N)C(=[OH+])N(C=O)C1=C2C=CC3=C(C(C)=CC4=C3CCC=C4)C2=C(O)C(O)=C1O Intermediate Fragment 
91 113.0233204401 OC1C=COC1=C=[OH+]
92 115.0389705041 OC1C=COC1=C[OH2+]
93 87.0440558841 [OH2+]C1C=COC1
94 115.0389705041 C=C=C(O)C(=O)C[OH2+] Intermediate Fragment 
95 115.0389705041 O=C=C=C(O)CC[OH2+] Intermediate Fragment 
96 117.0546205681 OC1C=COC1C[OH2+]
97 89.0597059481 [OH2+]C1CCOC1
98 99.0440558841 [OH2+]C=C1C=CCO1
99 117.0546205681 C=COC(=C[OH2+])CO Intermediate Fragment 
100 91.0389705041 OCC(=[OH+])CO
101 45.0334912001 C=C[OH2+]
102 117.0546205681 C=C=C(O)C(O)C[OH2+] Intermediate Fragment 
103 99.0440558841 C=C=C(O)C=C[OH2+]
104 59.0491412641 CC=C[OH2+]
105 57.0334912001 CC#C[OH2+]
106 61.0284058201 OCC=[OH+]
107 117.0546205681 OC=C=C(O)CC[OH2+] Intermediate Fragment 
108 43.0178411361 C#C[OH2+]
109 89.0597059481 C=C(O)CC[OH2+]
110 117.0546205681 OC=C=COCC[OH2+] Intermediate Fragment 
111 119.0702706321 OC1CCOC1C[OH2+]
112 101.0597059481 CC1OCC=C1[OH2+]
113 101.0597059481 [OH2+]CC1C=CCO1
114 119.0702706321 OCC=C(O)CC[OH2+] Intermediate Fragment 
115 101.0597059481 C=C=C(O)CC[OH2+]
116 299.1641710161 CC1CC2CCCCC2C2=C1C1=C(O)C(=O)C(=[OH+])C=C1CC2
117 299.1641710161 CC1CC2CCCCC2C2=C1C(=C(O)C=O)C(=CC=[OH+])C=C2 Intermediate Fragment 
118 299.1641710161 CC1CC2CCCCC2C2=CCC(=CC(=[OH+])C(O)=C=O)C=C21 Intermediate Fragment 
119 279.1379562681 CC1=CC2=C(CCCC2)C2=C1C1=C(O)C([OH2+])=CC=C1C=C2
120 279.1379562681 CC1=CC2=C(CCCC2)C2=C1C1=CC(O)=C([OH2+])C=C1C=C2
121 277.1223062041 CC1=CC2=C(CCC=C2)C2=C1C1=C(O)C([OH2+])=CC=C1C=C2
122 277.1223062041 CC1=CC2=C(CCC=C2)C2=C1C1=C(O)C=C([OH2+])C=C1C=C2
123 277.1223062041 CC1=CC2=C(CCC=C2)C2=C1C1=CC(O)=C([OH2+])C=C1C=C2
124 279.1015707601 OC1=C([OH2+])C=C2C=CC3=C(C=CC4=C3CCC=C4)C2=C1O
125 295.1328708881 C=C1C=CC2=C(C(C)=CC3=C2CCCC3)C1=C(O)C(O)=C=[OH+] Intermediate Fragment 
126 89.0233204401 OC=C(O)C=[OH+]
127 235.1117415201 C=C1C=CC2=C(C1=C=[OH+])C(C)=CC1=C2CCC=C1
128 295.1328708881 CC1=CC2=C(CCCC2)C2=C1C(=C(O)C=O)C(=CC=[OH+])C=C2 Intermediate Fragment 
129 265.1223062041 CC1=CC2=C(CCCC2)C2=C1C(=C=O)C(=CC=[OH+])C=C2
130 293.1172208241 CC1=CC2=C(CCC=C2)C2=C1C(=C(O)C=O)C(=CC=[OH+])C=C2
131 295.1328708881 CC1CC2=C(CCCC2)C2=C1C(=C=O)C(=CC([OH2+])=C=O)C=C2 Intermediate Fragment 
132 223.1117415201 CC1=CC2=C(CCC=C2)C2=C1C(C=[OH+])=CC=C2
133 267.1379562681 CC1CC2=C(CCCC2)C2=C1C(=C=O)C(=CC=[OH+])C=C2
134 263.1066561401 CC1=CC2=C(CCC=C2)C2=C1C(=C=O)C(=CC=[OH+])C=C2
135 233.0960914561 C=C1C=CC2=C(C1=C=[OH+])C(C)=CC1=C2C=CC=C1
136 293.1172208241 CC1=CC2=C(CCCC2)C2=C1C(=C=O)C(=CC([OH2+])=C=O)C=C2
137 295.1328708881 CC1=CC2=C(CCCC2)C2=CCC(=CC(=[OH+])C(O)=C=O)C=C12 Intermediate Fragment 
138 193.1011768361 [CH4+]C1=CC2=C(C=CC=C2)C2=C1C=CC=C2
139 191.0855267721 [CH2+]C1=CC2=C(C=CC=C2)C2=C1C=CC=C2
140 239.1430416481 CC1=CC2=C(CCCC2)C2=CCC(=CC=[OH+])C=C12
141 237.1273915841 CC1=CC2=C(CCC=C2)C2=CCC(=CC=[OH+])C=C12
142 235.1117415201 CC1=CC2=C(C=CC=C2)C2=CCC(=CC=[OH+])C=C12
143 211.1481270281 CC1C=C2CCCCC2=C2C=CC(=[CH3+])C=C21
144 209.1324769641 C=C1C=C2CCCCC2=C2C=CC(=[CH3+])C=C12
145 207.1168269001 C=C1C=C2C=CCCC2=C2C=CC(=[CH3+])C=C12
146 205.1011768361 C=C1C=C2C=CC=CC2=C2C=CC(=[CH3+])C=C12
147 203.0855267721 [CH+]=C1C=CC2=C3C=CC=CC3=CC(=C)C2=C1
148 293.1172208241 CC1=CC2=C(CCC=C2)C2=CCC(=CC(=[OH+])C(O)=C=O)C=C12
149 295.1328708881 CC(=[OH+])C(O)=C(O)C1=CC=CC2=C1C(C)=CC1=C2CCC=C1 Intermediate Fragment 
150 295.1328708881 CC1=CC2=C(CCC=C2)C(C=CC2=CC([OH2+])=C(O)C(O)=C2)=C1 Intermediate Fragment 
151 167.0855267721 C#[CH+]C1=CC(C)=CC2=C1C=CC=C2
152 295.1328708881 C#CC1=C(C2=C(C)CCCC2)C=CC2=CC([OH2+])=C(O)C(O)=C21 Intermediate Fragment 
153 295.1328708881 CC(=CC1=CCCC=C1)C1=CC=CC2=CC([OH2+])=C(O)C(O)=C21 Intermediate Fragment 
154 295.1328708881 C=C(C)C1=C(C2=CC=CCC2)C=CC2=CC([OH2+])=C(O)C(O)=C21 Intermediate Fragment 
155 295.1328708881 C=CCC1=C(C)C=C(C)C2=C1C=CC1=CC([OH2+])=C(O)C(O)=C12 Intermediate Fragment 
156 267.1015707601 CC1=CC(C)=C(C)C2=C1C1=C(O)C(=O)C(=[OH+])C=C1C=C2
157 295.1328708881 C=CC1=C(CC)C2=C(C(C)=C1)C1=C(O)C(O)=C([OH2+])C=C1C=C2 Intermediate Fragment 
158 295.1328708881 CC=CC1=C(C)C2=C(C(C)=C1)C1=C(O)C(O)=C([OH2+])C=C1C=C2 Intermediate Fragment 
159 295.1328708881 C=CCCC1=CC=C(C)C2=C1C=CC1=CC([OH2+])=C(O)C(O)=C12 Intermediate Fragment 
160 275.1066561401 CC1=CC2=C(C=CC=C2)C2=C1C1=C(O)C([OH2+])=CC=C1C=C2
161 275.1066561401 CC1=CC2=C(C=CC=C2)C2=C1C1=C(O)C=C([OH2+])C=C1C=C2
162 275.1066561401 CC1=CC2=C(C=CC=C2)C2=C1C1=CC(O)=C([OH2+])C=C1C=C2
163 277.0859206961 OC1=C([OH2+])C=C2C=CC3=C(C=CC4=C3C=CC=C4)C2=C1O
164 293.1172208241 C=C1C=CC2=C(C(C)=CC3=C2CCC=C3)C1=C(O)C(O)=C=[OH+] Intermediate Fragment 
165 247.0753560121 [CH2+]C1=CC2=C(C=CC=C2)C2=C1C(C(O)=C=O)=CC=C2
166 265.1223062041 CC1=CC2=C(CCC=C2)C2=CCC(=CC([OH2+])=C=O)C=C12
167 263.1066561401 CC1=CC2=C(C=CC=C2)C2=CCC(=CC([OH2+])=C=O)C=C12
168 233.0960914561 CC1=CC2=C(C=CC=C2)C2=CCC(=C=C=[OH+])C=C12
169 293.1172208241 CC(=[OH+])C(O)=C(O)C1=CC=CC2=C1C(C)=CC1=C2C=CC=C1 Intermediate Fragment 
170 293.1172208241 CC1=CC2=C(C=CC=C2)C(C=CC2=CC([OH2+])=C(O)C(O)=C2)=C1 Intermediate Fragment 
171 293.1172208241 C=C=CC1=C(C)C=C(C)C2=C1C=CC1=CC([OH2+])=C(O)C(O)=C12 Intermediate Fragment 
172 293.1172208241 C=C=CCC1=CC=C(C)C2=C1C=CC1=CC([OH2+])=C(O)C(O)=C12 Intermediate Fragment 
173 273.0910060761 [CH2+]C1=CC2=C(C=CC=C2)C2=C1C1=C(O)C(O)=CC=C1C=C2
174 273.0910060761 [CH2+]C1=CC2=C(C=CC=C2)C2=C1C1=C(O)C=C(O)C=C1C=C2
175 273.0910060761 [CH2+]C1=CC2=C(C=CC=C2)C2=C1C1=CC(O)=C(O)C=C1C=C2
176 275.0702706321 O=C1C(=[OH+])C=C2C=CC3=C(C=CC4=C3C=CC=C4)C2=C1O
177 291.1015707601 CC1=CC2=C(C=CC=C2)C2=C1C(=C(O)C=O)C(=CC=[OH+])C=C2 Intermediate Fragment 
178 291.1015707601 CC1=CC2=C(CCC=C2)C2=C1C(=C=O)C(=CC([OH2+])=C=O)C=C2 Intermediate Fragment 
179 291.1015707601 CC1=CC2=C(C=CC=C2)C2=CCC(=CC(=[OH+])C(O)=C=O)C=C12 Intermediate Fragment 
180 291.1015707601 C=C=C=CC1=CC=C(C)C2=C1C=CC1=CC([OH2+])=C(O)C(O)=C12 Intermediate Fragment 
181 235.0349477441 [CH2+]C1=CN(C2C=C(O)C(=C=O)O2)C(O)=NC1=O
182 239.0662478721 CC1=CN(C2C=C(O)C(=C=[OH+])O2)C(O)NC1=O
183 241.0818979361 CC1=CN(C2C=C(O)C(=C=[OH+])O2)C(O)NC1O
184 243.0975480001 CC1CN(C2C=C(O)C(=C=[OH+])O2)C(O)NC1O
185 243.0975480001 CC1CN(C(O)=C=C(O)C#C[OH2+])C(O)NC1O Intermediate Fragment 
186 169.0607685681 C=C([OH2+])N1C=C(C)C(=O)N=C1O
187 245.1131980641 CC1CN(C2C=C(O)C(=C[OH2+])O2)C(O)NC1O
188 247.1288481281 CC1CN(C2C=C(O)C(C[OH2+])O2)C(O)NC1O
189 517.1969276881 CC1=CN(C2C=C(O)C(=C=[OH+])O2)C(=O)N(C2=C3C=CC4=C(C3=C(O)C(O)=C2)C(C)CC2CCCCC42)C1=O
190 517.1969276881 CC1=CN(C2C=C(O)C(=C=[OH+])O2)C(=O)N(C2=C3C=CC4=C(C3=C(O)C=C2O)C(C)CC2CCCCC42)C1=O
191 517.1969276881 CC1=CN(C2C=C(O)C(=C=[OH+])O2)C(=O)N(C2=C3C=CC4=C(C3=CC(O)=C2O)C(C)CC2CCCCC42)C1=O
192 403.1652336361 CC1=CC2=C(CCCC2)C2=C1C1=CC(O)=C(O)C(N3C(=O)N=CC(C)=C3[OH2+])=C1C=C2
193 517.1969276881 CC1=CN(C2C=CC(=C=[OH+])O2)C(=O)N(C2=C3C=CC4=C(C3=C(O)C(O)=C2O)C(C)CC2CCCCC42)C1=O
194 535.2074923721 C=C(OC(=C=[OH+])CO)N1C=C(C)C(=O)N(C2=C3C=CC4=C(C3=C(O)C(O)=C2O)C(C)CC2CCCCC42)C1=O Intermediate Fragment 
195 443.1601482561 C#CN1C=C(C)C(=[OH+])N(C2=C3C=CC4=C(C(C)=CC5=C4CCCC5)C3=C(O)C(O)=C2O)C1=O
196 445.1757983201 C#CN1C=C(C)C(=[OH+])N(C2=C3C=CC4=C(C3=C(O)C(O)=C2O)C(C)CC2=C4CCCC2)C1=O
197 447.1914483841 C#CN1C=C(C)C(=[OH+])N(C2=C3C=CC4=C(C3=C(O)C(O)=C2O)C(C)CC2CCCCC42)C1=O
198 449.2070984481 C#CN1C=C(C)C(=[OH+])N(C2=C3CCC4=C(C3=C(O)C(O)=C2O)C(C)CC2CCCCC42)C1=O
199 451.2227485121 C#CN1C=C(C)C(=[OH+])N(C2=C3CCC4C5CCCCC5CC(C)C4C3=C(O)C(O)=C2O)C1=O
200 461.1707129401 C=C([OH2+])N1C=C(C)C(=O)N(C2=C3C=CC4=C(C(C)=CC5=C4CCCC5)C3=C(O)C(O)=C2O)C1=O
201 461.1707129401 C=C([OH2+])N(C=O)C=C(C)C(=O)N=C1C(=O)C(O)=C(O)C2=C1C=CC1=C2C(C)=CC2=C1CCCC2 Intermediate Fragment 
202 433.1757983201 C=C(O)[NH+]=C=C(C)C(=O)N=C1C(=O)C(O)=C(O)C2=C1C=CC1=C2C(C)CC2=C1CCCC2
203 463.1863630041 C=C([OH2+])N1C=C(C)C(=O)N(C2=C3C=CC4=C(C3=C(O)C(O)=C2O)C(C)CC2=C4CCCC2)C1=O
204 535.2074923721 C=C(O)C(=C=[OH+])OCN1C=C(C)C(=O)N(C2=C3C=CC4=C(C3=C(O)C(O)=C2O)C(C)CC2CCCCC42)C1=O Intermediate Fragment 
205 449.1707129401 CC1=CN(C=[OH+])C(=O)N(C2=C3C=CC4=C(C3=C(O)C(O)=C2O)C(C)CC2=C4CCCC2)C1=O
206 535.2074923721 CC1=CN(C=C=C(O)C(=O)C=[OH+])C(=O)N(C2=C3CCC4=C(C3=C(O)C(O)=C2O)C(C)CC2CCCCC42)C1=O Intermediate Fragment 
207 84.9920203121 O=CC(=O)C#[O+]
208 87.0076703761 O=CC(=[OH+])C=O
209 71.0127557561 O=CC#C[OH2+]
210 71.0127557561 CC(=O)C#[O+]
211 73.0284058201 OCC#C[OH2+]
212 73.0284058201 CC(=[OH+])C=O
213 93.0546205681 OCC([OH2+])CO
214 75.0440558841 OCC=C[OH2+]
215 75.0440558841 CC(=[OH+])CO
216 433.1757983201 CC1=CN(C)C(=O)N(C2=C3C=CC4=C(C(C)=CC5=C4CCCC5)C3=C(O)C(O)=C2O)C1=[OH+]
217 431.1601482561 CC1=CN(C)C(=O)N(C2=C3C=CC4=C(C(C)=CC5=C4CCC=C5)C3=C(O)C(O)=C2O)C1=[OH+]
218 139.0502038841 [CH2+]N1C=C(C)C(=O)N=C1O
219 431.1601482561 CC(=CN(C)C=O)C(=[OH+])N=C1C(=O)C(O)=C(O)C2=C1C=CC1=C2C(C)=CC2=C1CCC=C2 Intermediate Fragment 
220 403.1652336361 C=[NH+]C=C(C)C(=O)N=C1C(=O)C(O)=C(O)C2=C1C=CC1=C2C(C)=CC2=C1CCCC2
221 431.1601482561 CC1=CN(C)C(=O)N(C(C=O)=C2C=CC3=C(C(C)=CC4=C3CCC=C4)C2=C(O)C=O)C1=[OH+] Intermediate Fragment 
222 431.1601482561 CC1=CN(C)C(=O)N(C(C(=O)C(O)=C=O)=C2C=C3C(C)=CC4=C(CCC=C4)C3=CC2)C1=[OH+] Intermediate Fragment 
223 429.1444981921 CC1=CN(C)C(=O)N(C2=C3C=CC4=C(C(C)=CC5=C4C=CC=C5)C3=C(O)C(O)=C2O)C1=[OH+]
224 517.1969276881 CC1=CN(C=C=C(O)C#C[OH2+])C(=O)N(C2=C3C=CC4=C(C3=C(O)C(O)=C2O)C(C)CC2CCCCC42)C1=O
225 499.1863630041 C#CC(O)=C=CN1C=C(C)C(=[OH+])N(C2=C3C=CC4=C(C3=C(O)C(O)=C2O)C(C)CC2=C4CCCC2)C1=O
226 499.1863630041 CC1=CN(CC#CC#C[OH2+])C(=O)N(C2=C3C=CC4=C(C3=C(O)C(O)=C2O)C(C)CC2=C4CCCC2)C1=O
227 475.1863630041 CC1=CN(CC#CO)C(=O)N(C2=C3C=CC4=C(C3=C(O)C(O)=C2O)C(C)CC2=C4CCCC2)C1=[OH+]
228 473.1707129401 CC1=CN(CC#CO)C(=O)N(C2=C3C=CC4=C(C(C)=CC5=C4CCCC5)C3=C(O)C(O)=C2O)C1=[OH+]
229 517.1969276881 CC(=CN=C=C=C(O)C#C[OH2+])C(=O)N(C=O)C1=C2C=CC3=C(C2=C(O)C(O)=C1O)C(C)CC1CCCCC31 Intermediate Fragment 
230 517.1969276881 CC1=CN(C=C=C(O)C#C[OH2+])C(=O)N(C(C(O)=C=O)=C2CCC3=C(C2=C=O)C(C)CC2CCCCC32)C1=O Intermediate Fragment 
231 479.2176631321 CC1=CN(CC#CO)C(=O)N(C2=C3CCC4=C(C3=C(O)C(O)=C2O)C(C)CC2CCCCC42)C1=[OH+]
232 477.2020130681 CC1=CN(CC#CO)C(=O)N(C2=C3C=CC4=C(C3=C(O)C(O)=C2O)C(C)CC2CCCCC42)C1=[OH+]
233 459.1914483841 C#CCN1C=C(C)C(=[OH+])N(C2=C3C=CC4=C(C3=C(O)C(O)=C2O)C(C)CC2=C4CCCC2)C1=O
234 183.0764186321 CC1=CN(C=C=CO)C(O)NC1=[OH+]
235 457.1757983201 C#CCN1C=C(C)C(=[OH+])N(C2=C3C=CC4=C(C(C)=CC5=C4CCCC5)C3=C(O)C(O)=C2O)C1=O
236 475.1863630041 CC(=CN(C=O)CC#CO)C(=[OH+])N=C1C(=O)C(O)=C(O)C2=C1C=CC1=C2C(C)CC2=C1CCCC2 Intermediate Fragment 
237 447.1914483841 CC(=C[NH+]=CC#CO)C(=O)N=C1C(=O)C(O)=C(O)C2=C1C=CC1=C2C(C)CC2CCCCC12
238 59.0127557561 O=C=C[OH2+]
239 41.0021910721 [CH+]=C=O
240 63.0440558841 OCC[OH2+]
241 535.2074923721 CC1=CN(C(O)=C=C(O)C#C[OH2+])C(=O)N(C2=C3CCC4=C(C3=C(O)C(O)=C2O)C(C)CC2CCCCC42)C1=O Intermediate Fragment 
242 467.2176631321 C=C([OH2+])N1C=C(C)C(=O)N(C2=C3CCC4=C(C3=C(O)C(O)=C2O)C(C)CC2CCCCC42)C1=O
243 465.2020130681 C=C([OH2+])N1C=C(C)C(=O)N(C2=C3C=CC4=C(C3=C(O)C(O)=C2O)C(C)CC2CCCCC42)C1=O
244 459.1550628761 C=C([OH2+])N1C=C(C)C(=O)N(C2=C3C=CC4=C(C(C)=CC5=C4CCC=C5)C3=C(O)C(O)=C2O)C1=O
245 77.0597059481 OCCC[OH2+]
246 451.1863630041 CC1=CN(C=[OH+])C(=O)N(C2=C3C=CC4=C(C3=C(O)C(O)=C2O)C(C)CC2CCCCC42)C1=O
247 447.1550628761 CC1=CN(C=[OH+])C(=O)N(C2=C3C=CC4=C(C(C)=CC5=C4CCCC5)C3=C(O)C(O)=C2O)C1=O
248 447.1550628761 CC(=CN(C=O)C=[OH+])C(=O)N=C1C(=O)C(O)=C(O)C2=C1C=CC1=C2C(C)=CC2=C1CCCC2 Intermediate Fragment 
249 445.1394128121 CC1=CN(C=[OH+])C(=O)N(C2=C3C=CC4=C(C(C)=CC5=C4CCC=C5)C3=C(O)C(O)=C2O)C1=O
250 87.0440558841 C=C(O)C=C[OH2+]
251 71.0491412641 C=CC(=C)[OH2+]
252 71.0491412641 C#CCC[OH2+]
253 91.0753560121 CC(O)CC[OH2+]
254 493.1969276881 CC1=CN(C(=[OH+])C#CO)C(=O)N(C2=C3CCC4=C(C3=C(O)C(O)=C2O)C(C)CC2CCCCC42)C1=O
255 475.1863630041 C#CC(=[OH+])N1C=C(C)C(=O)N(C2=C3C=CC4=C(C3=C(O)C(O)=C2O)C(C)CC2CCCCC42)C1=O
256 491.1812776241 CC1=CN(C(=[OH+])C#CO)C(=O)N(C2=C3C=CC4=C(C3=C(O)C(O)=C2O)C(C)CC2CCCCC42)C1=O
257 491.1812776241 CC(=CN(C=O)C(=[OH+])C#CO)C(=O)N=C1C(=O)C(O)=C(O)C2=C1C=CC1=C2C(C)CC2CCCCC12 Intermediate Fragment 
258 489.1656275601 CC1=CN(C(=[OH+])C#CO)C(=O)N(C2=C3C=CC4=C(C3=C(O)C(O)=C2O)C(C)CC2=C4CCCC2)C1=O
259 535.2074923721 CC1=CN(C(=C=CO)OC#C[OH2+])C(=O)N(C2=C3CCC4=C(C3=C(O)C(O)=C2O)C(C)CC2CCCCC42)C1=O Intermediate Fragment 
260 535.2074923721 CC=C(O)N(C(=O)N(C)C1C=C(O)C(=C=[OH+])O1)C1=C2C=CC3=C(C2=C(O)C(O)=C1O)C(C)CC1=C3CCCC1 Intermediate Fragment 
261 481.1969276881 CC1CC2CCCCC2C2=C1C1=C(O)C(O)=C(O)C(N=C(O)[NH+](C)C3C=C(O)C(=C=O)O3)=C1C=C2
262 535.2074923721 CC=CN(C(=O)N(C=O)C1=C2C=CC3=C(C2=C(O)C(O)=C1O)C(C)CC1CCCCC31)C1C=C(O)C(=C=[OH+])O1 Intermediate Fragment 
263 507.2125777521 CC#C[NH+](C(O)=NC1=C2CCC3=C(C2=C(O)C(O)=C1O)C(C)CC1CCCCC31)C1C=C(O)C(=C=O)O1
264 535.2074923721 CC(C=O)=CN(C(O)=NC1=C2C=CC3=C(C2=C(O)C(O)=C1O)C(C)CC1CCCCC31)C1C=C(O)C(=C=[OH+])O1 Intermediate Fragment 
265 535.2074923721 CC(=CN(C=O)C1C=C(O)C(=C=[OH+])O1)C(=O)N=C1C(=O)C(O)=C(O)C2=C1CCC1=C2C(C)CC2CCCCC12 Intermediate Fragment 
266 382.2012847961 C=C(C)C(=O)[NH+]=C1C(=O)C(O)=C(O)C2=C1CCC1=C2C(C)CC2CCCCC12
267 380.1856347321 C=C(C)C(=O)[NH+]=C1C(=O)C(O)=C(O)C2=C1C=CC1=C2C(C)CC2CCCCC12
268 378.1699846681 C=C(C)C(=O)[NH+]=C1C(=O)C(O)=C(O)C2=C1C=CC1=C2C(C)CC2=C1CCCC2
269 71.0491412641 C=C(C)C=[OH+]
270 200.0917343481 CCC[NH+](CO)C1C=C(O)C(=C=O)O1
271 507.2125777521 CC(=C[NH+]=C1C=C(O)C(=C=O)O1)C(=O)N=C1C(=O)C(O)=C(O)C2=C1CCC1C3CCCCC3CC(C)C21
272 489.2020130681 C=C1OC(=[NH+]C=C(C)C(=O)N=C2C(=O)C(O)=C(O)C3=C2C=CC2=C3C(C)CC3CCCCC23)C=C1O
273 202.1073844121 CC(CO)C[NH2+]C1C=C(O)C(=CO)O1
274 489.2020130681 CC(=C[NH+]=C1C=CC(=C=O)O1)C(=O)N=C1C(=O)C(O)=C(O)C2=C1CCC1=C2C(C)CC2CCCCC12
275 507.2125777521 C=C([NH+]=C=C(C)C(=O)N=C1C(=O)C(O)=C(O)C2=C1CCC1=C2C(C)CC2CCCCC12)OC(=C=O)CO Intermediate Fragment 
276 507.2125777521 C=C(O)C(=C=O)OC=[NH+]C=C(C)C(=O)N=C1C(=O)C(O)=C(O)C2=C1CCC1=C2C(C)CC2CCCCC12 Intermediate Fragment 
277 421.1757983201 CC(=C[NH+]=C=O)C(=O)N=C1C(=O)C(O)=C(O)C2=C1C=CC1=C2C(C)CC2CCCCC12
278 507.2125777521 CC(=C[NH+]=C=C=C(O)C(=O)C=O)C(=O)N=C1C(=O)C(O)=C(O)C2=C1CCC1C3CCCCC3CC(C)C21 Intermediate Fragment 
279 507.2125777521 CC(=C=[NH+]C(O)=C=C(O)C#CO)C(=O)N=C1C(=O)C(O)=C(O)C2=C1CCC1C3CCCCC3CC(C)C21 Intermediate Fragment 
280 463.1863630041 CC(=C=[NH+]C(=O)C#CO)C(=O)N=C1C(=O)C(O)=C(O)C2=C1CCC1=C2C(C)CC2CCCCC12
281 507.2125777521 CC(=C=[NH+]C(=C=CO)OC#CO)C(=O)N=C1C(=O)C(O)=C(O)C2=C1CCC1C3CCCCC3CC(C)C21 Intermediate Fragment 
282 505.1969276881 CC(=C[NH+]=C1C=C(O)C(=C=O)O1)C(=O)N=C1C(=O)C(O)=C(O)C2=C1CCC1=C2C(C)CC2CCCCC12
283 503.1812776241 CC(=C[NH+]=C1C=C(O)C(=C=O)O1)C(=O)N=C1C(=O)C(O)=C(O)C2=C1C=CC1=C2C(C)CC2CCCCC12
284 535.2074923721 CC(=CN=C1C=C(O)C(=C=[OH+])O1)C(=O)N(C=O)C1=C2CCC3=C(C2=C(O)C(O)=C1O)C(C)CC1CCCCC31 Intermediate Fragment 
285 535.2074923721 C=C(C)C(=O)N(C(=O)N=C1C=C(O)C(=C=[OH+])O1)C1=C2CCC3=C(C2=C(O)C(O)=C1O)C(C)CC1CCCCC31 Intermediate Fragment 
286 535.2074923721 CC1=CN(C2C=C(O)C(=C=[OH+])O2)C(=O)N(C(C(O)=C=O)=C2CCC3C4CCCCC4CC(C)C3C2=C=O)C1=O Intermediate Fragment 
287 315.1186773681 CC1=CN(C2C=C(O)C(=C=[OH+])O2)C(O)N(CC(O)CO)C1O
288 477.2020130681 CC1=CN(C2C=C(O)C(=C=[OH+])O2)C(=O)N(C=C2CCC3=C(C2=C=O)C(C)CC2CCCCC32)C1=O
289 475.1863630041 CC1=CN(C2C=C(O)C(=C=[OH+])O2)C(=O)N(C=C2C=CC3=C(C2=C=O)C(C)CC2CCCCC32)C1=O
290 535.2074923721 CC1=CN(C2C=C(O)C(=C=[OH+])O2)C(=O)N(C(C=O)=C2CCC3=C(C2=C(O)C=O)C(C)CC2CCCCC32)C1=O Intermediate Fragment 
291 475.1863630041 CC1=CN(C2C=C(O)C(=C=[OH+])O2)C(=O)N(C(C=O)=C2C=C3C(=CC2)C2=C(CCCC2)CC3C)C1=O
292 503.1812776241 CC1=CN(C2C=C(O)C(=C=[OH+])O2)C(=O)N(C(C=O)=C2C=CC3=C(C2=C=O)C(C)CC2CCCCC32)C1=O
293 505.1969276881 CC1=CN(C2C=C(O)C(=C=[OH+])O2)C(=O)N(C(C=O)=C2CCC3=C(C2=C=O)C(C)CC2CCCCC32)C1=O
294 507.2125777521 CC1=CN(C2C=C(O)C(=C=[OH+])O2)C(=O)N(C=C2CCC3=C(C2=C(O)C=O)C(C)CC2CCCCC32)C1=O
295 505.1969276881 CC1=CN(C2C=C(O)C(=C=[OH+])O2)C(=O)N(C=C2C=CC3=C(C2=C(O)C=O)C(C)CC2CCCCC32)C1=O
296 535.2074923721 CC1=CN(C2C=C(O)C(=C=[OH+])O2)C(=O)N(C=C2CCC3=C(C2=C(O)C(O)=C=O)C(C)CC2CCCCC32)C1=O Intermediate Fragment 
297 255.0975480001 CC1=CN(C2C=C(O)C(=C=[OH+])O2)C(O)N(C)C1O
298 535.2074923721 CC1=CN(C2C=C(O)C(=C=[OH+])O2)C(=O)N(CC(=O)C(O)=C(O)C2=CC=CC3=C2C(C)CC2CCCCC32)C1=O Intermediate Fragment 
299 535.2074923721 CC1=CN(C2C=C(O)C(=C=[OH+])O2)C(=O)N(C(C(=O)C(O)=C=O)=C2C=C3C(C)CC4CCCCC4C3CC2)C1=O Intermediate Fragment 
300 477.2020130681 CC1=CN(C2C=C(O)C(=C=[OH+])O2)C(=O)N(C(C=O)=C2C=C3C(=CC2)C2CCCCC2CC3C)C1=O
301 451.2227485121 CC1=CN(C2C=C(O)C(=C=[OH+])O2)C(=O)N(C=C2C=C3C(C)CC4CCCCC4C3CC2)C1=O
302 449.2070984481 CC1=CN(C2C=C(O)C(=C=[OH+])O2)C(=O)N(C=C2C=C3C(=CC2)C2CCCCC2CC3C)C1=O
303 447.1914483841 CC1=CN(C2C=C(O)C(=C=[OH+])O2)C(=O)N(C=C2C=C3C(=CC2)C2=C(CCCC2)CC3C)C1=O
304 445.1757983201 CC1=CN(C2C=C(O)C(=C=[OH+])O2)C(=O)N(C=C2C=C3C(C)=CC4=C(CCCC4)C3=CC2)C1=O
305 445.1757983201 CC1=CN(C=C=C(O)C(=O)C=[OH+])C(=O)N(C=C2C=C3C(C)=CC4=C(CCCC4)C3=CC2)C1=O Intermediate Fragment 
306 445.1757983201 CC1=CN(C(O)=C=C(O)C#C[OH2+])C(=O)N(C=C2C=C3C(C)=CC4=C(CCCC4)C3=CC2)C1=O Intermediate Fragment 
307 445.1757983201 CC(=CN(C=O)C1C=C(O)C(=C=[OH+])O1)C(=O)N=C=C1C=C2C(C)=CC3=C(CCCC3)C2=CC1 Intermediate Fragment 
308 417.1808837001 CC(=C[NH+]=C1C=C(O)C(=C=O)O1)C(=O)N=C=C1C=C2C(=CC1)C1=C(CCCC1)CC2C
309 443.1601482561 CC1=CN(C2C=C(O)C(=C=[OH+])O2)C(=O)N(C=C2C=C3C(C)=CC4=C(CCC=C4)C3=CC2)C1=O
310 535.2074923721 CC1=CN(C2C=C(O)C(=C=[OH+])O2)C(=O)N(C2=C(O)C(O)=C(O)C=C2C=CC2=CC(C)CC3CCCCC23)C1=O Intermediate Fragment 
311 535.2074923721 CCC1=C(C2CCCCC2C)C=CC2=C(N3C(=O)C(C)=CN(C4C=C(O)C(=C=[OH+])O4)C3=O)C(O)=C(O)C(O)=C21 Intermediate Fragment 
312 535.2074923721 CC1=CN(C2C=C(O)C(=C=[OH+])O2)C(=O)N(C2=C3C=CC=C(C(C)CC4CCCCC4)C3=C(O)C(O)=C2O)C1=O Intermediate Fragment 
313 117.0698767081 CC#[CH+]C1=CC=CC=C1
314 535.2074923721 CC1=CN(C2C=C(O)C(=C=[OH+])O2)C(=O)N(C2=C3C=CC(C4CCCCC4)=C(C(C)C)C3=C(O)C(O)=C2O)C1=O Intermediate Fragment 
315 535.2074923721 CCCC1CC(C)C2=C(C=CC3=C(N4C(=O)C(C)=CN(C5C=C(O)C(=C=[OH+])O5)C4=O)C(O)=C(O)C(O)=C32)C1C Intermediate Fragment 
316 493.1605421801 CC1=CN(C2C=C(O)C(=C=[OH+])O2)C(=O)N(C2=C3C=CC4=C(C3=C(O)C(O)=C2O)C(C)CCC4C)C1=O
317 495.1761922441 CC1=CN(C2C=C(O)C(=C=[OH+])O2)C(=O)N(C2=C3CCC4=C(C3=C(O)C(O)=C2O)C(C)CCC4C)C1=O
318 535.2074923721 CCCCC1CC2=C(C3=C(O)C(O)=C(O)C(N4C(=O)C(C)=CN(C5C=C(O)C(=C=[OH+])O5)C4=O)=C3C=C2)C(C)C1 Intermediate Fragment 
319 535.2074923721 CCCCC1CCC(C)C2=C1C=CC1=C(N3C(=O)C(C)=CN(C4C=C(O)C(=C=[OH+])O4)C3=O)C(O)=C(O)C(O)=C12 Intermediate Fragment 
320 485.1918423081 CC1=CN(C2C=C(O)C(=C=[OH+])O2)C(=O)N(C2=C3CCC4CCCC(C)C4C3=C(O)C(O)C2O)C1=O
321 479.1448921161 CC1=CN(C2C=C(O)C(=C=[OH+])O2)C(=O)N(C2=C3C=CC4=C(C3=C(O)C(O)=C2O)C(C)CCC4)C1=O
322 533.1918423081 CC1=CN(C2C=C(O)C(=C=[OH+])O2)C(=O)N(C2=C3C=CC4=C(C3=C(O)C(O)=C2O)C(C)CC2CCCCC42)C1=O
