#In-silico ESI-MS/MS [M+H]+ Spectra
#PREDICTED BY CFM-ID 4.0.8
#SMILES=n12c(nc3c(c1=O)[nH]c(=O)n3[C@@H]1O[C@H](CO)[C@@H](C1)O)[nH]c(=O)cc2
#InChiKey=LPGQILOTBACCJF-ATRFCDNQSA-N
energy0
220.04652 31.48 20 28 45 23 39 33 32 26 38 41 36 44 (21.44 0.89558 0.054974 0.035965 0.034683 0.016462 0.0050152 0.0044804 0.0031211 0.0019159 0.0015922 0.0011824)
336.09386 100.00 0 197 141 102 192 241 172 135 139 222 89 177 104 107 88 239 226 128 237 (70.205 0.64087 0.21679 0.096793 0.096003 0.051776 0.042689 0.028448 0.022862 0.015964 0.00803 0.0075971 0.0062077 0.0044874 0.001384 0.0010909 0.0009301 0.00023083 0.00012842)
energy1
192.05160 5.62 27 37 40 (2.4196 0.43646 0.19898)
220.04652 100.00 20 28 36 45 32 39 23 26 38 41 44 33 (50.361 2.2158 0.55632 0.37244 0.30061 0.22572 0.11625 0.10529 0.045217 0.032771 0.026099 0.0093094)
246.06217 3.66 73 161 (1.9886 0.00064769)
318.08329 11.60 62 142 86 75 78 82 66 69 65 80 1 87 2 81 67 (4.8134 0.62564 0.25758 0.23378 0.10151 0.067834 0.051764 0.027451 0.027068 0.024181 0.02239 0.021114 0.02066 0.0069898 0.0028318)
336.09386 27.61 0 197 141 172 102 177 241 89 135 192 104 139 222 88 226 237 107 239 128 (12.489 0.93528 0.63942 0.20564 0.15947 0.13537 0.13251 0.093884 0.066477 0.041413 0.028935 0.026802 0.02283 0.009217 0.0079778 0.0064424 0.0053789 0.0020453 0.00047406)
energy2
43.01784 8.15 206 (0.96613)
45.03349 10.78 153 (1.2777)
57.03349 100.00 13 (11.857)
71.04914 30.00 174 175 (2.4646 1.0927)
151.02505 10.78 48 (1.2787)
177.04070 43.67 47 34 (2.7407 2.4368)
179.05635 8.38 228 130 131 (0.53863 0.30538 0.14922)
202.03595 6.92 21 22 (0.44417 0.3766)
205.03562 12.87 109 214 243 133 132 (1.2063 0.24351 0.067261 0.0077708 0.00098114)
208.08290 6.94 53 52 (0.41887 0.40408)
219.05127 10.80 181 (1.2805)
220.04652 90.21 20 28 45 38 36 41 26 39 23 32 33 44 (3.5347 2.2542 1.3502 0.90075 0.69542 0.43362 0.34128 0.3343 0.31317 0.23203 0.21381 0.092273)
222.06217 18.52 49 (2.1964)
224.07782 10.68 50 (1.2668)
226.09347 15.44 51 54 58 57 55 56 (1.1196 0.23408 0.1482 0.1114 0.11058 0.10698)
230.06725 8.64 156 (1.0239)
244.04652 21.88 162 (2.5939)
246.06217 66.16 161 73 (4.2952 3.5499)
248.07782 14.41 76 159 160 158 157 (0.5412 0.36656 0.32211 0.26145 0.21696)
250.05708 23.11 176 (2.7396)
258.06217 19.27 146 (2.2849)
260.07782 15.96 145 (1.8927)
268.10403 10.50 189 (1.2448)
275.07748 7.18 116 111 84 (0.70061 0.092269 0.058159)
276.07273 21.76 194 71 148 150 149 147 (0.97186 0.61058 0.3047 0.24974 0.23074 0.21217)
277.05675 7.79 238 (0.92421)
291.07240 15.14 231 120 121 119 (1.6602 0.065896 0.053839 0.015246)
306.08329 7.56 60 190 235 (0.52459 0.25231 0.11898)
308.09894 10.08 191 224 61 138 100 96 223 99 94 137 (0.34611 0.27035 0.2698 0.10708 0.060814 0.049082 0.04204 0.032557 0.010321 0.0072205)
334.07821 8.41 221 (0.99673)

0 336.0938595881 O=c1ccn2c(=[OH+])c3[nH]c(=O)n(C4CC(O)C(CO)O4)c3nc2[nH]1
1 318.0832949041 O=C=C1OC(N2C([OH2+])=NC3=C2N=C2N=C(O)CCN2C3)C=C1O
2 318.0832949041 O=C=C1OC(N2C=NC3=C2N=C2NC(O)CCN2C3=[OH+])C=C1O
3 204.0516008521 O=C1CCN2C(=[OH+])C3=NC=NC3=NC2=N1
4 119.0702706321 OC1CCOC1C[OH2+]
5 119.0702706321 O=CCC(O)CC[OH2+] Intermediate Fragment 
6 117.0546205681 OC1CCOC1=C[OH2+]
7 89.0597059481 [OH2+]C1CCOC1
8 99.0440558841 C=C1OCC=C1[OH2+]
9 99.0440558841 [OH+]=C=C1CCCO1
10 117.0546205681 CCC(O)C(=O)C=[OH+] Intermediate Fragment 
11 99.0440558841 CC=C(O)C#C[OH2+]
12 59.0491412641 CC=C[OH2+]
13 57.0334912001 CC#C[OH2+]
14 117.0546205681 O=CCC(O)C=C[OH2+] Intermediate Fragment 
15 89.0597059481 CC(O)C=C[OH2+]
16 117.0546205681 OCCCOC#C[OH2+] Intermediate Fragment 
17 117.0546205681 CCOC(=C=[OH+])CO Intermediate Fragment 
18 115.0389705041 OC1CCOC1=C=[OH+]
19 218.0308654081 O=C1N=C2N=C3N=C(O)C=CN3C(=[OH+])C2=N1
20 220.0465154721 O=C1N=C2C(=[OH+])N3C=CC(O)=NC3=NC2N1
21 202.0359507881 O=C1C=CN2C(=[OH+])C3=NC=NC3=NC2=N1
22 202.0359507881 O=C1N=C2N=C3N=CC=CN3C(=[OH+])C2=N1
23 220.0465154721 N=C1N=C(O)C=CN1C(=[OH+])C1=NC(=O)N=C1 Intermediate Fragment 
24 138.0298027881 N=C1N=C(O)C=CN1C#[O+]
25 109.0032536921 O=C1N=CC(C#[O+])=N1
26 220.0465154721 [O+]#CN1C=CC(O)=NC1=NC1=CN=C(O)N1 Intermediate Fragment 
27 192.0516008521 O=C1N=CC(=[NH+]C2=NC=CC(O)=N2)N1
28 220.0465154721 OC1=NC(N=C2NC(O)=NC2=C=[OH+])=NC=C1 Intermediate Fragment 
29 124.0141527241 N=C1NC(=O)N=C1C#[O+]
30 97.0396392001 [OH2+]C1=NC=NC=C1
31 112.0505382321 [NH3+]C1=NC=CC(O)=N1
32 220.0465154721 N=C1NC(=O)N=C1C(=[OH+])N1C=CC(=O)N=C1 Intermediate Fragment 
33 220.0465154721 NC(=O)N=C1C=NC2=NC(=O)C=CN2C1=[OH+] Intermediate Fragment 
34 177.0407018201 [NH2+]=C1C=NC2=NC(=O)C=CN2C1=O
35 203.0199663761 O=C=[N+]=C1C=NC2=NC(=O)C=CN2C1=O
36 220.0465154721 NC1=C(N=C=O)C(=[OH+])N2C=CC(O)=NC2=N1 Intermediate Fragment 
37 192.0516008521 N=C1N=C2N=C(O)C=CN2C(=O)C1=[NH2+]
38 220.0465154721 NC1=C(N=C=O)N=C2N=C(O)C=CN2C1=[OH+] Intermediate Fragment 
39 220.0465154721 NC1=NC2=C(N=C(O)N2)C(=[OH+])N1C=C=C=O Intermediate Fragment 
40 192.0516008521 C#CN1C(=O)C2=NC(=O)NC2N=C1[NH3+]
41 220.0465154721 C=CN1C(=[OH+])C2=C(N=C1N=C=O)NC(O)=N2 Intermediate Fragment 
42 173.0094016921 [C+]#CN1C=NC2=NC(=O)N=C2C1=O
43 175.0250517561 C#CN1C=NC2=NC(=O)N=C2C1=[OH+]
44 220.0465154721 C=CC(O)=NC1=NC(=[OH+])C2=NC(=O)NC2=N1 Intermediate Fragment 
45 220.0465154721 N=C(O)C=CN1C=NC2=NC(=O)N=C2C1=[OH+] Intermediate Fragment 
46 203.0199663761 O=C=C=[C+]N1C=NC2=C(N=C(O)N2)C1=O
47 177.0407018201 C#CN1C=NC2NC(=O)N=C2C1=[OH+]
48 151.0250517561 O=C1N=C2C(=[OH+])N=CN=C2N1
49 222.0621655361 O=C1N=C2C(=[OH+])N3CCC(O)=NC3=NC2N1
50 224.0778156001 O=C1N=C2C(=[OH+])N3CCC(O)NC3=NC2N1
51 226.0934656641 OC1CCN2C(=[OH+])C3=NC(O)NC3N=C2N1
52 208.0829009801 OC1CCN2C(=[OH+])C3=C(N=C2N1)NC=N3
53 208.0829009801 OC1=NC2=C(N=C3NCCCN3C2=[OH+])N1
54 226.0934656641 OC1CCN=C(N=C2NC(O)NC2=C=[OH+])N1 Intermediate Fragment 
55 226.0934656641 N=C1NC(O)=NC1=C([OH2+])N1C=NC(O)CC1 Intermediate Fragment 
56 226.0934656641 N=C(O)NC1=CC(=[OH+])N2CCC(O)NC2=N1 Intermediate Fragment 
57 226.0934656641 NC1=C(NC=O)N=C2NC(O)CCN2C1=[OH+] Intermediate Fragment 
58 226.0934656641 NC(O)CCN1C=NC2=C(N=C(O)N2)C1=[OH+] Intermediate Fragment 
59 304.0676448401 OC1=COC(N2C(O)=NC3=C2N=C2N=C(O)C=CN2C3=[OH+])C1
60 306.0832949041 OC1=COC(N2C(O)=NC3=C2N=C2N=C(O)CCN2C3=[OH+])C1
61 308.0989449681 OC1=COC(N2C(O)=NC3=C2N=C2NC(O)CCN2C3=[OH+])C1
62 318.0832949041 C=C1OC(N2C(O)=NC3=C2N=C2N=C(O)CCN2C3=[OH+])C=C1O
63 300.0727302201 C=C1C=CC(N2C(O)=NC3=C2N=C2N=C(O)C=CN2C3=[OH+])O1
64 300.0727302201 C=C1OC(N2C(O)=NC3=C2N=C2N=CC=CN2C3=[OH+])C=C1O
65 318.0832949041 C=C1OC(N2C(N=C3N=C(O)C=CN3C=[OH+])=CN=C2O)C=C1O Intermediate Fragment 
66 318.0832949041 C=C1OC(N2C(O)=NC(=C=[OH+])C2=NC2=NCCC(O)=N2)C=C1O Intermediate Fragment 
67 318.0832949041 C=C1OC(N(C(=N)O)C2=CC(=[OH+])N3C=CC(O)=NC3=N2)C=C1O Intermediate Fragment 
68 301.0567458081 C=C1OC(=[N+](C=O)C2=CC(=O)N3C=CC(O)=NC3=N2)C=C1O
69 318.0832949041 CC(=O)C(O)=CCN1C(O)=NC2=C1N=C1N=C(O)C=CN1C2=[OH+] Intermediate Fragment 
70 300.0727302201 C#CC(O)=CCN1C(O)=NC2=C1N=C1N=C(O)C=CN1C2=[OH+]
71 276.0727302201 OC#CCN1C(O)=NC2=C1N=C1N=C(O)CCN1C2=[OH+]
72 274.0570801561 OC#CCN1C(O)=NC2=C1N=C1N=C(O)C=CN1C2=[OH+]
73 246.0621655361 C=CN1C(O)=NC2=C1N=C1N=C(O)C=CN1C2=[OH+]
74 232.0465154721 CN1C(=O)N=C2C(=[OH+])N3C=CC(=O)N=C3N=C21
75 318.0832949041 C=C(C=O)OC(C)N1C(O)=NC2=C1N=C1N=C(O)C=CN1C2=[OH+] Intermediate Fragment 
76 248.0778156001 CCN1C(O)=NC2=C1N=C1N=C(O)C=CN1C2=[OH+]
77 264.0727302201 CC(=O)N1C(=O)N=C2C(=[OH+])N3CCC(O)N=C3N=C21
78 318.0832949041 C#COC(C=C=O)N1C(O)=NC2=C1N=C1NC(O)CCN1C2=[OH+] Intermediate Fragment 
79 292.0676448401 O=C(C#CO)N1C(O)=NC2=C1N=C1NC(O)CCN1C2=[OH+]
80 318.0832949041 C#CC(O)=CC(=O)N1C(O)=NC2=C1N=C1NC(O)CCN1C2=[OH+] Intermediate Fragment 
81 318.0832949041 C=C1OC(N2C(O)=NC3=C2N=C(N=C=O)N(CC)C3=[OH+])C=C1O Intermediate Fragment 
82 318.0832949041 C=C1OC(N2C(O)=NC3=C2N=CN(C=CC(=N)O)C3=[OH+])C=C1O Intermediate Fragment 
83 301.0567458081 C=C1OC(N2C(O)=NC3=C2N=CN(C=C=C=O)C3=[OH+])C=C1O
84 275.0774812521 C=CN1C=NC2=C(N=C(O)N2C2C=C(O)C(=C)O2)C1=[OH+]
85 273.0618311881 C#CN1C=NC2=C(N=C(O)N2C2C=C(O)C(=C)O2)C1=[OH+]
86 318.0832949041 O=C=C1OC(N2C(O)=NC3=C2N=C2NCCCN2C3=[OH+])C=C1O
87 318.0832949041 O=CC(=O)C(O)=CCN1C(O)=NC2=C1N=C1N=CCCN1C2=[OH+] Intermediate Fragment 
88 336.0938595881 N=C1NC(O)CCN1C(=[OH+])C1=CN(C2C=C(O)C(=C=O)O2)C(O)=N1 Intermediate Fragment 
89 336.0938595881 O=C=C1OC(N2C(N=C3NC(O)CCN3C=[OH+])=CN=C2O)C=C1O Intermediate Fragment 
90 214.0822322841 [NH2+]=C1C=NC(=O)N1C1CC(O)C(CO)O1
91 214.0822322841 [NH2+]=C1C=NC(=O)N1C(=O)CC(O)CCO Intermediate Fragment 
92 212.0665822201 [NH2+]=C1C=NC(=O)N1C1CC(O)C(=CO)O1
93 140.0454528521 [NH2+]=C1N=C(O)C=CN1C=O
94 308.0989449681 O=C=C1OC(N2C(=O)N=CC2=[NH+]C2=NCCC(O)N2)CC1O
95 198.0985510441 OC1CCN=C([NH+]=C2C=NC(O)N2)N1
96 308.0989449681 NCCC(O)N=C=[NH+]C1=CN=C(O)N1C1C=C(O)C(=C=O)O1 Intermediate Fragment 
97 224.0665822201 C=[NH+]C1=CN=C(O)N1C1CC(O)C(=C=O)O1
98 281.0880459361 CC(O)NC=[NH+]C1=CN=C(O)N1C1C=C(O)C(=C=O)O1
99 308.0989449681 O=CC(=O)C(O)=CCN1C(=O)N=CC1=[NH+]C1=NCCC(O)N1 Intermediate Fragment 
100 308.0989449681 O=C(CC(O)C#CO)N1C(=O)N=CC1=[NH+]C1=NCCC(O)N1 Intermediate Fragment 
101 304.0676448401 O=C=C1OC(N2C(=O)N=CC2=[NH+]C2=NCCC(O)=N2)C=C1O
102 336.0938595881 O=C=C1OC(N2C(O)=NC(=C=[OH+])C2=NC2=NCCC(O)N2)CC1O Intermediate Fragment 
103 225.0505978081 O=C=C1OC(N2C=C(C=[OH+])N=C2O)CC1O
104 336.0938595881 N=C1C(=C([OH2+])N2C=NC(O)CC2)N=C(O)N1C1C=C(O)C(=C=O)O1 Intermediate Fragment 
105 240.0614968401 [NH2+]=C1C(=C=O)N=C(O)N1C1CC(O)C(=CO)O1
106 126.0298027881 [NH2+]=C1NC(=O)N=C1C=O
107 336.0938595881 N=C(O)N(C1=CC(=[OH+])N2CCC(O)NC2=N1)C1C=C(O)C(=C=O)O1 Intermediate Fragment 
108 319.0673104921 O=C=C1OC([NH+](C=O)C2=CC(=O)N3CCC(O)=NC3=N2)C=C1O
109 205.0356164401 O=C=[NH+]C1=CC(=O)N2C=CC(O)=NC2=N1
110 293.0880459361 O=C=C1OC(=[NH+]C2=CC(=O)N3CCC(O)NC3=N2)CC1O
111 275.0774812521 C=C1OC(=[NH+]C2=CC(=O)N3CCC(O)=NC3=N2)C=C1O
112 293.0880459361 O=CC(=O)C(O)=CC=[NH+]C1=CC(=O)N2CCC(O)NC2=N1 Intermediate Fragment 
113 293.0880459361 C=C(O)C(=C=O)OC=[NH+]C1=CC(=O)N2CCC(O)NC2=N1 Intermediate Fragment 
114 293.0880459361 CC(=[NH+]C1=CC(=O)N2CCC(O)NC2=N1)OC(=C=O)C=O Intermediate Fragment 
115 293.0880459361 O=C1C=C([NH+]=C(O)C=C(O)C#CO)N=C2NC(O)CCN12 Intermediate Fragment 
116 275.0774812521 O=C1C=C([NH+]=CC=C(O)C#CO)N=C2N=C(O)CCN12
117 251.0774812521 O=C1C=C([NH+]=C(O)C#CO)N=C2NC(O)CCN12
118 249.0618311881 O=C1C=C([NH+]=C(O)C#CO)N=C2N=C(O)CCN12
119 291.0723958721 O=C=C1OC(=[NH+]C2=CC(=O)N3CCC(O)NC3=N2)C=C1O
120 291.0723958721 O=CC(=O)C(O)=CC=[NH+]C1=CC(=O)N2CCC(O)=NC2=N1 Intermediate Fragment 
121 291.0723958721 O=C1C=C([NH+]=C(O)C=C(O)C#CO)N=C2N=C(O)CCN12 Intermediate Fragment 
122 166.0611029161 OC1=NC2=NC=CC(=[OH+])N2CC1
123 164.0454528521 OC1=NC2=NC=CC(=[OH+])N2C=C1
124 164.0454528521 C=CN=C1N=C(O)C=CN1C#[O+] Intermediate Fragment 
125 164.0454528521 OC1=NC(N=C=C=C=[OH+])=NCC1 Intermediate Fragment 
126 134.0348881681 [CH+]=C=NC1=NC=CC(O)=N1
127 136.0505382321 C=C=[NH+]C1=NC=CC(O)=N1
128 336.0938595881 O=C=C1OC(=NC(O)=NC2=CN=C3NC(O)CCN3C2=[OH+])CC1O Intermediate Fragment 
129 160.0604342201 O=C=[NH+]C1CC(O)C(CO)O1
130 179.0563518841 [NH2+]=C1C=NC2=NC(=O)CCN2C1=O
131 179.0563518841 [NH3+]C(=C=NC1=NC=CC(O)=N1)C=O Intermediate Fragment 
132 205.0356164401 O=C[NH+]=C1C=NC2=NC(=O)C=CN2C1=O
133 205.0356164401 O=C=[NH+]C(=C=NC1=NC=CC(O)=N1)C=O Intermediate Fragment 
134 207.0512665041 O=C[NH+]=C1C=NC2=NC(=O)CCN2C1=O
135 336.0938595881 O=C=NC1=C(N=C2CC(O)C(=CO)O2)N=C2NC(O)CCN2C1=[OH+] Intermediate Fragment 
136 289.0567458081 O=C=C1OC(=[NH+]C2=CC(=O)N3CCC(O)=NC3=N2)C=C1O
137 308.0989449681 [NH3+]C1=C(N=C2CC(O)C(=C=O)O2)N=C2NC(O)CCN2C1=O
138 308.0989449681 [NH3+]C1=C(N=C(O)C=C(O)C#CO)N=C2NC(O)CCN2C1=O Intermediate Fragment 
139 336.0938595881 NC1=C(N(C=O)C2C=C(O)C(=C=O)O2)N=C2NC(O)CCN2C1=[OH+] Intermediate Fragment 
140 183.0876520121 [NH2+]=C1C=NC2NC(O)CCN2C1=O
141 336.0938595881 O=CC(=O)C(O)=CCN1C(O)=NC2=C1N=C1NC(O)CCN1C2=[OH+] Intermediate Fragment 
142 318.0832949041 OC#CC(O)=CCN1C(O)=NC2=C1N=C1N=C(O)CCN1C2=[OH+]
143 280.1040303481 OC=CCN1C(O)=NC2=C1N=C1NC(O)CCN1C2=[OH+]
144 278.0883802841 OC#CCN1C(O)=NC2=C1N=C1NC(O)CCN1C2=[OH+]
145 260.0778156001 C#CCN1C(O)=NC2=C1N=C1N=C(O)CCN1C2=[OH+]
146 258.0621655361 C#CCN1C(O)=NC2=C1N=C1N=C(O)C=CN1C2=[OH+]
147 276.0727302201 OC#CCN1C(N=C2N=C(O)C=CN2C=[OH+])=CN=C1O Intermediate Fragment 
148 276.0727302201 OC#CC=NC(O)=NC1=CN=C2N=C(O)CCN2C1=[OH+] Intermediate Fragment 
149 276.0727302201 NC1=C(N(C=O)CC#CO)N=C2N=C(O)C=CN2C1=[OH+] Intermediate Fragment 
150 276.0727302201 N=C(O)C=CN1C=NC2=C(N=C(O)N2CC#CO)C1=[OH+] Intermediate Fragment 
151 274.0570801561 N=C(O)C=CN1C=NC2=C(N=C(O)N2[CH+]C#CO)C1=O Intermediate Fragment 
152 63.0440558841 OCC[OH2+]
153 45.0334912001 C=C[OH2+]
154 252.1091157281 CCN1C(O)=NC2=C1N=C1NC(O)CCN1C2=[OH+]
155 250.0934656641 CCN1C(O)=NC2=C1N=C1N=C(O)CCN1C2=[OH+]
156 230.0672509161 C=CN1C=NC2=C1N=C1N=C(O)C=CN1C2=[OH+]
157 248.0778156001 CCN1C(O)=NC(=C=[OH+])C1=NC1=NC=CC(O)=N1 Intermediate Fragment 
158 248.0778156001 CC=NC(O)=NC1=CN=C2N=C(O)C=CN2C1=[OH+] Intermediate Fragment 
159 248.0778156001 C=CN(C=O)C1=C(N)C(=[OH+])N2C=CC(O)=NC2=N1 Intermediate Fragment 
160 248.0778156001 C=CN1C(O)=NC2=C1N=CN(C=CC(=N)O)C2=[OH+] Intermediate Fragment 
161 246.0621655361 C=C=NC(O)=NC1=CN=C2N=C(O)C=CN2C1=[OH+] Intermediate Fragment 
162 244.0465154721 C#CN1C(O)=NC2=C1N=C1N=C(O)C=CN1C2=[OH+]
163 91.0389705041 OCC(=[OH+])CO
164 73.0284058201 OCC#C[OH2+]
165 73.0284058201 CC(=[OH+])C=O
166 93.0546205681 OCC([OH2+])CO
167 75.0440558841 OCC=C[OH2+]
168 75.0440558841 CC(=[OH+])CO
169 234.0621655361 CN1C(=O)N=C2C(=[OH+])N3CCC(=O)N=C3N=C21
170 230.0308654081 [CH2+]N1C(=O)N=C2C(=O)N3C=CC(=O)N=C3N=C21
171 105.0546205681 CC(O)C(=[OH+])CO
172 336.0938595881 C=C(O)C(=C=O)OCN1C(O)=NC2=C1N=C1NC(O)CCN1C2=[OH+] Intermediate Fragment 
173 232.0465154721 CN1C(=O)N=CC1=NC1=NC(=O)C=CN1C#[O+] Intermediate Fragment 
174 71.0491412641 C#CC(C)[OH2+]
175 71.0491412641 CCC#C[OH2+]
176 250.0570801561 O=CN1C(O)=NC2=C1N=C1N=C(O)CCN1C2=[OH+]
177 336.0938595881 CC(OC(=C=O)C=O)N1C(O)=NC2=C1N=C1NC(O)CCN1C2=[OH+] Intermediate Fragment 
178 260.0414300921 [CH2+]C(=O)N1C(O)=NC2=C1N=C1N=C(O)C=CN1C2=O
179 262.0570801561 CC(=O)N1C(O)=NC2=C1N=C1N=C(O)C=CN1C2=[OH+]
180 262.0570801561 [CH2+]C(=O)N(C(=N)O)C1=CC(=O)N2C=CC(O)=NC2=N1 Intermediate Fragment 
181 219.0512665041 [CH2+]C(O)=NC1=CC(=O)N2C=CC(O)=NC2=N1
182 262.0570801561 CC(O)=NC1=C(N=C=O)C(=[OH+])N2C=CC(O)=NC2=N1 Intermediate Fragment 
183 262.0570801561 [CH2+]C(=O)N1C(O)=NC2=C1N=CN(C=CC(=N)O)C2=O Intermediate Fragment 
184 264.0727302201 CC(=O)N1C(O)=NC(=C=[OH+])C1=NC1=NCCC(O)=N1 Intermediate Fragment 
185 264.0727302201 CC(=O)N(C(=N)O)C1=CC(=[OH+])N2C=CC(O)=NC2=N1 Intermediate Fragment 
186 247.0461811241 CC(=O)N(C#[O+])C1=CC(=O)N2C=CC(O)=NC2=N1
187 264.0727302201 CC(=O)N1C(O)=NC2=C1N=CN(C=CC(=N)O)C2=[OH+] Intermediate Fragment 
188 266.0883802841 CC(=O)N1C(O)=NC2=C1N=C1NC(O)CCN1C2=[OH+]
189 268.1040303481 CC(O)N1C(O)=NC2=C1N=C1NC(O)CCN1C2=[OH+]
190 306.0832949041 CC(OC#CO)N1C(O)=NC2=C1N=C1N=C(O)CCN1C2=[OH+]
191 308.0989449681 CC(OC#CO)N1C(O)=NC2=C1N=C1NC(O)CCN1C2=[OH+]
192 336.0938595881 OC#COC(C=CO)N1C(O)=NC2=C1N=C1NC(O)CCN1C2=[OH+] Intermediate Fragment 
193 294.0832949041 O=C(C=CO)N1C(O)=NC2=C1N=C1NC(O)CCN1C2=[OH+]
194 276.0727302201 C#CC(=O)N1C(O)=NC2=C1N=C1NC(O)CCN1C2=[OH+]
195 292.0676448401 OC#COCN1C(O)=NC2=C1N=C1N=C(O)CCN1C2=[OH+]
196 290.0519947761 OC#COCN1C(O)=NC2=C1N=C1N=C(O)C=CN1C2=[OH+]
197 336.0938595881 O=C(CC(O)C#CO)N1C(O)=NC2=C1N=C1NC(O)CCN1C2=[OH+] Intermediate Fragment 
198 290.0519947761 O=C(C#CO)N1C(O)=NC2=C1N=C1N=C(O)CCN1C2=[OH+]
199 272.0414300921 O=C1C2=C(N=C3N=C(O)C=CN13)N([CH+]C#CO)C(O)=N2
200 248.0414300921 O=CN1C(=O)N=C2C(=[OH+])N3CCC(=O)N=C3N=C21
201 47.0491412641 CC[OH2+]
202 29.0385765801 C=[CH3+]
203 68.9971056921 [O+]#CC#CO
204 41.0021910721 [C+]#CO
205 71.0127557561 O=CC#C[OH2+]
206 43.0178411361 C#C[OH2+]
207 55.0178411361 C#CC=[OH+]
208 252.0727302201 O=CN1C(O)=NC2=C1N=C1NC(O)CCN1C2=[OH+]
209 248.0414300921 O=CN1C(N=C2N=C(O)C=CN2C#[O+])=CN=C1O Intermediate Fragment 
210 248.0414300921 N=C(O)N(C#[O+])C1=CC(=O)N2C=CC(O)=NC2=N1 Intermediate Fragment 
211 248.0414300921 O=C=NC(O)=NC1=CN=C2N=C(O)C=CN2C1=[OH+] Intermediate Fragment 
212 248.0414300921 NC1=C(N(C#[O+])C=O)N=C2N=C(O)C=CN2C1=O Intermediate Fragment 
213 248.0414300921 N=C(O)C=CN1C=NC2=C(N=C(O)N2C#[O+])C1=O Intermediate Fragment 
214 205.0356164401 C#CN1C=NC2=C(N=C(O)N2C=O)C1=[OH+]
215 246.0257800281 O=C1C2=C(N=C3N=C(O)C=CN13)N(C#[O+])C(O)=N2
216 87.0440558841 CC(O)C#C[OH2+]
217 69.0334912001 C=CC#C[OH2+]
218 91.0753560121 CC(O)CC[OH2+]
219 73.0647913281 C=CC(C)[OH2+]
220 73.0647913281 CCC=C[OH2+]
221 334.0782095241 O=C(C=C(O)C#CO)N1C(O)=NC2=C1N=C1NC(O)CCN1C2=[OH+]
222 336.0938595881 NC1=NC2=C(N=C(O)N2C2C=C(O)C(=C=O)O2)C(=[OH+])N1CCCO Intermediate Fragment 
223 308.0989449681 CCN1C(=O)C2=C(N=C1[NH3+])N(C1CC(O)C(=C=O)O1)C(O)=N2
224 308.0989449681 CCN1C(=O)C2=C(N=C1[NH3+])N(C(=O)CC(O)C#CO)C(O)=N2 Intermediate Fragment 
225 294.0832949041 CN1C(=O)C2=C(N=C1[NH3+])N(C1CC(O)C(=C=O)O1)C(O)=N2
226 336.0938595881 CCN1C(=[OH+])C2=C(N=C1NCO)N(C1C=C(O)C(=C=O)O1)C(O)=N2 Intermediate Fragment 
227 289.0567458081 C=CN1C=NC2=C(N=C(O)N2C2C=C(O)C(=C=O)O2)C1=[OH+]
228 179.0563518841 C=CN1C=NC2NC(=O)N=C2C1=[OH+]
229 289.0567458081 C#CN1C=NC2=C(N=C(O)N2CC=C(O)C(=O)C=O)C1=[OH+] Intermediate Fragment 
230 289.0567458081 C=CN1C=NC2=C(N=C(O)N2C(=O)C=C(O)C#CO)C1=[OH+] Intermediate Fragment 
231 291.0723958721 CCN1C=NC2=C(N=C(O)N2C2C=C(O)C(=C=O)O2)C1=[OH+]
232 293.0880459361 CCN1C=NC2=C(N=C(O)N2C2CC(O)C(=C=O)O2)C1=[OH+]
233 293.0880459361 CCN1C=NC2=C(N=C(O)N2C(=O)CC(O)C#CO)C1=[OH+] Intermediate Fragment 
234 304.0676448401 C=CN1C(=O)C2=C(N=C1[NH3+])N(C1C=C(O)C(=C=O)O1)C(O)=N2
235 306.0832949041 CCN1C(=O)C2=C(N=C1[NH3+])N(C1C=C(O)C(=C=O)O1)C(O)=N2
236 310.0782095241 O=C=C1OC(N2C(O)=NC3=C(O)N=C([NH2+]CO)N=C32)CC1O
237 336.0938595881 CC(O)NC1=NC2=C(N=C(O)N2C2C=C(O)C(=C=O)O2)C(=[OH+])N1C Intermediate Fragment 
238 277.0567458081 CN1C=NC2=C(N=C(O)N2C2C=C(O)C(=C=O)O2)C1=[OH+]
239 336.0938595881 CCC(O)NC1=NC([OH2+])=C2N=C(O)N(C3C=C(O)C(=C=O)O3)C2=N1 Intermediate Fragment 
240 284.0989449681 [NH3+]C1=NC(O)=C2N=C(O)N(C3CC(O)C(CO)O3)C2=N1
241 336.0938595881 NC(O)CCN1C=NC2=C(N=C(O)N2C2C=C(O)C(=C=O)O2)C1=[OH+] Intermediate Fragment 
242 319.0673104921 O=C=C1OC(N2C(O)=NC3=C2N=CN(CCC=O)C3=[OH+])C=C1O
243 205.0356164401 O=C=C=CN1C=NC2NC(=O)N=C2C1=[OH+]
244 207.0512665041 O=C=CCN1C=NC2NC(=O)N=C2C1=[OH+]
245 209.0669165681 O=CCCN1C=NC2NC(=O)N=C2C1=[OH+]
246 319.0673104921 O=C=CCN(C=[OH+])C=NC1=CN=C(O)N1C1C=C(O)C(=C=O)O1 Intermediate Fragment 
247 319.0673104921 O=C=CCN1C=NC2=C(N=C(O)N2CC=C(O)C(=O)C=O)C1=[OH+] Intermediate Fragment 
248 319.0673104921 O=CCCN1C=NC2=C(N=C(O)N2C(=O)C=C(O)C#CO)C1=[OH+] Intermediate Fragment 
249 46.0287401681 [NH2+]=CO
250 44.0130901041 [NH+]#CO
251 275.0410957441 [CH2+]N1C=NC2=C(N=C(O)N2C2C=C(O)C(=C=O)O2)C1=O
252 267.0723958721 OC=C1OC(N2C(O)=NC3=C([OH2+])N=CN=C32)CC1O
253 267.0723958721 O=C(CC(O)C=CO)N1C(O)=NC2=C([OH2+])N=CN=C21 Intermediate Fragment 
254 265.0567458081 O=C=C1OC(N2C(O)=NC3=C([OH2+])N=CN=C32)CC1O
255 263.0410957441 O=C=C1OC(N2C(O)=NC3=C([OH2+])N=CN=C32)CC1=O
