#In-silico ESI-MS/MS [M+H]+ Spectra
#PREDICTED BY CFM-ID 4.0.8
#InChI=1S/C22H22N6O4/c23-21-26-19-18(20(31)27-21)25-22(28(19)17-10-15(30)16(11-29)32-17)24-14-8-6-13(7-9-14)12-4-2-1-3-5-12/h1-9,15-17,29-30H,10-11H2,(H,24,25)(H3,23,26,27,31)/t15-,16-,17-/m1/s1
#InChiKey=JPQHAFBEGLGQRF-BRWVUGGUSA-N
energy0
435.17753 100.00 0 164 192 145 116 157 217 209 120 135 208 226 220 212 211 136 144 228 229 142 223 (78.837 0.62847 0.22003 0.16265 0.13905 0.076595 0.035065 0.028534 0.017446 0.014277 0.012776 0.0097477 0.007676 0.006134 0.0040036 0.0029029 0.0027283 0.0023323 0.00087627 0.00059451 0.00029321)
energy1
301.11962 4.42 52 (1.9074)
317.11454 10.34 9 55 63 67 (3.2241 1.0839 0.14389 0.0063318)
319.13019 100.00 8 54 64 84 70 83 65 75 56 68 87 79 92 69 91 (39.44 0.87882 0.55319 0.52689 0.31162 0.29106 0.28246 0.21898 0.21384 0.12418 0.11756 0.068819 0.04806 0.029406 0.028551)
399.15640 4.52 6 12 190 29 (1.8292 0.079292 0.024018 0.017706)
417.16696 32.76 3 27 17 189 22 18 31 33 36 23 30 20 102 32 40 21 104 39 103 (11.368 0.91939 0.4448 0.32296 0.28374 0.13428 0.12908 0.12383 0.077972 0.068058 0.067871 0.063178 0.057848 0.035482 0.015023 0.013681 0.0028696 0.0015413 0.00080067)
433.16188 4.29 134 207 191 141 (1.8034 0.043443 0.0039815 0.00097189)
435.17753 31.13 0 192 145 116 157 164 135 217 120 220 212 226 208 136 209 211 142 229 228 144 223 (11.458 0.60555 0.40795 0.25626 0.25061 0.092423 0.083932 0.0692 0.040704 0.040001 0.02922 0.020284 0.018969 0.01792 0.015862 0.0057366 0.0054236 0.0039927 0.0020541 0.0015064 0.0013618)
energy2
45.03349 8.74 97 (1.3442)
57.03349 16.88 100 (2.5961)
61.02841 3.62 196 (0.55713)
71.04914 5.12 184 185 (0.50363 0.28351)
73.02841 7.65 197 166 (1.005 0.1708)
155.08553 7.96 5 (1.2247)
168.08078 10.85 111 (1.6692)
170.09643 35.76 108 15 112 (2.73 2.2829 0.48572)
267.09889 6.31 132 (0.97064)
301.11962 5.44 52 (0.83667)
317.11454 10.96 9 63 67 55 (1.1014 0.44563 0.069934 0.069068)
319.11493 4.06 140 (0.62508)
319.13019 100.00 8 56 84 65 79 70 68 75 87 54 69 92 83 91 64 (3.7436 3.2186 2.3348 1.1555 0.81583 0.68725 0.61881 0.59559 0.52907 0.40882 0.37672 0.2709 0.21606 0.20725 0.19963)
321.14584 4.54 7 (0.69789)
325.17714 7.75 49 (1.1922)
343.13019 14.84 155 (2.2819)
345.14584 47.70 149 (7.3352)
346.12985 9.03 150 (1.3884)
347.16149 10.26 156 (1.5777)
359.16149 25.33 162 (3.8955)
361.14075 15.96 153 28 (2.0595 0.3952)
365.16082 8.06 214 (1.2393)
373.14075 31.62 25 (4.8628)
375.15640 53.71 26 159 (7.9509 0.30832)
379.18770 11.79 163 (1.8137)
389.13566 7.46 160 (1.1469)
399.15640 4.78 190 6 29 12 (0.6306 0.05057 0.037302 0.017065)
409.16188 6.21 117 139 137 (0.72862 0.20088 0.025745)
419.14623 9.70 143 133 122 (0.75378 0.66452 0.072682)
433.16188 22.44 134 141 207 191 (2.0296 0.98092 0.42847 0.011427)

0 435.1775296361 [NH2+]=c1nc(O)c2nc(Nc3ccc(-c4ccccc4)cc3)n(C3CC(O)C(CO)O3)c2[nH]1
1 405.1669649521 [NH2+]=C1N=C(O)C2=C(N1)N(C1C=C(O)CO1)C(N=C1C=CC(C3=CC=CC=C3)C=C1)N2
2 403.1513148881 [NH2+]=C1N=C(O)C2=C(N1)N(C1C=C(O)CO1)C(N=C1C=CC(C3=CC=CC=C3)C=C1)=N2
3 417.1669649521 C=C1OC(N2C3=C(NC2N=C2C=CC(C4=CC=CC=C4)C=C2)C(O)=NC(=[NH2+])N3)C=C1O
4 337.1043646961 C=C1OC(N2C(N=C3C=CCC=C3)=NC3=C2NC(=[NH2+])N=C3O)=CC1=O
5 155.0855267721 C1=CC=C(C2=CC=[CH2+]C=C2)C=C1
6 399.1564002681 C=C1C=CC(N2C(N=C3C=CC(C4=CC=CC=C4)C=C3)=NC3=C2NC(=[NH2+])N=C3O)O1
7 321.1458355841 [NH3+]C1N=C(O)C2=NC(N=C3C=CC(C4=CC=CC=C4)C=C3)NC2=N1
8 319.1301855201 [NH2+]=C1N=C(O)C2=NC(N=C3C=CC(C4=CC=CC=C4)C=C3)NC2=N1
9 317.1145354561 [NH2+]=C1N=C(O)C2=NC(N=C3C=CC(C4=CC=CC=C4)C=C3)=NC2=N1
10 99.0440558841 C=C1OC=CC1[OH2+]
11 101.0597059481 CC1OC=CC1[OH2+]
12 399.1564002681 C=C1OC(N2C(N=C3C=CC(C4=CC=CC=C4)C=C3)=NC3=C2NC(=[NH2+])N=C3)C=C1O
13 400.1404158561 C=C1OC(N2C([NH+]=C3C=CC(C4=CC=CC=C4)C=C3)=NC3=C(O)N=CN=C32)C=C1O
14 172.1120758681 [NH3+]C1C=CC(C2=CC=CC=C2)C=C1
15 170.0964258041 [NH2+]=C1C=CC(C2=CC=CC=C2)C=C1
16 248.0778156001 C=C1OC(N2CNC3=C2NC(=[NH2+])N=C3O)=CC1=O
17 417.1669649521 C=C=C=C(C=C)C1C=CC(=NC2NC3=C(NC(=[NH2+])N=C3O)N2C2C=C(O)C(=C)O2)C=C1 Intermediate Fragment 
18 417.1669649521 C=C=C=C=C(C)C1C=CC(=NC2NC3=C(NC(=[NH2+])N=C3O)N2C2C=C(O)C(=C)O2)C=C1 Intermediate Fragment 
19 415.1513148881 C=C1OC(N2C(N=C3C=CC(C(C)=CC#C[CH2+])C=C3)=NC3=C2NC(=N)N=C3O)C=C1O
20 417.1669649521 C=C=C(C=C=CC1=CC=CC=C1)NC1NC2=C(NC(=[NH2+])N=C2O)N1C1C=C(O)C(=C)O1 Intermediate Fragment 
21 417.1669649521 C=C1OC(N2C(=NC(C)=C=C=C(C)C3=CC=CC=C3)NC3=C2NC(=[NH2+])N=C3O)C=C1O Intermediate Fragment 
22 417.1669649521 C=C(C=O)OC(=C)N1C2=C(NC1N=C1C=CC(C3=CC=CC=C3)C=C1)C(O)=NC(=[NH2+])N2 Intermediate Fragment 
23 417.1669649521 C#COC(=C=C=O)N1C2=C(NC1N=C1C=CC(C3=CC=CC=C3)C=C1)C(O)NC([NH3+])N2 Intermediate Fragment 
24 391.1513148881 [NH3+]C1N=C(O)C2=C(N1)N(C(=O)C#CO)C(N=C1C=CC(C3=CC=CC=C3)C=C1)N2
25 373.1407502041 [NH2+]=C1N=C(O)C2=C(N1)N(CC#CO)C(N=C1C=CC(C3=CC=CC=C3)C=C1)=N2
26 375.1564002681 [NH2+]=C1N=C(O)C2=C(N1)N(CC#CO)C(N=C1C=CC(C3=CC=CC=C3)C=C1)N2
27 417.1669649521 C#CC(O)=C=C(O)N1C2=C(NC1N=C1C=CC(C3=CC=CC=C3)C=C1)C(O)=NC([NH3+])N2 Intermediate Fragment 
28 361.1407502041 C=C(O)N1C2=NC(=[NH2+])N=C(O)C2=NC1NC1=CC=C(C2=CC=CC=C2)C=C1
29 399.1564002681 C#CC(O)=C=CN1C2=C(NC1N=C1C=CC(C3=CC=CC=C3)C=C1)C(O)=NC(=[NH2+])N2
30 417.1669649521 C=C(O)C(O)=C=CN1C2=C(NC1N=C1C=CC(C3=CC=CC=C3)C=C1)C(O)=NC(=[NH2+])N2 Intermediate Fragment 
31 417.1669649521 C=C1OC(N2C(N=C3C=CC(C4=CC=CC=C4)C=C3)=NC(C=O)=C2NC(N)=[NH2+])C=C1O Intermediate Fragment 
32 417.1669649521 C=C1OC(N2C(NC#[NH+])=C(C(=N)O)NC2N=C2C=CC(C3=CC=CC=C3)C=C2)C=C1O Intermediate Fragment 
33 417.1669649521 C=C1OC(N2C=C(C(O)=NC(N)=[NH2+])N=C2N=C2C=CC(C3=CC=CC=C3)C=C2)C=C1O Intermediate Fragment 
34 332.1393532361 C=C1OC(N2C=CNC2[NH+]=C2C=CC(C3=CC=CC=C3)C=C2)=CC1=O
35 358.1186177921 C=C1OC(N2C=C(C#[O+])N=C2N=C2C=CC(C3=CC=CC=C3)C=C2)C=C1O
36 417.1669649521 C=C1OC(N2C(NC(=[NH2+])N=C=O)=CNC2N=C2C=CC(C3=CC=CC=C3)C=C2)C=C1O Intermediate Fragment 
37 349.1659023321 C=C1OC(N2C(N)CNC2[NH+]=C2C=CC(C3=CC=CC=C3)C=C2)=CC1=O
38 374.1611513001 C=C1OC(N2C(NC#[NH+])=CNC2N=C2C=CC(C3=CC=CC=C3)C=C2)C=C1O
39 417.1669649521 C=C1OC(N(C(=N)N=C2C=CC(C3=CC=CC=C3)C=C2)C2=CC(O)=NC(=[NH2+])N2)C=C1O Intermediate Fragment 
40 417.1669649521 C=C1OC(N(C=[N+]=C2C=CC(C3=CC=CC=C3)C=C2)C2=C(N)C(O)=NC(=N)N2)C=C1O Intermediate Fragment 
41 357.1305794441 [NH3+]C1NC2=C(NC(N=C3C=CCC=C3)N2C2=CC(=O)C(=C=O)O2)C(O)N1
42 355.1149293801 [NH3+]C1N=C(O)C2=C(N1)N(C1=CC(=O)C(=C=O)O1)C(N=C1C=CCC=C1)N2
43 353.0992793161 [NH2+]=C1N=C(O)C2=C(N1)N(C1=CC(=O)C(=C=O)O1)C(N=C1C=CCC=C1)N2
44 351.0836292521 [NH2+]=C1N=C(O)C2=C(N1)N(C1=CC(=O)C(=C=O)O1)C(N=C1C=CCC=C1)=N2
45 241.0832353281 [NH2+]=C1N=C(O)C2=NC(N=C3C=CCC=C3)=NC2=N1
46 157.1011768361 C1=CC(C2=CC=[CH2+]C=C2)=CCC1
47 159.1168269001 C1=CC(C2=CCCCC2)=CC=[CH2+]1
48 161.1324769641 C1=CC(C2CCCCC2)=CC=[CH2+]1
49 325.1771357121 [NH3+]C1NC(O)C2=NC(N=C3C=CC(C4=CC=CC=C4)C=C3)NC2N1
50 323.1614856481 [NH3+]C1N=C2NC(N=C3C=CC(C4=CC=CC=C4)C=C3)N=C2C(O)N1
51 165.0519352001 N=C1N=C2NC(=[NH2+])N=C(O)C2=N1
52 301.1196208361 [NH2+]=C1N=CC2=NC(N=C3C=CC(C4=CC=CC=C4)C=C3)=NC2=N1
53 302.1036364241 O=C1N=CN=C2N=C([NH+]=C3C=CC(C4=CC=CC=C4)C=C3)N=C12
54 319.1301855201 C=C=C=C(C=C)C1C=CC(=NC2=NC3=C(NC(=[NH2+])N=C3O)N2)C=C1 Intermediate Fragment 
55 317.1145354561 C#CC=C(C#C)C1C=CC(=NC2=NC3=C(NC(=[NH2+])N=C3O)N2)C=C1
56 319.1301855201 C=C=C=C=C(C)C1C=CC(=NC2=NC3=C(NC(=[NH2+])N=C3O)N2)C=C1 Intermediate Fragment 
57 293.1145354561 C#CC(=C)C1=CC=C(NC2N=C3NC(=[NH2+])N=C(O)C3=N2)C=C1
58 291.0988853921 C#CC(=C)C1=CC=C(N=C2N=C3NC(=[NH2+])N=C(O)C3=N2)C=C1
59 289.0832353281 [C+]#CC(=C)C1=CC=C(N=C2N=C3NC(=N)N=C(O)C3=N2)C=C1
60 279.0988853921 [CH+]=C(C)C1=CC=C(N=C2N=C3NC(=N)N=C(O)C3=N2)C=C1
61 263.0675852641 [C+]#CC1C=CC(=NC2=NC3=NC(=N)N=C(O)C3=N2)C=C1
62 303.0988853921 [CH2+]C#CC#CC1C=CC(=NC2=NC3=C(NC(=N)N=C3O)N2)C=C1
63 317.1145354561 [CH+]=C=C=C=C(C)C1C=CC(=NC2=NC3=C(NC(=N)N=C3O)N2)C=C1
64 319.1301855201 C=C=C=C=C=C=C1C=CC(=NC2NC3=C(N2)C(O)=NC([NH3+])N3)C=C1 Intermediate Fragment 
65 319.1301855201 C=C=C(C=C=CC1=CC=CC=C1)N=C1NC2=C(N1)C(O)=NC(=[NH2+])N2 Intermediate Fragment 
66 203.0675852641 C#CC=NC1N=C2C(O)=NC(=[NH2+])N=C2N1
67 317.1145354561 C#CC(C#CCC1=CC=CC=C1)=NC1=NC2=C(NC(=[NH2+])N=C2O)N1
68 319.1301855201 CC(=C=C=C(C)C1=CC=CC=C1)N=C1N=C2NC(=[NH2+])N=C(O)C2=N1 Intermediate Fragment 
69 319.1301855201 C=CC(=C=C=C=NC1NC2=C(N1)C(O)=NC(=[NH2+])N2)C1=CC=CC=C1 Intermediate Fragment 
70 319.1301855201 N=C(N)NC1=C(C#[O+])N=C(N=C2C=CC(C3=CC=CC=C3)C=C2)N1 Intermediate Fragment 
71 291.1352709001 NC(=[NH2+])N=C1C=NC(N=C2C=CC(C3=CC=CC=C3)C=C2)=N1
72 260.0818383601 [O+]#CC1=NC(=NC2=CC=C(C3=CC=CC=C3)C=C2)N=C1
73 277.1083874561 N=C1N=C([NH+]=C2C=CC(C3=CC=CC=C3)C=C2)N=C1C=O
74 302.1036364241 N#CNC1=C(C#[O+])N=C(N=C2C=CC(C3=CC=CC=C3)C=C2)N1
75 319.1301855201 N=C(O)C1=C(NC#[NH+])NC(N=C2C=CC(C3=CC=CC=C3)C=C2)=N1 Intermediate Fragment 
76 276.1243718681 [NH+]#CN=C1C=NC(N=C2C=CC(C3=CC=CC=C3)C=C2)N1
77 277.1083874561 N=C(O)C1=NC(=[N+]=C2C=CC(C3=CC=CC=C3)C=C2)N=C1
78 292.1192864881 N=C(O)C1=NC([NH+]=C2C=CC(C3=CC=CC=C3)C=C2)=NC1=N
79 319.1301855201 [NH+]#CN=C(O)C1=C(N)NC(N=C2C=CC(C3=CC=CC=C3)C=C2)=N1 Intermediate Fragment 
80 249.1134728361 N=C1C=NC([NH+]=C2C=CC(C3=CC=CC=C3)C=C2)=N1
81 302.1036364241 N#CN=C(O)C1=NC(=[N+]=C2C=CC(C3=CC=CC=C3)C=C2)N=C1
82 275.0927373921 N=C1N=C(N=C2C=CC(C3=CC=CC=C3)C=C2)N=C1C#[O+]
83 319.1301855201 N=C(N)N=C(O)C1=NC(=[N+]=C2C=CC(C3=CC=CC=C3)C=C2)N=C1 Intermediate Fragment 
84 319.1301855201 [NH2+]=C(N=C=O)NC1=CN=C(N=C2C=CC(C3=CC=CC=C3)C=C2)N1 Intermediate Fragment 
85 234.1025738041 C1=CC=C(C2C=CC(=[N+]=C3N=CC=N3)C=C2)C=C1
86 274.1087218041 [NH+]#CN=C1C=NC(N=C2C=CC(C3=CC=CC=C3)C=C2)=N1
87 319.1301855201 N=C(N=C1C=CC(C2=CC=CC=C2)C=C1)N=C1C=NC(=[NH2+])N=C1O Intermediate Fragment 
88 125.0457872001 N=C1C=NC(=[NH2+])N=C1O
89 195.0916747721 N#C[NH+]=C1C=CC(C2=CC=CC=C2)C=C1
90 302.1036364241 N=C1N=CC(=NC#[N+]C2=CC=C(C3=CC=CC=C3)C=C2)C(O)=N1
91 319.1301855201 N=C1N=C(O)C(N=C=[N+]=C2C=CC(C3=CC=CC=C3)C=C2)=C(N)N1 Intermediate Fragment 
92 319.1301855201 N=C1N=C(O)C(N)=C(N=C=[N+]=C2C=CC(C3=CC=CC=C3)C=C2)N1 Intermediate Fragment 
93 115.0389705041 OC1C=COC1=C[OH2+]
94 117.0546205681 OC1C=COC1C[OH2+]
95 99.0440558841 [OH2+]C=C1C=CCO1
96 117.0546205681 C=COC(=C[OH2+])CO Intermediate Fragment 
97 45.0334912001 C=C[OH2+]
98 117.0546205681 OC=C=C(O)CC[OH2+] Intermediate Fragment 
99 117.0546205681 C=C=C(O)C(O)C[OH2+] Intermediate Fragment 
100 57.0334912001 CC#C[OH2+]
101 119.0702706321 OC1CCOC1C[OH2+]
102 417.1669649521 [NH3+]C1N=CC2=C(N1)N(C1C=C(O)C(=C=O)O1)C(N=C1C=CC(C3=CC=CC=C3)C=C1)N2
103 417.1669649521 [NH3+]C1N=CC2=C(N1)N(C(O)=C=C(O)C#CO)C(N=C1C=CC(C3=CC=CC=C3)C=C1)N2 Intermediate Fragment 
104 417.1669649521 [NH3+]C1N=CC2=C(N1)N(C=C=C(O)C(O)=C=O)C(N=C1C=CC(C3=CC=CC=C3)C=C1)N2 Intermediate Fragment 
105 418.1509805401 O=C=C1OC(N2C3=C(NC2[NH+]=C2C=CC(C4=CC=CC=C4)C=C2)C(O)=NCN3)C=C1O
106 176.1433759961 [NH3+]C1CCC(C2=CC=CC=C2)CC1
107 174.1277259321 [NH3+]C1C=CC(C2=CC=CC=C2)CC1
108 170.0964258041 C=C=C=C=C(C)C1C=CC(=[NH2+])C=C1 Intermediate Fragment 
109 118.0651256761 C#CC1C=CC(=[NH2+])C=C1
110 116.0494756121 [C+]#CC1C=CC(=N)C=C1
111 168.0807757401 [CH+]=C=C=C=C(C)C1C=CC(=N)C=C1
112 170.0964258041 C=C=C([NH3+])C=C=CC1=CC=CC=C1 Intermediate Fragment 
113 266.0883802841 [NH3+]C1NC2=C(NCN2C2=CC(=O)C(=C=O)O2)C(O)N1
114 152.0566862321 [NH2+]=C1N=C(O)C2=NCNC2=N1
115 150.0410361681 [NH2+]=C1N=C(O)C2=NC=NC2=N1
116 435.1775296361 C=C=C=C(C=C)C1C=CC(=NC2NC3=C(NC([NH3+])NC3O)N2C2C=C(O)C(=C=O)O2)C=C1 Intermediate Fragment 
117 409.1618795721 C#CC(=C)C1C=CC(=NC2NC3=C(NC([NH3+])NC3O)N2C2C=C(O)C(=C=O)O2)C=C1
118 407.1462295081 C#CC(=C)C1C=CC(=NC2NC3=C(NC([NH3+])N=C3O)N2C2C=C(O)C(=C=O)O2)C=C1
119 407.1462295081 C#CC#CC1C=CC(=NC2NC3=C(NC([NH3+])NC3O)N2C2C=C(O)C(=C=O)O2)C=C1
120 435.1775296361 C=C=C=C=C(C)C1C=CC(=NC2NC3=C(NC([NH3+])NC3O)N2C2C=C(O)C(=C=O)O2)C=C1 Intermediate Fragment 
121 405.1305794441 C#CC(=C)C1C=CC(=NC2NC3=C(NC(=[NH2+])N=C3O)N2C2C=C(O)C(=C=O)O2)C=C1
122 419.1462295081 C#CC=C(C)C1C=CC(=NC2NC3=C(NC(=[NH2+])N=C3O)N2C2C=C(O)C(=C=O)O2)C=C1
123 395.1462295081 C=C(C)C1C=CC(=NC2NC3=C(NC(=[NH2+])N=C3O)N2C2C=C(O)C(=C=O)O2)C=C1
124 393.1305794441 C=C(C)C1C=CC(=NC2=NC3=C(NC(=[NH2+])N=C3O)N2C2C=C(O)C(=C=O)O2)C=C1
125 391.1149293801 [CH+]=C(C)C1C=CC(=NC2=NC3=C(NC(=N)N=C3O)N2C2C=C(O)C(=C=O)O2)C=C1
126 281.1145354561 C=C(C)C1=CC=C(N=C2N=C3NC(=[NH2+])N=C(O)C3=N2)C=C1
127 385.1618795721 C#CC1C=CC(=NC2NC3C(O)NC([NH3+])NC3N2C2C=C(O)C(=C=O)O2)C=C1
128 383.1462295081 C#CC1C=CC(=NC2NC3=C(NC([NH3+])NC3O)N2C2C=C(O)C(=C=O)O2)C=C1
129 381.1305794441 C#CC1C=CC(=NC2NC3=C(NC([NH3+])N=C3O)N2C2C=C(O)C(=C=O)O2)C=C1
130 379.1149293801 C#CC1C=CC(=NC2NC3=C(NC(=[NH2+])N=C3O)N2C2C=C(O)C(=C=O)O2)C=C1
131 377.0992793161 C#CC1C=CC(=NC2=NC3=C(NC(=[NH2+])N=C3O)N2C2C=C(O)C(=C=O)O2)C=C1
132 267.0988853921 C#CC1C=CC(=NC2N=C3C(O)=NC(=[NH2+])N=C3N2)C=C1
133 419.1462295081 CC#CC#CC1C=CC(=NC2NC3=C(NC([NH3+])N=C3O)N2C2C=C(O)C(=C=O)O2)C=C1
134 433.1618795721 CC#CC=C(C)C1C=CC(=NC2NC3=C(NC(=[NH2+])N=C3O)N2C2C=C(O)C(=C=O)O2)C=C1
135 435.1775296361 C=C=C=C=C=C=C1C=CC(NC2NC3C(O)NC([NH3+])NC3N2C2C=C(O)C(=C=O)O2)C=C1 Intermediate Fragment 
136 435.1775296361 C=C=C(C=C=CC1=CC=CC=C1)NC1NC2=C(NC([NH3+])NC2O)N1C1C=C(O)C(=C=O)O1 Intermediate Fragment 
137 409.1618795721 [NH3+]C1NC2=C(NC(N=CC#CCC3=CC=CC=C3)N2C2C=C(O)C(=C=O)O2)C(O)N1
138 293.1145354561 [NH2+]=C1N=C(O)C2=C(N1)NC(N=CC#CCC1=CC=CC=C1)=N2
139 409.1618795721 [NH3+]C1NC2=C(NC(N=CC#CCC3=CC=CC=C3)N2C(O)=C=C(O)C#CO)C(O)N1 Intermediate Fragment 
140 319.1149293801 C#CC=NC1NC2=C(NC([NH3+])NC2O)N1C1C=C(O)C(=C=O)O1
141 433.1618795721 C#CC(C#CCC1=CC=CC=C1)=NC1NC2=C(NC([NH3+])NC2O)N1C1C=C(O)C(=C=O)O1
142 435.1775296361 CC(=C=C=C(C)C1=CC=CC=C1)NC1NC2=C(NC([NH3+])N=C2O)N1C1C=C(O)C(=C=O)O1 Intermediate Fragment 
143 419.1462295081 C=C(C#CCC1=CC=CC=C1)NC1NC2=C(NC(=[NH2+])N=C2O)N1C1C=C(O)C(=C=O)O1
144 435.1775296361 C=CC(=C=C=C=NC1NC2C(O)NC([NH3+])NC2N1C1C=C(O)C(=C=O)O1)C1=CC=CC=C1 Intermediate Fragment 
145 435.1775296361 C=C(OC(=C=O)C=O)N1C2=C(NC1N=C1C=CC(C3=CC=CC=C3)C=C1)C(O)NC([NH3+])N2 Intermediate Fragment 
146 407.1826150161 C=C(OC#CO)N1C2=C(NC1N=C1C=CC(C3=CC=CC=C3)C=C1)C(O)NC([NH3+])N2
147 405.1669649521 C=C(OC#CO)N1C2=C(NC1N=C1C=CC(C3=CC=CC=C3)C=C1)C(O)=NC([NH3+])N2
148 363.1564002681 C=C(O)N1C2=C(NC1N=C1C=CC(C3=CC=CC=C3)C=C1)C(O)=NC(=[NH2+])N2
149 345.1458355841 C#CN1C2=C(NC1N=C1C=CC(C3=CC=CC=C3)C=C1)C(O)=NC(=[NH2+])N2
150 346.1298511721 C=C(O)N1C([NH+]=C2C=CC(C3=CC=CC=C3)C=C2)=NC2=C(O)N=CN=C21
151 363.1564002681 C=C=C=C(C=C)C1C=CC(=NC2NC3=C(NC(=[NH2+])N=C3O)N2C(=C)O)C=C1 Intermediate Fragment 
152 363.1564002681 C=C=C=C=C(C)C1C=CC(=NC2NC3=C(NC(=[NH2+])N=C3O)N2C(=C)O)C=C1 Intermediate Fragment 
153 361.1407502041 C=C(O)N1C(N=C2C=CC(C(C)=CC#C[CH2+])C=C2)=NC2=C1NC(=N)N=C2O
154 363.1564002681 C=C(O)N1C(NC(=[NH2+])N=C=O)=CNC1N=C1C=CC(C2=CC=CC=C2)C=C1 Intermediate Fragment 
155 343.1301855201 C#CN1C(N=C2C=CC(C3=CC=CC=C3)C=C2)=NC2=C1NC(=[NH2+])N=C2O
156 347.1614856481 C#CN1C2=C(NC1N=C1C=CC(C3=CC=CC=C3)C=C1)C(O)=NC([NH3+])N2
157 435.1775296361 [NH3+]C1NC(O)C2NC(N=C3C=CC(C4=CC=CC=C4)C=C3)N(C(=C=C=O)OC#CO)C2N1 Intermediate Fragment 
158 393.1669649521 [NH3+]C1NC2=C(NC(N=C3C=CC(C4=CC=CC=C4)C=C3)N2C(=O)C#CO)C(O)N1
159 375.1564002681 C#CC(=O)N1C2=C(NC1N=C1C=CC(C3=CC=CC=C3)C=C1)C(O)=NC([NH3+])N2
160 389.1356648241 [NH2+]=C1N=C(O)C2=C(N1)N(C(=O)C#CO)C(N=C1C=CC(C3=CC=CC=C3)C=C1)N2
161 377.1720503321 [NH3+]C1N=C(O)C2=C(N1)N(CC#CO)C(N=C1C=CC(C3=CC=CC=C3)C=C1)N2
162 359.1614856481 C#CCN1C2=C(NC1N=C1C=CC(C3=CC=CC=C3)C=C1)C(O)=NC(=[NH2+])N2
163 379.1877003961 [NH3+]C1NC2=C(NC(N=C3C=CC(C4=CC=CC=C4)C=C3)N2CC#CO)C(O)N1
164 435.1775296361 [NH3+]C1NC2=C(NC(N=C3C=CC(C4=CC=CC=C4)C=C3)N2C(O)=C=C(O)C#CO)C(O)N1 Intermediate Fragment 
165 75.0440558841 OCC=C[OH2+]
166 73.0284058201 OCC#C[OH2+]
167 359.1251001401 [CH+]=C(O)N1C(N=C2C=CC(C3=CC=CC=C3)C=C2)=NC2=C1NC(=N)N=C2O
168 365.1720503321 C=C(O)N1C2=C(NC1N=C1C=CC(C3=CC=CC=C3)C=C1)C(O)=NC([NH3+])N2
169 367.1877003961 C=C(O)N1C2=C(NC1N=C1C=CC(C3=CC=CC=C3)C=C1)C(O)NC([NH3+])N2
170 351.1564002681 [NH3+]C1N=C(O)C2=C(N1)N(C=O)C(N=C1C=CC(C3=CC=CC=C3)C=C1)N2
171 349.1407502041 [NH2+]=C1N=C(O)C2=C(N1)N(C=O)C(N=C1C=CC(C3=CC=CC=C3)C=C1)N2
172 331.1301855201 [CH2+]N1C(N=C2C=CC(C3=CC=CC=C3)C=C2)=NC2=C1NC(=N)N=C2O
173 332.1142011081 O=CN1C([NH+]=C2C=CC(C3=CC=CC=C3)C=C2)=NC2=C(O)N=CN=C21
174 349.1407502041 [NH2+]=C(N=C=O)NC1=CNC(N=C2C=CC(C3=CC=CC=C3)C=C2)N1C=O Intermediate Fragment 
175 349.1407502041 [NH2+]=C1N=C(O)C(NC(N=C=O)N=C2C=CC(C3=CC=CC=C3)C=C2)=CN1 Intermediate Fragment 
176 304.1192864881 [NH2+]=C1N=CC(=NC=NC2=CC=C(C3=CC=CC=C3)C=C2)C(O)=N1
177 347.1251001401 [NH2+]=C1N=C(O)C2=C(N1)N(C=O)C(N=C1C=CC(C3=CC=CC=C3)C=C1)=N2
178 329.1145354561 [CH2+]N1C(=NC2=CC=C(C3=CC=CC=C3)C=C2)N=C2C(O)=NC(=N)N=C21
179 347.1251001401 [NH2+]=C(N=C=O)NC1=CN=C(N=C2C=CC(C3=CC=CC=C3)C=C2)N1C=O Intermediate Fragment 
180 347.1251001401 [NH2+]=C1N=C(O)C(N=C(N=C=O)N=C2C=CC(C3=CC=CC=C3)C=C2)=CN1 Intermediate Fragment 
181 345.1094500761 N=C1N=C(O)C2=C(N1)N(C#[O+])C(N=C1C=CC(C3=CC=CC=C3)C=C1)=N2
182 87.0440558841 C=C(O)C=C[OH2+]
183 89.0597059481 C=C(O)CC[OH2+]
184 71.0491412641 C=CC(=C)[OH2+]
185 71.0491412641 C#CCC[OH2+]
186 91.0753560121 CC(O)CC[OH2+]
187 73.0647913281 C=C([OH2+])CC
188 47.0491412641 CC[OH2+]
189 417.1669649521 [NH3+]C1N=C(O)C2=C(N1)N(C=C=C(O)C#CO)C(N=C1C=CC(C3=CC=CC=C3)C=C1)N2
190 399.1564002681 [NH2+]=C1N=C(O)C2=C(N1)N(CC#CC#CO)C(N=C1C=CC(C3=CC=CC=C3)C=C1)N2
191 433.1618795721 [NH3+]C1N=C(O)C2=C(N1)N(C(O)=C=C(O)C#CO)C(N=C1C=CC(C3=CC=CC=C3)C=C1)N2
192 435.1775296361 [NH3+]C1NC2=C(NC(N=C3C=CC(C4=CC=CC=C4)C=C3)N2C=C=C(O)C(O)=C=O)C(O)N1 Intermediate Fragment 
193 93.0546205681 OCC(O)C[OH2+]
194 75.0440558841 CC(O)=C[OH2+]
195 91.0389705041 OCC(O)=C[OH2+]
196 61.0284058201 OC=C[OH2+]
197 73.0284058201 C=C(O)C=[OH+]
198 89.0233204401 OCC(O)=C=[OH+]
199 71.0127557561 O=CC#C[OH2+]
200 87.0076703761 O=CC(O)=C=[OH+]
201 349.1771357121 C#CN1C2=C(NC1N=C1C=CC(C3=CC=CC=C3)C=C1)C(O)NC([NH3+])N2
202 351.1927857761 C#CN1C(N=C2C=CC(C3=CC=CC=C3)C=C2)NC2C(O)NC([NH3+])NC21
203 333.1458355841 CN1C2=NC(=[NH2+])N=C(O)C2=NC1NC1=CC=C(C2=CC=CC=C2)C=C1
204 331.1301855201 [CH2+]N1C(NC(=N)N=C=O)=CN=C1N=C1C=CC(C2=CC=CC=C2)C=C1 Intermediate Fragment 
205 105.0546205681 C=C(O)C(O)C[OH2+]
206 63.0440558841 OCC[OH2+]
207 433.1618795721 [NH3+]C1N=C(O)C2=C(N1)N(C=C=C(O)C(O)=C=O)C(N=C1C=CC(C3=CC=CC=C3)C=C1)N2
208 435.1775296361 C=C(O)C(=C=O)OCN1C2=C(NC1N=C1C=CC(C3=CC=CC=C3)C=C1)C(O)=NC([NH3+])N2 Intermediate Fragment 
209 435.1775296361 NC([NH3+])NC1=C(C=O)NC(N=C2C=CC(C3=CC=CC=C3)C=C2)N1C1C=C(O)C(=C=O)O1 Intermediate Fragment 
210 376.1291824761 O=C=C1OC(N2C=C(C=O)NC2[NH+]=C2C=CC(C3=CC=CC=C3)C=C2)C=C1O
211 435.1775296361 N=C(O)C1=C(NC[NH3+])N(C2C=C(O)C(=C=O)O2)C(N=C2C=CC(C3=CC=CC=C3)C=C2)N1 Intermediate Fragment 
212 435.1775296361 NC1=C(C(O)=NC[NH3+])NC(N=C2C=CC(C3=CC=CC=C3)C=C2)N1C1C=C(O)C(=C=O)O1 Intermediate Fragment 
213 363.1451668881 NC1CNC([NH+]=C2C=CC(C3=CC=CC=C3)C=C2)N1C1=CC(=O)C(=C=O)O1
214 365.1608169521 NC1CNC([NH+]=C2C=CC(C3=CC=CC=C3)C=C2)N1C1=CC(O)C(=C=O)O1
215 367.1764670161 NC1CNC([NH2+]C2C=CC(C3=CC=CC=C3)C=C2)N1C1=CC(O)C(=C=O)O1
216 393.1557315721 NC1=C(CO)NC([NH+]=C2C=CC(C3=CC=CC=C3)C=C2)N1C1C=C(O)C(=C=O)O1
217 435.1775296361 NC([NH3+])N=C(O)C1=CN(C2C=C(O)C(=C=O)O2)C(N=C2C=CC(C3=CC=CC=C3)C=C2)N1 Intermediate Fragment 
218 350.1499179201 O=C=C1OC(N2CCNC2[NH+]=C2C=CC(C3=CC=CC=C3)C=C2)=CC1O
219 418.1509805401 [NH2+]=CN=C(O)C1=CN(C2C=C(O)C(=C=O)O2)C(N=C2C=CC(C3=CC=CC=C3)C=C2)N1
220 435.1775296361 [NH3+]C(N=CO)NC1=CNC(N=C2C=CC(C3=CC=CC=C3)C=C2)N1C1C=C(O)C(=C=O)O1 Intermediate Fragment 
221 388.1404158561 [NH+]#CNC1=CNC(N=C2C=CC(C3=CC=CC=C3)C=C2)N1C1C=C(O)C(=C=O)O1
222 390.1560659201 [NH2+]=CNC1=CNC(N=C2C=CC(C3=CC=CC=C3)C=C2)N1C1C=C(O)C(=C=O)O1
223 435.1775296361 NC(N=C1C=CC(C2=CC=CC=C2)C=C1)N(C1=CC(O)=NC([NH3+])N1)C1C=C(O)C(=C=O)O1 Intermediate Fragment 
224 418.1509805401 [NH2+]=C1N=C(O)C=C(N(CN=C2C=CC(C3=CC=CC=C3)C=C2)C2C=C(O)C(=C=O)O2)N1
225 241.0931313161 [NH3+]C1NC(O)CC(N=C2C=C(O)C(=C=O)O2)N1
226 435.1775296361 [NH3+]C1NC=C(NC(N=C2C=CC(C3=CC=CC=C3)C=C2)N=C2C=C(O)C(=C=O)O2)C(O)N1 Intermediate Fragment 
227 127.0614372641 N=C1C=NC([NH3+])N=C1O
228 435.1775296361 [NH3+]C1NC(N=C2C=C(O)C(=C=O)O2)=C(NCN=C2C=CC(C3=CC=CC=C3)C=C2)C(O)N1 Intermediate Fragment 
229 435.1775296361 NC1=C(N(CN=C2C=CC(C3=CC=CC=C3)C=C2)C2C=C(O)C(=C=O)O2)NC([NH3+])N=C1O Intermediate Fragment 
230 125.0457872001 N=C=C=NC([NH3+])N=C=O Intermediate Fragment 
231 125.0457872001 N=C(N)N=C=C(N)C#[O+] Intermediate Fragment 
232 129.0770873281 N=C1C=NC([NH3+])NC1O
