#In-silico ESI-MS/MS [M+H]+ Spectra
#PREDICTED BY CFM-ID 4.0.8
#SMILES=[C@H]1(C[C@@H](O[C@@H]1CO)n1cc(c(=O)n(c1=O)Cc1ccc2c3c1ccc1c3c(cc2)ccc1)C)O
#InChiKey=LXCUIEZWLDPQFR-DNVJHFABSA-N
energy0
99.04406 3.71 84 92 7 (0.84487 0.66237 0.6612)
215.08553 3.53 10 104 (2.0613 0.0044304)
217.10118 7.70 9 103 (4.5018 0.0016111)
313.13354 5.68 37 54 (3.2833 0.039488)
341.12845 100.00 5 38 32 66 63 51 56 69 68 (51.712 4.895 1.2159 0.36927 0.095806 0.093213 0.0609 0.014551 0.0062808)
439.16523 4.56 116 3 117 14 150 15 156 157 (2.2086 0.40901 0.019645 0.018192 0.0085359 0.0033784 0.00047368 5.6639e-05)
457.17580 15.05 0 170 210 188 132 253 208 118 130 254 190 256 257 264 260 192 259 255 263 261 258 (8.5035 0.087836 0.06995 0.061174 0.04272 0.013922 0.0059269 0.0032299 0.0028138 0.0014703 0.0014294 0.00057791 0.00054887 0.00049659 0.00043735 0.00037904 0.00024958 0.00019574 0.00015978 7.7148e-05 4.4926e-05)
energy1
99.04406 6.61 7 92 84 (0.84078 0.70556 0.34319)
137.03455 14.72 22 (4.2122)
139.05020 10.16 23 (2.905)
215.08553 100.00 10 104 (28.19 0.41674)
217.10118 19.73 9 103 (5.6326 0.010178)
230.09643 11.01 48 (3.1503)
286.12264 6.03 41 (1.7244)
296.10699 8.90 40 (2.5471)
298.12264 10.69 39 (3.057)
313.13354 23.61 37 54 (5.694 1.0607)
341.12845 73.74 5 38 51 32 56 63 66 69 68 (15.172 4.2712 0.49599 0.46892 0.33326 0.25006 0.087668 0.014655 0.00044935)
energy2
45.03349 5.73 80 (1.4497)
75.04406 6.91 87 140 (1.5973 0.15318)
99.04406 4.60 7 84 92 (0.57233 0.55432 0.036889)
117.05462 3.69 96 85 81 90 101 89 (0.47592 0.16934 0.1314 0.074048 0.044422 0.039624)
123.01890 8.38 19 (2.1226)
125.03455 42.50 20 (10.76)
137.03455 19.84 22 (5.0234)
139.05020 26.53 23 (6.7167)
141.06585 4.12 24 (1.0427)
200.09173 8.26 200 209 (1.2968 0.79473)
215.08553 100.00 10 104 (24.351 0.96828)
217.10118 13.76 9 103 (3.4112 0.071668)
228.08078 6.53 214 (1.6536)
230.09643 11.91 48 (3.0148)
286.12264 3.71 41 (0.93886)
296.10699 4.51 40 (1.143)
298.12264 3.61 39 (0.91346)
313.13354 5.62 54 37 (0.88641 0.53641)
325.09715 5.95 31 (1.506)
341.12845 25.86 5 38 56 51 32 63 66 69 68 (2.9759 1.269 1.0031 0.56669 0.32165 0.19014 0.14667 0.04339 0.031463)
373.19105 6.36 125 (1.6097)

0 457.1757983201 Cc1cn(C2CC(O)C(C[OH2+])O2)c(=O)n(Cc2ccc3ccc4cccc5ccc2c3c45)c1=O
1 425.1495835721 CC1=CN(C2C=C(O)CO2)C(=O)N(C=C2C=CC3=CC=C4C=CCC5=C4C3=C2C=C5)C1=[OH+]
2 427.1652336361 CC1=CN(C2C=C(O)CO2)C(=O)N(C=C2C=CC3=CC=C4CCCC5=C4C3=C2C=C5)C1=[OH+]
3 439.1652336361 C=C1OC(N2C=C(C)C(=[OH+])N(C=C3C=CC4=CC=C5CCCC6=C5C4=C3C=C6)C2=O)C=C1O
4 343.1441042681 CC1C=NC(=O)N(C=C2C=CC3=CC=C4CCCC5=C4C3=C2C=C5)C1=[OH+]
5 341.1284542041 CC1C=NC(=O)N(C=C2C=CC3=CC=C4C=CCC5=C4C3=C2C=C5)C1=[OH+]
6 339.1128041401 C=C1C=NC(=O)N(C=C2C=CC3=CC=C4C=CCC5=C4C3=C2C=C5)C1=[OH+]
7 99.0440558841 C=C1OC=CC1[OH2+]
8 101.0597059481 CC1OC=CC1[OH2+]
9 217.1011768361 [CH3+]=C1C=CC2=CC=C3C=CCC4=C3C2=C1C=C4
10 215.0855267721 [CH+]=C1C=CC2=CC=C3C=CCC4=C3C2=C1C=C4
11 223.0713332521 C=C1OC(N2C=C(C)C(=[OH+])N=C2O)=CC1O
12 237.0869833161 C=C1OC(N2C=C(C)C(=[OH+])N(C)C2=O)=CC1O
13 421.1546689521 C=C1C=CC(N2C=C(C)C(=[OH+])N(C=C3C=CC4=CC=C5C=CCC6=C5C4=C3C=C6)C2=O)O1
14 439.1652336361 C#COC(=C=CO)N1C=C(C)C(=[OH+])N(C=C2C=CC3=C4C2=CC=C2CCCC(=C24)CC3)C1=O Intermediate Fragment 
15 439.1652336361 C=C1OC(N(C=O)C=C(C)C(=[OH+])N=C=C2C=CC3=CC=C4CCCC5=C4C3=C2C=C5)C=C1O Intermediate Fragment 
16 347.1754043961 CC1=C([OH2+])N(C=C2C=CC3=C4C2=CC=C2CCCC(CC3)C24)C(=O)N=C1
17 223.1481270281 [CH3+]=C1C=CC2=C3C1=CC=C1CCCC(CC2)C13
18 219.1168269001 [CH3+]=C1C=CC2=CC=C3CCCC4=C3C2=C1C=C4
19 123.0189037561 [CH+]=C1C=NC(O)=NC1=O
20 125.0345538201 C=C1C=NC(O)=NC1=[OH+]
21 127.0502038841 CC1C=NC(O)=NC1=[OH+]
22 137.0345538201 C=C1C=NC(=O)N([CH2+])C1=O
23 139.0502038841 C=C1C=NC(=O)N(C)C1=[OH+]
24 141.0658539481 CC1C=NC(=O)N(C)C1=[OH+]
25 347.1754043961 CC(=C=NC=O)C(=[OH+])N=C=C1C=CC2=C3C1=CCC1CCCC(CC2)C31 Intermediate Fragment 
26 345.1597543321 CC1=C([OH2+])N(C=C2C=CC3=C4C2=CC=C2CCCC(=C24)CC3)C(=O)N=C1
27 327.1128041401 O=C1N=CC=C([OH2+])N1C=C1C=CC2=CC=C3C=CCC4=C3C2=C1C=C4
28 323.1178895201 CC1=CN([C+]=C2C=CC3=CC=C4C=CCC5=C4C3=C2C=C5)C(=O)N=C1
29 323.1178895201 C=C1C=NCN([C+]=C2C=CC3=CC=C4C=CCC5=C4C3=C2C=C5)C1=O
30 203.0855267721 C1=CC2=C3C(=C1)C=CC1=CC=[CH2+]C(=C13)C=C2
31 325.0971540761 O=C1N=CC=C(O)N1[C+]=C1C=CC2=CC=C3C=CCC4=C3C2=C1C=C4
32 341.1284542041 CC(=C=N)C(=[OH+])N(C=O)C=C1C=CC2=CC=C3C=CCC4=C3C2=C1C=C4 Intermediate Fragment 
33 314.1175551721 C=CC(=O)[NH+](C=O)C=C1C=CC2=CC=C3C=CCC4=C3C2=C1C=C4
34 260.1069904881 O=C=[NH+]C=C1C=CC2=CC=C3CCCC4=C3C2=C1C=C4
35 258.0913404241 O=C=[NH+]C=C1C=CC2=CC=C3C=CCC4=C3C2=C1C=C4
36 309.1022394561 [CH2+]C(C#N)=C(O)N=C=C1C=CC2=CC=C3C=CCC4=C3C2=C1C=C4
37 313.1335395841 CC(C#[NH+])=C(O)N=C=C1C=CC2=CC=C3CCCC4=C3C2=C1C=C4
38 341.1284542041 CC(=C=NC=O)C(=[OH+])N=C=C1C=CC2=CC=C3CCCC4=C3C2=C1C=C4 Intermediate Fragment 
39 298.1226405521 C=C(C)C(=O)[NH+]=C=C1C=CC2=CC=C3C=CCC4=C3C2=C1C=C4
40 296.1069904881 [CH+]=C(C)C(=O)N=C=C1C=CC2=CC=C3C=CCC4=C3C2=C1C=C4
41 286.1226405521 CCC(=O)[NH+]=C=C1C=CC2=CC=C3C=CCC4=C3C2=C1C=C4
42 284.1069904881 C=CC(=O)[NH+]=C=C1C=CC2=CC=C3C=CCC4=C3C2=C1C=C4
43 282.0913404241 C#CC(=O)[NH+]=C=C1C=CC2=CC=C3C=CCC4=C3C2=C1C=C4
44 280.0756903601 [C+]#CC(=O)N=C=C1C=CC2=CC=C3C=CCC4=C3C2=C1C=C4
45 256.0756903601 O=C=[N+]=C=C1C=CC2=CC=C3C=CCC4=C3C2=C1C=C4
46 84.0443902321 CC=C=[NH+]C=O
47 232.1120758681 [NH+]#CC1=CC=C2C=CC3CCCC4=C3C2=C1C=C4
48 230.0964258041 [NH+]#CC1=CC=C2C=CC3=CCCC4=C3C2=C1C=C4
49 311.1178895201 CC(C#[NH+])=C(O)N=C=C1C=CC2=CC=C3C=CCC4=C3C2=C1C=C4
50 339.1128041401 CC(=C=[NH+]C=O)C(=O)N=C=C1C=CC2=CC=C3C=CCC4=C3C2=C1C=C4
51 341.1284542041 CC(=C=NC(O)=NC=C1C=CC2=CC=C3C=CCC4=C3C2=C1C=C4)C=[OH+] Intermediate Fragment 
52 309.1022394561 C=C=C=NC(O)=[N+]=C=C1C=CC2=CC=C3C=CCC4=C3C2=C1C=C4
53 311.1178895201 C=C=C=[NH+]C(O)=NC=C1C=CC2=CC=C3C=CCC4=C3C2=C1C=C4
54 313.1335395841 CC=C=[NH+]C(O)=NC=C1C=CC2=CC=C3C=CCC4=C3C2=C1C=C4
55 339.1128041401 CC(=C=NC(O)=[N+]=C=C1C=CC2=CC=C3C=CCC4=C3C2=C1C=C4)C=O
56 341.1284542041 CC=C=NC(=O)N(C=[OH+])C=C1C=CC2=CC=C3C=CCC4=C3C2=C1C=C4 Intermediate Fragment 
57 313.0971540761 C#[N+]C(=O)N(C=O)C=C1C=CC2=CC=C3C=CCC4=C3C2=C1C=C4
58 82.0287401681 C=C=C=[NH+]C=O
59 262.1226405521 O=C=[NH+]C=C1C=CC2=C3C1=CC=C1CCCC(=C13)CC2
60 286.0862550441 O=C=[N+](C=O)C=C1C=CC2=CC=C3C=CCC4=C3C2=C1C=C4
61 288.1019051081 O=C[NH+](C=O)C=C1C=CC2=CC=C3C=CCC4=C3C2=C1C=C4
62 290.1175551721 O=C[NH+](C=O)C=C1C=CC2=CC=C3CCCC4=C3C2=C1C=C4
63 341.1284542041 C=C=C([OH2+])N(C=C1C=CC2=CC=C3C=CCC4=C3C2=C1C=C4)C(=O)N=C Intermediate Fragment 
64 287.1178895201 C=[NH+]C(=O)N=C=C1C=CC2=CC=C3CCCC4=C3C2=C1C=C4
65 285.1022394561 C=[NH+]C(=O)N=C=C1C=CC2=CC=C3C=CCC4=C3C2=C1C=C4
66 341.1284542041 C=C(C)C(=O)N([C+]=C1C=CC2=CC=C3C=CCC4=C3C2=C1C=C4)C(N)=O Intermediate Fragment 
67 273.1022394561 [NH3+]C(=O)N=CC1=CC=C2C=CC3=CC=CC4=C3C2=C1C=C4
68 341.1284542041 C=C1C=NC(=O)N([C+]=C(C)C2=C3C(=C)CC=C4C=CCC(=C43)C=C2)C1=O Intermediate Fragment 
69 341.1284542041 C=C1CC=CC2=C1C1=C(C=CC(=[C+]N3C(=O)N=CC(C)=C3O)C1=C)C=C2 Intermediate Fragment 
70 339.1128041401 CC(=C=N)C(=O)N(C#[O+])C=C1C=CC2=CC=C3C=CCC4=C3C2=C1C=C4 Intermediate Fragment 
71 312.1019051081 C#CC(=O)[NH+](C=O)C=C1C=CC2=CC=C3C=CCC4=C3C2=C1C=C4
72 339.1128041401 C=C=C=NC(=O)N(C=[OH+])C=C1C=CC2=CC=C3C=CCC4=C3C2=C1C=C4 Intermediate Fragment 
73 111.0076703761 O=C1C=COC1=C=[OH+]
74 113.0233204401 OC1C=COC1=C=[OH+]
75 115.0389705041 OC1C=COC1=C[OH2+]
76 87.0440558841 [OH2+]C1C=COC1
77 97.0284058201 [CH+]=C1OCC=C1O
78 115.0389705041 C=C=C(O)C(=O)C[OH2+] Intermediate Fragment 
79 115.0389705041 O=C=C=C(O)CC[OH2+] Intermediate Fragment 
80 45.0334912001 C=C[OH2+]
81 117.0546205681 OC1C=COC1C[OH2+]
82 85.0284058201 [OH+]=C1C=COC1
83 89.0597059481 [OH2+]C1CCOC1
84 99.0440558841 [OH2+]C=C1C=CCO1
85 117.0546205681 C=COC(=C[OH2+])CO Intermediate Fragment 
86 91.0389705041 OCC(=[OH+])CO
87 75.0440558841 OCC=C[OH2+]
88 73.0284058201 OCC#C[OH2+]
89 117.0546205681 C=C(O)C(=C[OH2+])OC Intermediate Fragment 
90 117.0546205681 C=C=C(O)C(O)C[OH2+] Intermediate Fragment 
91 29.0385765801 C=[CH3+]
92 99.0440558841 C=C=C(O)C=C[OH2+]
93 59.0491412641 CC=C[OH2+]
94 57.0334912001 CC#C[OH2+]
95 61.0284058201 OCC=[OH+]
96 117.0546205681 OC=C=C(O)CC[OH2+] Intermediate Fragment 
97 43.0178411361 C#C[OH2+]
98 87.0440558841 C=C(O)C=C[OH2+]
99 89.0597059481 C=C(O)CC[OH2+]
100 47.0491412641 CC[OH2+]
101 117.0546205681 OC=C=COCC[OH2+] Intermediate Fragment 
102 221.1324769641 [CH3+]=C1C=CC2=C3C1=CC=C1CCCC(=C13)CC2
103 217.1011768361 [CH+]=C1C=CC2=C(C1=C)C1=C(C=CCC1=C)C=C2 Intermediate Fragment 
104 215.0855267721 [C+]#CC=C=C1CC=C2C=CCC3=C2C1=CC=C3 Intermediate Fragment 
105 235.0349477441 [CH2+]C1=CN(C2C=C(O)C(=C=O)O2)C(O)=NC1=O
106 237.0505978081 CC1=CN(C2C=C(O)C(=C=[OH+])O2)C(O)=NC1=O
107 239.0662478721 CC1=CN(C2C=C(O)C(=C=[OH+])O2)C(O)NC1=O
108 241.0818979361 CC1=CN(C2C=C(O)C(=C=[OH+])O2)C(O)NC1O
109 205.1011768361 C1=CC2=CC=[CH2+]C3=C2C2=C(C=C3)CCC=C12
110 249.0505978081 [CH2+]N1C(=O)C(C)=CN(C2C=C(O)C(=C=O)O2)C1=O
111 251.0662478721 CC1=CN(C2C=C(O)C(=C=[OH+])O2)C(=O)N(C)C1=O
112 253.0818979361 CC1=CN(C2C=C(O)C(=C=[OH+])O2)C(O)N(C)C1=O
113 255.0975480001 CC1=CN(C2C=C(O)C(=C=[OH+])O2)C(O)N(C)C1O
114 255.0975480001 CC1=CN(C=C=C(O)C(=O)C=[OH+])C(O)N(C)C1O Intermediate Fragment 
115 441.1444981921 O=C1C=CN(C2C=C(O)C(=C=[OH+])O2)C(=O)N1C=C1C=CC2=C3C1=CC=C1CCCC(=C13)CC2
116 439.1652336361 CC1=CN(C2C=CC(=C=[OH+])O2)C(=O)N(C=C2C=CC3=C4C2=CC=C2CCCC(=C24)CC3)C1=O
117 439.1652336361 CC(=CN(C=O)C1C=CC(=C=[OH+])O1)C(=O)N=C=C1C=CC2=C3C1=CC=C1CCCC(=C13)CC2 Intermediate Fragment 
118 457.1757983201 C=C(OC(=C=[OH+])CO)N1C=C(C)C(=O)N(C=C2C=CC3=C4C2=CC=C2CCCC(=C24)CC3)C1=O Intermediate Fragment 
119 365.1284542041 C#CN1C=C(C)C(=[OH+])N(C=C2C=CC3=CC=C4C=CCC5=C4C3=C2C=C5)C1=O
120 367.1441042681 C#CN1C=C(C)C(=[OH+])N(C=C2C=CC3=CC=C4CCCC5=C4C3=C2C=C5)C1=O
121 367.1441042681 C#CN(C=O)C=C(C)C(=[OH+])N=C=C1C=CC2=CC=C3CCCC4=C3C2=C1C=C4 Intermediate Fragment 
122 339.1491896481 C#C[NH+]=C=C(C)C(=O)N=C=C1C=CC2=C3C1=CC=C1CCCC(=C13)CC2
123 369.1597543321 C#CN1C=C(C)C(=[OH+])N(C=C2C=CC3=C4C2=CC=C2CCCC(=C24)CC3)C1=O
124 371.1754043961 C#CN1C=C(C)C(=[OH+])N(C=C2C=CC3=C4C2=CC=C2CCCC(CC3)C24)C1=O
125 373.1910544601 C#CN1C=C(C)C(=[OH+])N(C=C2C=CC3=C4C2=CCC2CCCC(CC3)C42)C1=O
126 383.1390188881 C=C([OH2+])N1C=C(C)C(=O)N(C=C2C=CC3=CC=C4C=CCC5=C4C3=C2C=C5)C1=O
127 383.1390188881 C=C([OH2+])N(C=O)C=C(C)C(=O)N=C=C1C=CC2=CC=C3C=CCC4=C3C2=C1C=C4 Intermediate Fragment 
128 355.1441042681 C=C(O)[NH+]=C=C(C)C(=O)N=C=C1C=CC2=CC=C3CCCC4=C3C2=C1C=C4
129 385.1546689521 C=C([OH2+])N1C=C(C)C(=O)N(C=C2C=CC3=CC=C4CCCC5=C4C3=C2C=C5)C1=O
130 457.1757983201 C=C(O)C(=C=[OH+])OCN1C=C(C)C(=O)N(C=C2C=CC3=C4C2=CC=C2CCCC(=C24)CC3)C1=O Intermediate Fragment 
131 371.1390188881 CC1=CN(C=[OH+])C(=O)N(C=C2C=CC3=CC=C4CCCC5=C4C3=C2C=C5)C1=O
132 457.1757983201 CC1=CN(C=C=C(O)C(=O)C=[OH+])C(=O)N(C=C2C=CC3=C4C2=CC=C2CCCC(CC3)C24)C1=O Intermediate Fragment 
133 84.9920203121 O=CC(=O)C#[O+]
134 87.0076703761 O=CC(=[OH+])C=O
135 89.0233204401 O=CC(=[OH+])CO
136 71.0127557561 O=CC#C[OH2+]
137 71.0127557561 CC(=O)C#[O+]
138 73.0284058201 CC(=[OH+])C=O
139 93.0546205681 OCC([OH2+])CO
140 75.0440558841 CC(=[OH+])CO
141 359.1754043961 CC1=CN(C)C(=O)N(C=C2C=CC3=C4C2=CC=C2CCCC(=C24)CC3)C1=[OH+]
142 357.1597543321 CC1=CN(C)C(=O)N(C=C2C=CC3=CC=C4CCCC5=C4C3=C2C=C5)C1=[OH+]
143 355.1441042681 CC1=CN(C)C(=O)N(C=C2C=CC3=CC=C4C=CCC5=C4C3=C2C=C5)C1=[OH+]
144 353.1284542041 [CH2+]N1C=C(C)C(=O)N(C=C2C=CC3=CC=C4C=CCC5=C4C3=C2C=C5)C1=O
145 353.1284542041 C=NC=C(C)C(=O)N(C#[O+])C=C1C=CC2=CC=C3C=CCC4=C3C2=C1C=C4 Intermediate Fragment 
146 353.1284542041 CC(=CN(C)C#[O+])C(=O)N=C=C1C=CC2=CC=C3C=CCC4=C3C2=C1C=C4 Intermediate Fragment 
147 325.1335395841 C=[NH+]C=C(C)C(=O)N=C=C1C=CC2=CC=C3C=CCC4=C3C2=C1C=C4
148 353.1284542041 CC(C#[O+])=CN(C)C(=O)N=C=C1C=CC2=CC=C3C=CCC4=C3C2=C1C=C4 Intermediate Fragment 
149 353.1284542041 C=C=CN(C)C(=O)N(C#[O+])C=C1C=CC2=CC=C3C=CCC4=C3C2=C1C=C4 Intermediate Fragment 
150 439.1652336361 CC1=CN(C=C=C(O)C#C[OH2+])C(=O)N(C=C2C=CC3=C4C2=CC=C2CCCC(=C24)CC3)C1=O
151 421.1546689521 C#CC(O)=C=CN1C=C(C)C(=[OH+])N(C=C2C=CC3=CC=C4CCCC5=C4C3=C2C=C5)C1=O
152 101.0597059481 C=C=C(O)CC[OH2+]
153 421.1546689521 CC1=CN(CC#CC#C[OH2+])C(=O)N(C=C2C=CC3=CC=C4CCCC5=C4C3=C2C=C5)C1=O
154 397.1546689521 CC1=CN(CC#CO)C(=O)N(C=C2C=CC3=CC=C4CCCC5=C4C3=C2C=C5)C1=[OH+]
155 395.1390188881 CC1=CN(CC#CO)C(=O)N(C=C2C=CC3=CC=C4C=CCC5=C4C3=C2C=C5)C1=[OH+]
156 439.1652336361 CC(=CN=C=C=C(O)C#C[OH2+])C(=O)N(C=O)C=C1C=CC2=C3C1=CC=C1CCCC(=C13)CC2 Intermediate Fragment 
157 439.1652336361 CC(=CN(C=O)C=C=C(O)C#C[OH2+])C(=O)N=C=C1C=CC2=C3C1=CC=C1CCCC(=C13)CC2 Intermediate Fragment 
158 401.1859690801 CC1=CN(CC#CO)C(=O)N(C=C2C=CC3=C4C2=CC=C2CCCC(CC3)C24)C1=[OH+]
159 399.1703190161 CC1=CN(CC#CO)C(=O)N(C=C2C=CC3=C4C2=CC=C2CCCC(=C24)CC3)C1=[OH+]
160 381.1597543321 C#CCN1C=C(C)C(=[OH+])N(C=C2C=CC3=CC=C4CCCC5=C4C3=C2C=C5)C1=O
161 379.1441042681 C#CCN1C=C(C)C(=[OH+])N(C=C2C=CC3=CC=C4C=CCC5=C4C3=C2C=C5)C1=O
162 397.1546689521 CC(=CN=CC#CO)C(=[OH+])N(C=O)C=C1C=CC2=CC=C3CCCC4=C3C2=C1C=C4 Intermediate Fragment 
163 326.1175551721 C=C(C)C(=O)[N+](=C=O)C=C1C=CC2=CC=C3C=CCC4=C3C2=C1C=C4
164 397.1546689521 CC(=CN(C=O)CC#CO)C(=[OH+])N=C=C1C=CC2=CC=C3CCCC4=C3C2=C1C=C4 Intermediate Fragment 
165 369.1597543321 CC(=C[NH+]=CC#CO)C(=O)N=C=C1C=CC2=C3C1=CC=C1CCCC(=C13)CC2
166 397.1546689521 CC=CN(CC#CO)C(=O)N(C=[OH+])C=C1C=CC2=CC=C3C=CCC4=C3C2=C1C=C4 Intermediate Fragment 
167 59.0127557561 O=C=C[OH2+]
168 41.0021910721 [CH+]=C=O
169 63.0440558841 OCC[OH2+]
170 457.1757983201 CC1=CN(C(O)=C=C(O)C#C[OH2+])C(=O)N(C=C2C=CC3=C4C2=CC=C2CCCC(CC3)C24)C1=O Intermediate Fragment 
171 389.1859690801 C=C([OH2+])N1C=C(C)C(=O)N(C=C2C=CC3=C4C2=CC=C2CCCC(CC3)C24)C1=O
172 387.1703190161 C=C([OH2+])N1C=C(C)C(=O)N(C=C2C=CC3=C4C2=CC=C2CCCC(=C24)CC3)C1=O
173 381.1233688241 [CH+]=C(O)N1C=C(C)C(=O)N(C=C2C=CC3=CC=C4C=CCC5=C4C3=C2C=C5)C1=O
174 373.1546689521 CC1=CN(C=[OH+])C(=O)N(C=C2C=CC3=C4C2=CC=C2CCCC(=C24)CC3)C1=O
175 369.1233688241 CC1=CN(C=[OH+])C(=O)N(C=C2C=CC3=CC=C4C=CCC5=C4C3=C2C=C5)C1=O
176 369.1233688241 CC(=CN(C=O)C=[OH+])C(=O)N=C=C1C=CC2=CC=C3C=CCC4=C3C2=C1C=C4 Intermediate Fragment 
177 369.1233688241 C=C=CN(C=[OH+])C(=O)N(C=O)C=C1C=CC2=CC=C3C=CCC4=C3C2=C1C=C4 Intermediate Fragment 
178 367.1077187601 CC1=CN(C#[O+])C(=O)N(C=C2C=CC3=CC=C4C=CCC5=C4C3=C2C=C5)C1=O
179 71.0491412641 C=CC(=C)[OH2+]
180 71.0491412641 C#CCC[OH2+]
181 91.0753560121 CC(O)CC[OH2+]
182 415.1652336361 CC1=CN(C(=[OH+])C#CO)C(=O)N(C=C2C=CC3=C4C2=CC=C2CCCC(CC3)C24)C1=O
183 397.1546689521 C#CC(=[OH+])N1C=C(C)C(=O)N(C=C2C=CC3=C4C2=CC=C2CCCC(=C24)CC3)C1=O
184 413.1495835721 CC1=CN(C(=[OH+])C#CO)C(=O)N(C=C2C=CC3=C4C2=CC=C2CCCC(=C24)CC3)C1=O
185 413.1495835721 CC(=CN(C=O)C(=[OH+])C#CO)C(=O)N=C=C1C=CC2=C3C1=CC=C1CCCC(=C13)CC2 Intermediate Fragment 
186 385.1546689521 CC(=C=[NH+]C(=O)C#CO)C(=O)N=C=C1C=CC2=C3C1=CC=C1CCCC(CC2)C13
187 411.1339335081 CC1=CN(C(=[OH+])C#CO)C(=O)N(C=C2C=CC3=CC=C4CCCC5=C4C3=C2C=C5)C1=O
188 457.1757983201 CC1=CN(C(=C=CO)OC#C[OH2+])C(=O)N(C=C2C=CC3=C4C2=CC=C2CCCC(CC3)C24)C1=O Intermediate Fragment 
189 427.1652336361 C=C([OH+]C#CO)N1C=C(C)C(=O)N(C=C2C=CC3=C4C2=CC=C2CCCC(=C24)CC3)C1=O
190 457.1757983201 CC=C(O)N(C=C1C=CC2=CC=C3CCCC4=C3C2=C1C=C4)C(=O)N(C)C1C=C(O)C(=C=[OH+])O1 Intermediate Fragment 
191 403.1652336361 C[NH+](C(O)=NC=C1C=CC2=C3C1=CC=C1CCCC(=C13)CC2)C1C=C(O)C(=C=O)O1
192 457.1757983201 CC=CN(C(=O)N(C=O)C=C1C=CC2=C3C1=CC=C1CCCC(=C13)CC2)C1C=C(O)C(=C=[OH+])O1 Intermediate Fragment 
193 417.1444981921 O=C=C1OC(=[NH+]C(=O)N(C=O)C=C2C=CC3=C4C2=CC=C2CCCC(CC3)C24)C=C1O
194 389.1495835721 O=C=C1OC(=[NH+]C(O)=NC=C2C=CC3=C4C2=CC=C2CCCC(CC3)C24)C=C1O
195 429.1808837001 CC#C[NH+](C(O)=NC=C1C=CC2=C3C1=CC=C1CCCC(CC2)C13)C1C=C(O)C(=C=O)O1
196 429.1808837001 CC#C[NH+](C=C=C(O)C(=O)C=O)C(O)=NC=C1C=CC2=C3C1=CC=C1CCCC(CC2)C13 Intermediate Fragment 
197 427.1652336361 CC#C[NH+](C(O)=NC=C1C=CC2=C3C1=CC=C1CCCC(=C13)CC2)C1C=C(O)C(=C=O)O1
198 202.1073844121 CCC[NH+](CO)C1C=C(O)C(=CO)O1
199 202.1073844121 CCC[NH+](CO)C(O)=C=C(O)C=CO Intermediate Fragment 
200 200.0917343481 CCC[NH+](CO)C1C=C(O)C(=C=O)O1
201 172.0968197281 CCC[NH2+]C1C=C(O)C(=CO)O1
202 56.0494756121 CCC#[NH+]
203 142.0498695361 C[NH2+]C1C=C(O)C(=C=O)O1
204 144.0655196001 C[NH2+]C1C=C(O)C(=CO)O1
205 172.0968197281 CCC[NH2+]C(O)=C=C(O)C=CO Intermediate Fragment 
206 168.0655196001 CCC[NH+]=C1C=C(O)C(=C=O)O1
207 166.0498695361 CC=C[NH+]=C1C=C(O)C(=C=O)O1
208 457.1757983201 CC(C=O)=CN(C(O)=NC=C1C=CC2=C3C1=CC=C1CCCC(=C13)CC2)C1C=C(O)C(=C=[OH+])O1 Intermediate Fragment 
209 200.0917343481 CC(CO)C[NH2+]C1C=C(O)C(=C=O)O1
210 457.1757983201 CC(=CN(C=O)C1C=C(O)C(=C=[OH+])O1)C(=O)N=C=C1C=CC2=C3C1=CC=C1CCCC(CC2)C13 Intermediate Fragment 
211 304.1695907441 C=C(C)C(=O)[NH+]=C=C1C=CC2=C3C1=CC=C1CCCC(CC2)C13
212 302.1539406801 C=C(C)C(=O)[NH+]=C=C1C=CC2=C3C1=CC=C1CCCC(=C13)CC2
213 300.1382906161 C=C(C)C(=O)[NH+]=C=C1C=CC2=CC=C3CCCC4=C3C2=C1C=C4
214 228.0807757401 [NH+]#CC1=CC=C2C=CC3=CC=CC4=C3C2=C1C=C4
215 160.0604342201 OC=C1OC([NH2+]CO)C=C1O
216 130.0498695361 [NH3+]C1C=C(O)C(=CO)O1
217 160.0604342201 OC=CC(O)=C=C(O)[NH2+]CO Intermediate Fragment 
218 290.1539406801 CCC(=O)[NH+]=C=C1C=CC2=C3C1=CC=C1CCCC(=C13)CC2
219 288.1382906161 CCC(=O)[NH+]=C=C1C=CC2=CC=C3CCCC4=C3C2=C1C=C4
220 194.0447841561 CC#C[NH+](C=O)C1C=C(O)C(=C=O)O1
221 196.0604342201 CC#C[NH+](CO)C1C=C(O)C(=C=O)O1
222 198.0760842841 CC=C[NH+](CO)C1C=C(O)C(=C=O)O1
223 226.0709989041 CC(C=O)=C[NH+](CO)C1C=C(O)C(=C=O)O1
224 228.0866489681 CC(=C[NH+](CO)C1C=C(O)C(=C=O)O1)CO
225 112.0393048521 CC(=C=[NH+]C=O)C=O
226 198.0760842841 CC(CO)C[NH+]=C1C=C(O)C(=C=O)O1
227 230.1022990321 CC(CO)C[NH+](CO)C1C=C(O)C(=C=O)O1
228 202.1073844121 CC(CO)C[NH2+]C1C=C(O)C(=CO)O1
229 230.1022990321 CC(CO)C[NH+](CO)C(O)=C=C(O)C#CO Intermediate Fragment 
230 429.1808837001 CC(=C[NH+]=C1C=C(O)C(=C=O)O1)C(=O)N=C=C1C=CC2=C3C1=CCC1CCCC(CC2)C31
231 399.1703190161 CC(=C[NH+]=C1C=C(O)CO1)C(=O)N=C=C1C=CC2=C3C1=CC=C1CCCC(=C13)CC2
232 411.1703190161 C=C1OC(=[NH+]C=C(C)C(=O)N=C=C2C=CC3=C4C2=CC=C2CCCC(=C24)CC3)C=C1O
233 319.1804897761 CC(C#[NH+])=C(O)N=C=C1C=CC2=C3C1=CCC1CCCC(CC2)C31
234 317.1648397121 CC(C#[NH+])=C(O)N=C=C1C=CC2=C3C1=CC=C1CCCC(CC2)C13
235 315.1491896481 CC(C#[NH+])=C(O)N=C=C1C=CC2=C3C1=CC=C1CCCC(=C13)CC2
236 170.0811696641 CCC[NH2+]C1C=C(O)C(=C=O)O1
237 225.0869833161 CNC(O)C(C)=C[NH+]=C1C=C(O)C(=C=O)O1
238 227.1026333801 CNC(O)C(C)C[NH+]=C1C=C(O)C(=C=O)O1
239 411.1703190161 CC(=C[NH+]=C1C=CC(=C=O)O1)C(=O)N=C=C1C=CC2=C3C1=CC=C1CCCC(CC2)C13
240 429.1808837001 C=C([NH+]=C=C(C)C(=O)N=C=C1C=CC2=C3C1=CC=C1CCCC(CC2)C13)OC(=C=O)CO Intermediate Fragment 
241 357.1597543321 C=C(O)[NH+]=C=C(C)C(=O)N=C=C1C=CC2=C3C1=CC=C1CCCC(=C13)CC2
242 429.1808837001 C=C(O)C(=C=O)OC=[NH+]C=C(C)C(=O)N=C=C1C=CC2=C3C1=CC=C1CCCC(CC2)C13 Intermediate Fragment 
243 343.1441042681 CC(=C[NH+]=C=O)C(=O)N=C=C1C=CC2=C3C1=CC=C1CCCC(=C13)CC2
244 429.1808837001 CC(=C[NH+]=C=C=C(O)C(=O)C=O)C(=O)N=C=C1C=CC2=C3C1=CCC1CCCC(CC2)C31 Intermediate Fragment 
245 341.1648397121 C#C[NH+]=C=C(C)C(=O)N=C=C1C=CC2=C3C1=CC=C1CCCC(CC2)C13
246 411.1703190161 CC(=C[NH+]=C=C=C(O)C#CO)C(=O)N=C=C1C=CC2=C3C1=CC=C1CCCC(CC2)C13
247 429.1808837001 CC(=C=[NH+]C(O)=C=C(O)C#CO)C(=O)N=C=C1C=CC2=C3C1=CCC1CCCC(CC2)C31 Intermediate Fragment 
248 429.1808837001 CC(=C=[NH+]C(=C=CO)OC#CO)C(=O)N=C=C1C=CC2=C3C1=CCC1CCCC(CC2)C31 Intermediate Fragment 
249 427.1652336361 CC(=C[NH+]=C1C=C(O)C(=C=O)O1)C(=O)N=C=C1C=CC2=C3C1=CC=C1CCCC(CC2)C13
250 427.1652336361 CC(=C[NH+]=C=C=C(O)C(=O)C=O)C(=O)N=C=C1C=CC2=C3C1=CC=C1CCCC(CC2)C13 Intermediate Fragment 
251 427.1652336361 CC(=C=[NH+]C(=C=CO)OC#CO)C(=O)N=C=C1C=CC2=C3C1=CC=C1CCCC(CC2)C13 Intermediate Fragment 
252 425.1495835721 CC(=C[NH+]=C1C=C(O)C(=C=O)O1)C(=O)N=C=C1C=CC2=C3C1=CC=C1CCCC(=C13)CC2
253 457.1757983201 CC(=CN=C1C=C(O)C(=C=[OH+])O1)C(=O)N(C=O)C=C1C=CC2=C3C1=CC=C1CCCC(CC2)C13 Intermediate Fragment 
254 457.1757983201 C=C(C)C(=O)N(C=C1C=CC2=C3C1=CC=C1CCCC(CC2)C13)C(=O)N=C1C=C(O)C(=C=[OH+])O1 Intermediate Fragment 
255 457.1757983201 C=C1CC=C2CCCC3=C2C1=C(C(C)=CN1C(=O)C(C)=CN(C2C=C(O)C(=C=[OH+])O2)C1=O)C=C3 Intermediate Fragment 
256 457.1757983201 CC1=CN(C2C=C(O)C(=C=[OH+])O2)C(=O)N(C#CC=C=C2CCC3CCCC4C=CC=C2C43)C1=O Intermediate Fragment 
257 457.1757983201 C=C=C1CCCC2=C1C1=C(C=CC(=CN3C(=O)C(C)=CN(C4C=C(O)C(=C=[OH+])O4)C3=O)C1)CC2 Intermediate Fragment 
258 457.1757983201 CCC1=C2C(=CC=C3C(=CN4C(=O)C(C)=CN(C5C=C(O)C(=C=[OH+])O5)C4=O)C=CC=C32)CCC1 Intermediate Fragment 
259 457.1757983201 CCC1=C2C(=CC=C3CCCC=C32)C(=CN2C(=O)C(C)=CN(C3C=C(O)C(=C=[OH+])O3)C2=O)C=C1 Intermediate Fragment 
260 457.1757983201 CCC1=CC=C2C(=CN3C(=O)C(C)=CN(C4C=C(O)C(=C=[OH+])O4)C3=O)C=CC3=C2C1=C(C)CC3 Intermediate Fragment 
261 457.1757983201 CCC1=C2C(C)=CC=C3C(=CN4C(=O)C(C)=CN(C5C=C(O)C(=C=[OH+])O5)C4=O)C=CC(=C32)CC1 Intermediate Fragment 
262 431.1601482561 CC1=CN(C2C=C(O)C(=C=[OH+])O2)C(=O)N(C=C2C=CC3=C4C2=CC=C(C)C4CCC3)C1=O
263 457.1757983201 CCCC1=C2C=CC=C3C(=CN4C(=O)C(C)=CN(C5C=C(O)C(=C=[OH+])O5)C4=O)C=CC(=C32)CC1 Intermediate Fragment 
264 457.1757983201 CCCC1=CC=C2C(=CN3C(=O)C(C)=CN(C4C=C(O)C(=C=[OH+])O4)C3=O)C=CC3=C2C1=CCC3 Intermediate Fragment 
265 455.1601482561 CC1=CN(C2C=C(O)C(=C=[OH+])O2)C(=O)N(C=C2C=CC3=C4C2=CC=C2CCCC(=C24)CC3)C1=O
