#In-silico ESI-MS/MS [M+H]+ Spectra
#PREDICTED BY CFM-ID 4.0.8
#SMILES=N12C=Nc3c(C1=NC=C(C2C)C=O)ncn3[C@@H]1O[C@H](CO)[C@@H](C1)O
#InChiKey=XSWJJERYRPQXLD-CIPZAGIJSA-N
energy0
216.08799 91.22 32 89 79 68 48 41 39 46 67 36 82 63 59 84 (41.607 0.036506 0.027901 0.017307 0.017115 0.015863 0.010927 0.0080112 0.006357 0.0044102 0.0042624 0.0037595 0.0035698 0.0022)
332.13533 100.00 0 186 156 182 128 127 109 124 152 121 107 106 110 168 148 112 151 (43.913 1.5143 0.20703 0.061802 0.019622 0.015166 0.010791 0.00854 0.0080175 0.0068896 0.0056578 0.0046831 0.0040252 0.0015321 0.0014017 0.001162 0.00023039)
energy1
198.07742 7.26 35 (5.5628)
216.08799 100.00 32 41 48 84 59 79 89 68 46 36 67 82 39 63 (74.288 0.67032 0.27207 0.24085 0.2391 0.20744 0.15496 0.14156 0.10817 0.097271 0.081759 0.072425 0.047564 0.028896)
energy2
57.03349 10.30 173 (1.6781)
66.03383 7.73 142 (1.2593)
68.04948 21.91 143 (3.5716)
78.03383 8.51 144 (1.3872)
94.03997 9.01 43 (1.4687)
96.04439 5.06 78 (0.82522)
96.05562 5.28 42 (0.86102)
99.04406 4.29 25 27 (0.46529 0.23413)
121.05087 8.86 76 (1.4448)
123.05529 4.71 44 (0.76746)
134.04612 56.26 56 (9.1693)
147.06652 12.04 65 (1.9627)
149.08217 6.42 71 (1.046)
160.06177 11.17 52 (1.8198)
162.07742 24.81 51 (4.0435)
172.05054 5.19 81 (0.84608)
174.06619 7.12 80 (1.161)
186.07742 25.24 5 (4.1142)
187.06144 7.17 86 70 92 (0.83528 0.23288 0.1004)
188.09307 31.31 3 (5.1029)
189.07709 22.23 87 69 40 91 (1.3964 1.099 0.8253 0.30233)
198.07742 5.73 35 (0.93394)
199.06144 15.95 83 49 90 (1.3995 0.85952 0.34002)
200.05669 7.83 33 (1.277)
214.07234 36.09 30 88 31 58 38 47 93 45 (1.3854 1.3578 1.1909 0.52317 0.49482 0.43211 0.28309 0.21526)
216.08799 100.00 68 48 32 84 41 46 63 89 67 79 59 39 82 36 (3.774 3.5794 3.258 1.894 0.83743 0.56742 0.49077 0.40555 0.31549 0.29191 0.282 0.23684 0.20382 0.16179)
222.13494 7.03 98 99 100 (0.85873 0.18346 0.10314)
240.08799 5.02 166 (0.81859)
264.14550 4.31 179 (0.70289)
305.12443 5.14 108 153 131 (0.59797 0.23519 0.0051356)

0 332.1353304761 CC1C(C=[OH+])=CN=C2c3ncn(C4CC(O)C(CO)O4)c3N=CN21
1 316.1040303481 OC=C1OC(N2C=NC3=C2N=CN2CC(C=[OH+])=CN=C32)CC1O
2 300.1091157281 C=C1C=CN=C2C3=C(N=CN12)N(C1CC(O)C(=C[OH2+])O1)C=N3
3 188.0930717401 [CH3+]=C1C=CN=C2C3=C(N=CN12)NCN3
4 302.1247657921 C=C1C=CN=C2C3=C(N=CN12)N(C1CC(O)C(C[OH2+])O1)C=N3
5 186.0774216761 [CH3+]=C1C=CN=C2C3=C(N=CN12)NC=N3
6 304.1404158561 C=C1C=CN=C2C3=C(N=CN12)N(C1CC(O)C(C[OH2+])O1)CN3
7 194.1400219321 [CH4+]C1CCNC2C3=C(N=CN12)NCN3
8 286.1298511721 C=C1C=CN=C2C3=C(N=CN12)N(C1CCC(C[OH2+])O1)C=N3
9 304.1404158561 C=C1C=CN=C(C2=CN(C3CC(O)C(C[OH2+])O3)C=N2)N1C=N Intermediate Fragment 
10 304.1404158561 C=C1C=CN=C2C3=C(N=CN12)N(C(C)OC(CO)C[OH2+])C=N3 Intermediate Fragment 
11 304.1404158561 C=C1C=CN=C2C3=C(N=CN12)N(C(O)CC(O)CC[OH2+])C=N3 Intermediate Fragment 
12 314.1247657921 C=C1C(C)=CN=C2C3=C(N=CN12)N(C1CC(O)C(=C[OH2+])O1)C=N3
13 200.0930717401 C=C1C=NC2=C3N=CNC3N=CN2C1=[CH3+]
14 202.1087218041 C=C1C=NC2=C3NCNC3N=CN2C1=[CH3+]
15 204.1243718681 CC1C=NC2=C3NCNC3N=CN2C1=[CH3+]
16 296.1142011081 C=C1OC(N2C=NC3=C2N=CN2C(=C)C(C)=CN=C32)C=C1[OH2+]
17 296.1142011081 C=C1C(C)=CN=C2C3=C(N=CN12)N(C1CCC(=C=[OH+])O1)C=N3
18 314.1247657921 C#CC(C)=C=NC1=C2N=CN(C3CC(O)C(C[OH2+])O3)C2=NC=N1 Intermediate Fragment 
19 314.1247657921 C=C1C(C)=CN=C2C3=C(N=CN12)N(CCC(O)C(=O)C=[OH+])C=N3 Intermediate Fragment 
20 119.0702706321 OC1CCOC1C[OH2+]
21 101.0597059481 C=C1OCCC1[OH2+]
22 101.0597059481 [OH2+]C=C1CCCO1
23 119.0702706321 O=CCC(O)CC[OH2+] Intermediate Fragment 
24 117.0546205681 OC=CC(O)CC=[OH+]
25 99.0440558841 C=C1OCC=C1[OH2+]
26 117.0546205681 CCC(O)C(=O)C=[OH+] Intermediate Fragment 
27 99.0440558841 CC=C(O)C#C[OH2+]
28 115.0389705041 OC1CCOC1=C=[OH+]
29 111.0076703761 O=C1C=COC1=C=[OH+]
30 214.0723362961 C=C1C(C=[OH+])=CN=C2C3=C(N=CN12)NC=N3
31 214.0723362961 C=C(C(=C=N)C#[O+])N1C=NC2=C(C1)N=CN2 Intermediate Fragment 
32 216.0879863601 C=C1C(C=[OH+])=CN=C2C3=C(N=CN12)NCN3
33 200.0566862321 [O+]#CC1=CN=C2C3=C(N=CN2C1)NC=N3
34 184.0617716121 [CH+]=C1C=CN=C2C3=C(N=CN12)NC=N3
35 198.0774216761 [CH+]=C1C(C)=CN=C2C3=C(N=CN12)NC=N3
36 216.0879863601 CC1=C(C#[O+])C=NC(=C2N=CNC2=N)N1C Intermediate Fragment 
37 82.0399735481 [NH2+]=C1C=NC=N1
38 214.0723362961 C=C1C(=C=O)C=NC(=C2N=CNC2=N)N1[CH2+]
39 216.0879863601 C=C1C(C=[OH+])=CN=C(C2=CNC=N2)N1C=N Intermediate Fragment 
40 189.0770873281 C=C1NC(C2=CNC=N2)N=CC1=C=[OH+]
41 216.0879863601 C=C1C(C=[OH+])=CN=CN1C=NC1=CN=CN1 Intermediate Fragment 
42 96.0556236121 C=[NH+]C1=CN=CN1
43 94.0399735481 C#[N+]C1=CN=CN1
44 123.0552892641 C=C1NCN=CC1=C=[OH+]
45 214.0723362961 C=C1C(C=O)=CN=CN1C#[N+]C1=CN=CN1
46 216.0879863601 C=NC1=C(C2=NC=C(C=[OH+])C(=C)N2)N=CN1 Intermediate Fragment 
47 214.0723362961 C#[N+]C1=C(C2=NC=C(C=O)C(=C)N2)N=CN1
48 216.0879863601 C=C(C=[OH+])C(=C)N1C=NC2=C(N=CN2)C1=N Intermediate Fragment 
49 199.0614372641 C=C(C#[O+])C(=C)N1C=NC2=NC=NC2=C1
50 164.0930717401 C=CN1C=NC2=C(NCN2)C1=[NH2+]
51 162.0774216761 C#CN1C=NC2=C(NCN2)C1=[NH2+]
52 160.0617716121 C#CN1C=NC2=C(N=CN2)C1=[NH2+]
53 158.0461215481 [C+]#CN1C=NC2=C(N=CN2)C1=N
54 138.0774216761 [NH2+]=C1N=CN=C2NCNC12
55 136.0617716121 [NH2+]=C1N=CN=C2NCN=C12
56 134.0461215481 [NH2+]=C1N=CN=C2N=CN=C12
57 83.0491412641 C#CC(=C)C[OH2+]
58 214.0723362961 C=C(C#[O+])C(=C)N1C=NC2=C(N=CN2)C1=N
59 216.0879863601 CN=C1C2=C(N=CN1C(C)=C=C=[OH+])NC=N2 Intermediate Fragment 
60 174.0774216761 C#CN1C=NC2NC=NC2=C1[NH+]=C
61 148.0617716121 C[NH+]=C1N=CN=C2N=CN=C21
62 146.0461215481 C=[N+]=C1N=CN=C2N=CN=C21
63 216.0879863601 C#CN1C=NC2=C(NCN2)C1=NC=C=C[OH2+] Intermediate Fragment 
64 145.0508725801 C#[CH+]N1C=NC2=NC=NC2=C1
65 147.0665226441 C#[CH+]N1C=NC2NC=NC2=C1
66 188.0566862321 O=C=C=C=[NH+]C1=C2NCNC2=NC=N1
67 216.0879863601 C#CC(=C=NC1=C2NCNC2=NC=N1)C[OH2+] Intermediate Fragment 
68 216.0879863601 C=C(C(=C=N)C=[OH+])N1C=NC2=C(C1)N=CN2 Intermediate Fragment 
69 189.0770873281 CC(=C=C=[OH+])N1C=NC2NC=NC2=C1
70 187.0614372641 CC(=C=C=[OH+])N1C=NC2=NC=NC2=C1
71 149.0821727081 C#[CH+]N1C=NC2NCNC2=C1
72 143.0352225161 [C+]#CN1C=NC2=NC=NC2=C1
73 72.0443902321 [NH+]#CCCO
74 125.0821727081 C1=[NH+]CC2NCNC2=N1
75 123.0665226441 C1=[NH+]CC2=NCNC2=N1
76 121.0508725801 C1=NC2=NC=[NH+]CC2=N1
77 94.0287401681 C=C=C(C#[NH+])C=O
78 96.0443902321 C=C=C(C#[NH+])CO
79 216.0879863601 C=C1C(C=[OH+])=CN=C2C=C(NC=N)N=CN12 Intermediate Fragment 
80 174.0661882961 C=C1C(C=[OH+])=CN=C2C=CN=CN12
81 172.0505382321 C=C1C(C#[O+])=CN=C2C=CN=CN12
82 216.0879863601 C=C1C(C=[OH+])=CN=C2C(N=CN)=CN=CN12 Intermediate Fragment 
83 199.0614372641 C#[N+]C1=CN=CN2C(=C)C(C=O)=CN=C12
84 216.0879863601 C=NC1=C(N)N=CN2C(=C)C(C=[OH+])=CN=C12 Intermediate Fragment 
85 185.0457872001 [CH+]=C1C(=C=O)C=NC2=CC(=N)N=CN12
86 187.0614372641 C=C1C(=C=O)C=NC2=CC(=[NH2+])N=CN12
87 189.0770873281 C=C1C(=C=O)C=NC2=CC([NH3+])N=CN12
88 214.0723362961 C#[N+]C1=C(N)N=CN2C(=C)C(C=O)=CN=C12
89 216.0879863601 C=NC1=C(N)C2=NC=C(C=[OH+])C(=C)N2C=N1 Intermediate Fragment 
90 199.0614372641 C=NC1=CC2=NC=C(C#[O+])C(=C)N2C=N1
91 189.0770873281 C=C1C(C=O)=CN=C2C([NH3+])=CN=CN12
92 187.0614372641 C=C1C(C#[O+])=CN=C2C(N)=CN=CN12
93 214.0723362961 C=NC1=C(N)C2=NC=C(C#[O+])C(=C)N2C=N1
94 218.1036364241 C=C1C(C[OH2+])=CN=C2C3=C(N=CN12)NCN3
95 218.1036364241 C=C(C=[OH+])C(=C)N1C=NC2=C(NCN2)C1=N Intermediate Fragment 
96 220.1192864881 CC1C(C[OH2+])=CN=C2C3=C(N=CN21)NCN3
97 220.1192864881 C=C(C[OH2+])C(=C)N1C=NC2=C(NCN2)C1=N Intermediate Fragment 
98 222.1349365521 CC1C(C[OH2+])CN=C2C3=C(N=CN21)NCN3
99 222.1349365521 C=C(C[OH2+])C(C)N1C=NC2=C(NCN2)C1=N Intermediate Fragment 
100 222.1349365521 CCN1C=NC2=C(NCN2)C1=NC=CC[OH2+] Intermediate Fragment 
101 300.1091157281 C=C1C(C=[OH+])=CN=C2C3=C(N=CN12)N(C1CC(O)CO1)C=N3
102 302.1247657921 C=C1C(C=[OH+])=CN=C2C3=C(N=CN12)N(C1CC(O)CO1)CN3
103 304.1404158561 C=C1C(C[OH2+])=CN=C2C3=C(N=CN12)N(C1CC(O)CO1)CN3
104 314.1247657921 C=C1C(C=[OH+])=CN=C2C3=C(N=CN12)N(C1CC(O)C(C)O1)C=N3
105 314.1247657921 C=C1C(C=[OH+])=CN=C2C3=C(N=CN12)N(C1CCC(CO)O1)C=N3
106 332.1353304761 CC1=C(C=[OH+])C=NC(=C2N=CN(C3CC(O)C(=CO)O3)C2=N)N1C Intermediate Fragment 
107 332.1353304761 C=C1C(C=[OH+])=CN=C(C2=CN(C3CC(O)C(CO)O3)C=N2)N1C=N Intermediate Fragment 
108 305.1244314441 C=C1NC(C2=CN(C3CC(O)C(CO)O3)C=N2)=NC=C1C=[OH+]
109 332.1353304761 C=C1C(C=[OH+])=CN=CN1C=NC1=CN=CN1C1CC(O)C(CO)O1 Intermediate Fragment 
110 332.1353304761 C=NC1=C(C2=NC=C(C=[OH+])C(=C)N2)N=CN1C1CC(O)C(CO)O1 Intermediate Fragment 
111 212.1029677281 C=[NH+]C1=CN=CN1C1CC(O)C(CO)O1
112 332.1353304761 C=C(C=[OH+])C(=C)N1C=NC2=C(N=CN2C2CC(O)C(CO)O2)C1=N Intermediate Fragment 
113 280.1404158561 C=CN1C=NC2=C(NCN2C2CC(O)C(CO)O2)C1=[NH2+]
114 278.1247657921 C#CN1C=NC2=C(NCN2C2CC(O)C(CO)O2)C1=[NH2+]
115 276.1091157281 C#CN1C=NC2=C(N=CN2C2CC(O)C(CO)O2)C1=[NH2+]
116 252.1091157281 [NH3+]C1=C2N=CN(C3CC(O)C(CO)O3)C2=NC=N1
117 252.1091157281 [NH3+]C1=C2N=CN(C(=O)CC(O)CCO)C2=NC=N1 Intermediate Fragment 
118 250.0934656641 [NH3+]C1=C2N=CN(C3CC(O)C(=CO)O3)C2=NC=N1
119 250.0934656641 [NH3+]C1=C2N=CN(C(=O)CC(O)C=CO)C2=NC=N1 Intermediate Fragment 
120 248.0778156001 [NH3+]C1=C2N=CN(C3CC(O)C(=C=O)O3)C2=NC=N1
121 332.1353304761 CN=C1C2=C(N=CN1C(C)=C=C=[OH+])N(C1CC(O)C(CO)O1)C=N2 Intermediate Fragment 
122 264.1091157281 C=[NH+]C1=C2N=CN(C3CC(O)C(CO)O3)C2=NC=N1
123 264.1091157281 C=[NH+]C1=C2N=CN(C(=O)CC(O)CCO)C2=NC=N1 Intermediate Fragment 
124 332.1353304761 C#CN1C=NC2=C(NCN2C2CC(O)C(CO)O2)C1=NC=C=C[OH2+] Intermediate Fragment 
125 263.1138667601 C#CN1C=NC2=C(C1)N=CN2C1CC(O)C(C[OH2+])O1
126 265.1295168241 C#CN1C=NC2=C(C1)NCN2C1CC(O)C(C[OH2+])O1
127 332.1353304761 C#CC(=C=NC1=C2NCN(C3CC(O)C(CO)O3)C2=NC=N1)C[OH2+] Intermediate Fragment 
128 332.1353304761 C=C(C(=C=N)C=[OH+])N1C=NC2=C(C1)N=CN2C1CC(O)C(CO)O1 Intermediate Fragment 
129 315.1087813801 C=C(C=[OH+])C(=C)N1C=NC2=C(C1)N=CN2C1CC(O)C(=C=O)O1
130 203.0927373921 C=C(C=[OH+])C(=C)N1C=NC2NC=NC2=C1
131 305.1244314441 CC(=C=C=[OH+])N1C=NC2=C(C1)N=CN2C1CC(O)C(CO)O1
132 303.1087813801 CC(=C=C=[OH+])N1C=NC2=C(C1)N=CN2C1CC(O)C(=CO)O1
133 261.0982166961 C#CN1C=NC2=C(C1)N=CN2C1CC(O)C(=C[OH2+])O1
134 259.0825666321 C#CN1C=NC2=C(C1)N=CN2C1CC(O)C(=C=[OH+])O1
135 70.0287401681 [NH+]#CC=CO
136 241.1295168241 OC1CC(N2CNC3CN=CN=C32)OC1C[OH2+]
137 239.1138667601 OC1CC(N2CNC3=CN=CN=C32)OC1C[OH2+]
138 237.0982166961 OC1CC(N2C=NC3=CN=CN=C32)OC1C[OH2+]
139 237.0982166961 O=C(CC(O)CC[OH2+])N1C=NC2=CN=CN=C21 Intermediate Fragment 
140 235.0825666321 OC1CC(N2C=NC3=CN=CN=C32)OC1=C[OH2+]
141 233.0669165681 OC1CC(N2C=NC3=CN=CN=C32)OC1=C=[OH+]
142 66.0338255481 CC#CC#[NH+]
143 68.0494756121 CC=CC#[NH+]
144 78.0338255481 [CH+]=C=C(C)C#N
145 98.0600402961 CC=C(C#[NH+])CO
146 80.0494756121 C=C=C(C)C#[NH+]
147 330.1196804121 CC(=C(C#[NH+])C=O)N1C=NC2=C(C1)N=CN2C1CC(O)C(=CO)O1
148 332.1353304761 C=C1C(C=[OH+])=CN=C2C=C(N(C=N)C3CC(O)C(CO)O3)N=CN12 Intermediate Fragment 
149 315.1087813801 C=C1C(C=O)=CN=C2C=C([NH+](C)C3CC(O)C(=C=O)O3)N=CN12
150 176.0818383601 C=C1C(C[OH2+])=CN=C2C=CN=CN12
151 332.1353304761 C=C1C(C=[OH+])=CN=C2C(N=CNC3CC(O)C(CO)O3)=CN=CN12 Intermediate Fragment 
152 332.1353304761 C=NC1=C(NC2CC(O)C(CO)O2)N=CN2C(=C)C(C=[OH+])=CN=C12 Intermediate Fragment 
153 305.1244314441 C=C1C(C=O)=CN=C2C=C([NH2+]C3CC(O)C(CO)O3)N=CN12
154 203.0927373921 C=C1C(C=O)=CN=C2C([NH2+]C)=CN=CN12
155 201.0770873281 C=[NH+]C1=CN=CN2C(=C)C(C=O)=CN=C12
156 332.1353304761 C=C1C(C=[OH+])=CN=C2C3=C(N=CN12)N(CCC(O)C(O)CO)C=N3 Intermediate Fragment 
157 314.1247657921 C=C1C(C=[OH+])=CN=C2C3=C(N=CN12)N(CCC(O)C=CO)C=N3
158 296.1142011081 C#CC(O)CCN1C=NC2=C1N=CN1C(=C)C(C=[OH+])=CN=C21
159 272.1142011081 C=C1C(C=[OH+])=CN=C2C3=C(N=CN12)N(CCCO)C=N3
160 270.0985510441 C=C1C(C=[OH+])=CN=C2C3=C(N=CN12)N(CC=CO)C=N3
161 296.1142011081 C=C1C(C=[OH+])=CN=C2C3=C(N=CN12)N(CCCC#CO)C=N3
162 276.1455012361 C=C1C(C[OH2+])=CN=C2C3=C(N=CN12)N(CCCO)CN3
163 274.1298511721 C=C1C(C=[OH+])=CN=C2C3=C(N=CN12)N(CCCO)CN3
164 242.1036364241 C=C1C(C=[OH+])=CN=C2C3=C(N=CN12)N(CC)C=N3
165 244.1192864881 C=C1C(C=[OH+])=CN=C2C3=C(N=CN12)N(CC)CN3
166 240.0879863601 C=CN1C=NC2=C1N=CN1C(=C)C(C=[OH+])=CN=C21
167 91.0389705041 OCC(=[OH+])CO
168 332.1353304761 C=C1C(C=[OH+])=CN=C2C3=C(N=CN12)N(C(C)OC(CO)CO)C=N3 Intermediate Fragment 
169 246.1349365521 C=C1C(C[OH2+])=CN=C2C3=C(N=CN12)N(CC)CN3
170 248.1505866161 CCN1CNC2=C1N=CN1C2=NC=C(C[OH2+])C1C
171 77.0597059481 OCCC[OH2+]
172 75.0440558841 OCC=C[OH2+]
173 57.0334912001 C#CC[OH2+]
174 256.0829009801 C=C1C(C=[OH+])=CN=C2C3=C(N=CN12)N(C(C)=O)C=N3
175 258.0985510441 C=C1C(C=[OH+])=CN=C2C3=C(N=CN12)N(C(C)O)C=N3
176 260.1142011081 C=C1C(C=[OH+])=CN=C2C3=C(N=CN12)N(C(C)O)CN3
177 242.1036364241 C=C1C(C)=CN=C2C3=C(N=CN12)N(C(C)=[OH+])C=N3
178 262.1298511721 C=C1C(C[OH2+])=CN=C2C3=C(N=CN12)N(C(C)O)CN3
179 264.1455012361 CC1C(C[OH2+])=CN=C2C3=C(N=CN21)N(C(C)O)CN3
180 300.1091157281 C=C1C(C=[OH+])=CN=C2C3=C(N=CN12)N(C(C)OC=CO)C=N3
181 302.1247657921 C=C1C(C=[OH+])=CN=C2C3=C(N=CN12)N(C(C)OCCO)C=N3
182 332.1353304761 C=C1C(C=[OH+])=CN=C2C3=C(N=CN12)N(C(CCO)OCCO)C=N3 Intermediate Fragment 
183 47.0491412641 CC[OH2+]
184 288.1091157281 C=C1C(C=[OH+])=CN=C2C3=C(N=CN12)N(C(O)CCO)C=N3
185 290.1247657921 C=C1C(C=[OH+])=CN=C2C3=C(N=CN12)N(C(O)CCO)CN3
186 332.1353304761 C=C1C(C=[OH+])=CN=C2C3=C(N=CN12)N(C(O)CC(O)CCO)C=N3 Intermediate Fragment 
187 286.0934656641 C=C1C(C=[OH+])=CN=C2C3=C(N=CN12)N(C(=O)CCO)C=N3
188 73.0284058201 OCC#C[OH2+]
189 248.1142011081 C=C1C(C[OH2+])=CN=C2C3=C(N=CN12)N(CO)CN3
190 246.0985510441 C=C1C(C=[OH+])=CN=C2C3=C(N=CN12)N(CO)CN3
191 244.0829009801 C=C1C(C=[OH+])=CN=C2C3=C(N=CN12)N(CO)C=N3
192 89.0597059481 CC(O)C=C[OH2+]
193 71.0491412641 C#CC(C)[OH2+]
194 71.0491412641 CCC#C[OH2+]
195 91.0753560121 CC(O)CC[OH2+]
