#In-silico ESI-MS/MS [M+H]+ Spectra
#PREDICTED BY CFM-ID 4.0.8
#SMILES=[C@H]1(C[C@@H](O[C@@H]1CO)n1ccc(nc1=O)Nc1cc2c(c3c1nccc3)nc(n2C)N)O
#InChiKey=HQMXCTOGPCGWDD-IIAWOOMASA-N
energy0
308.12543 100.00 5 41 88 28 86 61 83 49 67 65 66 78 70 72 54 64 58 77 76 (81.509 1.0042 0.82277 0.44589 0.30897 0.13163 0.046024 0.039014 0.016155 0.01124 0.0091796 0.0083951 0.0079541 0.0031171 0.0027591 0.00088447 0.00078822 0.00070563 0.00010998)
energy1
265.11962 4.90 20 42 (2.4107 0.45484)
279.09889 3.03 87 31 (1.5937 0.18027)
280.13052 5.18 39 (3.0329)
291.09889 16.65 27 29 47 71 79 (8.8009 0.36947 0.2956 0.14643 0.12996)
306.10978 4.88 6 40 95 53 48 63 94 93 75 (1.8825 0.78209 0.10709 0.039345 0.018877 0.012768 0.0092447 0.0013451 0.0001938)
308.12543 100.00 5 28 41 86 88 61 58 78 70 83 49 54 66 65 67 72 76 77 64 (50.912 3.2056 1.4443 0.95579 0.85798 0.27772 0.211 0.14939 0.12832 0.111 0.076701 0.032444 0.029539 0.027186 0.026864 0.026648 0.025434 0.021056 0.0056325)
334.14108 3.72 123 (2.1776)
energy2
43.01784 5.30 177 (1.2177)
45.03349 3.52 179 (0.8096)
57.03349 7.55 128 (1.7354)
97.03964 3.14 24 (0.72233)
99.04406 2.99 101 99 98 (0.3071 0.19362 0.1877)
197.08217 13.85 25 107 (2.1535 1.0312)
210.07742 11.91 18 (2.7394)
212.09307 29.28 12 (6.7329)
214.10872 7.42 11 112 109 111 110 108 (0.93971 0.28067 0.14907 0.11474 0.11468 0.10755)
236.09307 6.05 52 (1.3905)
238.10872 3.31 51 (0.76011)
248.09307 4.34 50 (0.9984)
253.11962 4.94 45 (1.1352)
261.08832 6.66 35 44 (1.3391 0.19166)
263.10397 22.85 36 43 (4.9471 0.30631)
265.11962 18.00 20 42 (3.4938 0.64525)
266.10364 6.48 80 (1.4896)
279.09889 5.08 87 31 (0.74839 0.4193)
280.13052 8.30 39 (1.9081)
281.11454 4.88 89 30 74 (0.70176 0.32518 0.094496)
290.11487 9.42 23 156 (2.0844 0.080381)
291.09889 22.67 27 29 47 79 71 (2.9926 1.6503 0.39526 0.12517 0.048595)
306.10978 13.55 53 6 40 63 48 75 94 93 95 (0.82389 0.79262 0.68023 0.27766 0.24845 0.14015 0.069196 0.061038 0.021029)
308.12543 100.00 28 5 41 49 58 88 61 54 72 78 86 67 83 64 65 70 66 77 76 (6.5285 5.0954 1.6918 1.5381 1.4928 1.4608 1.3618 1.1413 0.62656 0.59684 0.49579 0.20418 0.18226 0.13706 0.11135 0.10748 0.098801 0.0617 0.059048)
310.14108 3.83 4 19 21 22 (0.31881 0.31027 0.15926 0.092714)
318.10978 6.60 152 153 157 158 159 (0.59303 0.52988 0.15099 0.1308 0.11252)
320.12543 4.06 135 (0.93381)
322.14108 5.17 136 (1.1878)
340.18803 4.69 126 (1.0779)
381.16696 3.89 206 (0.89417)

0 424.1727786041 Cn1c(N)nc2c3cccnc3c([NH2+]c3ccn(C4CC(O)C(CO)O4)c(=O)n3)cc21
1 392.1465638561 CN1C2=CC(=[NH+]C3=NC(=O)N(C4C=C(O)CO4)C=C3)C3=NC=CCC3=C2N=C1N
2 394.1622139201 CN1C2=CC(=[NH+]C3=NC(=O)N(C4C=C(O)CO4)C=C3)C3=NC=CCC3=C2NC1N
3 406.1622139201 C=C1OC(N2C=CC([NH+]=C3C=C4C(=C5CC=CN=C35)NC(N)N4C)=NC2=O)C=C1O
4 310.1410845521 CN1C2=CC(=[NH+]C3=CC=NC(O)=N3)C3=NC=CCC3C2=NC1N
5 308.1254344881 CN1C(=N)N=C2C1=CC(=[NH+]C1=CC=NC(O)=N1)C1=NC=CCC21
6 306.1097844241 CN1C(=N)N=C2C1=CC(=[NH+]C1=CC=NC(O)=N1)C1=C2C=CC=N1
7 388.1516492361 C=C1C=CC(N2C=CC([NH+]=C3C=C4C(=C5CC=CN=C35)N=C(N)N4C)=NC2=O)O1
8 406.1622139201 C=C1OC(N2C=CC([NH+]=C3C=C(NC)C(N=CN)=C4CC=CN=C34)=NC2=O)C=C1O Intermediate Fragment 
9 314.1723846801 CN1C2=CC(=[NH+]C3=CC=NC(O)=N3)C3NCCCC3=C2NC1N
10 218.1400219321 CN1C2=CC(=[NH2+])C3=NCCCC3=C2NC1N
11 214.1087218041 CN1C2=CC(=[NH2+])C3=NC=CCC3=C2N=C1N
12 212.0930717401 [CH2+]N1C2=CC(=N)C3=NC=CCC3=C2N=C1N
13 112.0505382321 [NH3+]C1=CC=NC(O)=N1
14 314.1723846801 CN1C2=CC(=[NH+]C(=C=C=N)N=C=O)C3NCCCC3C2NC1N Intermediate Fragment 
15 267.1352709001 CN1C2=CC(=NC#CC#[NH+])C3=NCCCC3=C2NC1N
16 312.1567346161 CN1C2=CC(=[NH+]C3=CC=NC(O)=N3)C3=NCCCC3=C2NC1N
17 292.1305198681 CN1C2=CC(=[NH+]C3=CC=NC=N3)C3=NC=CCC3=C2N=C1N
18 210.0774216761 [CH2+]N1C(=N)N=C2C1=CC(=N)C1=C2C=CC=N1
19 310.1410845521 CN1C2=CC(=[NH+]C(=C=C=N)N=C=O)C3=NCCCC3=C2NC1N Intermediate Fragment 
20 265.1196208361 CN1C2=CC(=NC#CC#[NH+])C3=NC=CCC3=C2NC1N
21 310.1410845521 C=NC(O)=NC(=C)[NH+]=C1C=C2C(=C3CC=CN=C13)N=C(N)N2C Intermediate Fragment 
22 310.1410845521 CN(C=N)C1=CC(=[NH+]C2=CC=NC(O)=N2)C2=NC=CCC2=C1N Intermediate Fragment 
23 290.1148698041 [CH2+]N1C2=CC(=NC3=CC=NC=N3)C3=NC=CCC3=C2N=C1N
24 97.0396392001 [OH2+]C1=NC=CC=N1
25 197.0821727081 [CH2+]N1C(N)=NC2=C1C=CC1=C2C=CC=N1
26 292.0941343601 NC1=NC2=CC(=[NH+]C3=CC=NC(O)=N3)C3=C(C=CC=N3)C2=N1
27 291.0988853921 [CH2+]N1C=NC2=C3CC=CN=C3C(=NC3=CC=NC(O)=N3)C=C21
28 308.1254344881 CN1C2=CC(=[NH+]C(=C=C=N)N=C=O)C3=NC=CCC3=C2NC1N Intermediate Fragment 
29 291.0988853921 C#CC(N=C1C=C2C(=C3CC=CN=C13)N=C(N)N2C)=[N+]=C=O
30 281.1145354561 C=C(N=C1C=C2C(=NC(=N)N2C)C2CC=CN=C12)[NH+]=C=O
31 279.0988853921 C=C(N=C1C=C2C(=NC(=N)N2C)C2=C1N=CC=C2)[NH+]=C=O
32 267.0988853921 CN1C(N)=NC2=C1C=C(N=C=[NH+]C=O)C1=C2C=CC=N1
33 265.0832353281 CN1C(N)=NC2=C1C=C(N=C=[N+]=C=O)C1=C2C=CC=N1
34 44.0494756121 CC=[NH2+]
35 261.0883207081 [CH2+]N1C2=CC(=NC#CC#N)C3=NC=CCC3=C2N=C1N
36 263.1039707721 CN1C2=CC(=NC#CC#[NH+])C3=NC=CCC3=C2N=C1N
37 276.0992197401 CN1C(=N)N=C2C1=CC(=NC(N)=[C+]C#N)C1=C2C=CC=N1
38 278.1148698041 CN1C(=N)N=C2C1=CC(=NC(N)=CC#[NH+])C1=C2C=CC=N1
39 280.1305198681 CN1C(=N)N=C2C1=CC(=NC(N)=CC#[NH+])C1=NC=CCC21
40 306.1097844241 CN1C2=CC(=NC(=CC#[NH+])N=C=O)C3=NC=CCC3=C2N=C1N
41 308.1254344881 CN1C2=CC(=[NH+]C(N)=C=C=NC=O)C3=NC=CCC3=C2N=C1N Intermediate Fragment 
42 265.1196208361 C#CC(=[NH2+])N=C1C=C2C(=NC(=N)N2C)C2CC=CN=C12
43 263.1039707721 C#CC(=[NH2+])N=C1C=C2C(=NC(=N)N2C)C2=C1N=CC=C2
44 261.0883207081 [C+]#CC(=N)N=C1C=C2C(=NC(=N)N2C)C2=C1N=CC=C2
45 253.1196208361 C=C([NH3+])N=C1C=C2C(=NC(=N)N2C)C2=C1N=CC=C2
46 251.1039707721 [CH+]=C(N)N=C1C=C2C(=NC(=N)N2C)C2=C1N=CC=C2
47 291.0988853921 CN1C(N)=NC2=C1C=C(N=C=C=C=[NH+]C=O)C1=C2C=CC=N1
48 306.1097844241 CN1C2=CC(=NC(N)=C=C=NC#[O+])C3=NC=CCC3=C2N=C1N
49 308.1254344881 CN1C2=C(NC1N)C1=C(N=CC=C1)C([NH+]=C=C=C=NC(=N)O)=C2 Intermediate Fragment 
50 248.0930717401 C#CC#[N+]C1=CC2=C(N=C(N)N2C)C2=C1N=CC=C2
51 238.1087218041 C#C[NH+]=C1C=C2C(=NC(=N)N2C)C2CC=CN=C12
52 236.0930717401 C#C[NH+]=C1C=C2C(=NC(=N)N2C)C2=C1N=CC=C2
53 306.1097844241 CN1C(N)=NC2=C1C=C(N=C=C=C=[NH+]C(=N)O)C1=C2C=CC=N1
54 308.1254344881 C=C=NC(=O)N=C=[NH+]C1=CC2=C(NC(N)N2C)C2=C1N=CC=C2 Intermediate Fragment 
55 224.0930717401 C#[N+]C1=CC2=C(N=C(N)N2C)C2=C1N=CC=C2
56 239.1039707721 CN1C(=N)N=C2C1=CC(=NC#[NH+])C1=NC=CCC21
57 241.1196208361 CN1C2=CC(=NC#[NH+])C3=NC=CCC3C2=NC1N
58 308.1254344881 C=NC(O)=NC(=C)N=C1C=C2C(=C3CC=CN=C13)N=C(N)N2[CH2+] Intermediate Fragment 
59 234.0774216761 [C+]#CN=C1C=C2C(=NC(=N)N2C)C2=C1N=CC=C2
60 277.0832353281 [CH+]=C(N=C=O)N=C1C=C2C(=NC(=N)N2C)C2=C1N=CC=C2
61 308.1254344881 C=C=C(N=C(N)O)N=C1C=C2C(=C3CC=CN=C13)N=C(N)N2[CH2+] Intermediate Fragment 
62 282.1097844241 CN1C(N)=NC2=C1C=C(N=C=NC([NH3+])=O)C1=C2C=CC=N1
63 306.1097844241 [C+]#CC(=NC(N)=O)N=C1C=C2C(=C3CC=CN=C13)N=C(N)N2C
64 308.1254344881 [CH2+]N1C=C(C2=CC=CN=C2C(C)=NC2=CC=NC(O)=N2)N=C1N Intermediate Fragment 
65 308.1254344881 CN1C(=N)N=CC1=CC(=[NH+]C1=CC=NC(O)=N1)C1=CC=CC=N1 Intermediate Fragment 
66 308.1254344881 CN1C(=C=C=[NH+]C2=CC=NC(O)=N2)C(=C2C=NC=CC2)N=C1N Intermediate Fragment 
67 308.1254344881 C=C1C(=C2CC=CN=C2C#[N+]C2=CC=NC(O)=N2)N=C(N)N1C Intermediate Fragment 
68 199.0614372641 OC1=NC([N+]#CC2=CC=CC=N2)=CC=N1
69 187.0978227721 C=C1C(C2=CN=CC=C2)=NC(=[NH2+])N1C
70 308.1254344881 C=C=CC1=C2N=C(N)N(C)C2=CC(=[NH+]C2=CC=NC(O)=N2)C1=N Intermediate Fragment 
71 291.0988853921 [C+]#CCC1=CC(=NC2=CC=NC(O)=N2)C=C2C1=NC(=N)N2C
72 308.1254344881 C=CC1=C2N=C(N)N([CH2+])C2=CC(=NC2=CC=NC(O)=N2)C1=NC Intermediate Fragment 
73 277.0832353281 [C+]#CC1=CC(=NC2=CC=NC(O)=N2)C=C2C1=NC(=N)N2C
74 281.1145354561 C#CC1=CC(=[NH+]C2=CC=NC(O)=N2)C=C2C1=NC(N)N2C
75 306.1097844241 C#CC1=C2N=C(N)N(C)C2=CC(=NC2=CC=NC(O)=N2)C1=[N+]=C
76 308.1254344881 C=CN=C1C(=NC2=CC=NC(O)=N2)C=C2C(=C1C)N=C(N)N2[CH2+] Intermediate Fragment 
77 308.1254344881 C=C=CN=C1C=C2N=C(N)N(C)C2=CC1=[NH+]C1=CC=NC(O)=N1 Intermediate Fragment 
78 308.1254344881 [CH2+]N(C(=N)N)C1=CC(=NC2=CC=NC(O)=N2)C2=NC=CCC2=C1 Intermediate Fragment 
79 291.0988853921 C=[N+](C#N)C1=CC(=NC2=CC=NC(O)=N2)C2=NC=CCC2=C1
80 266.1036364241 C=NC1=CC(=[NH+]C2=CC=NC(O)=N2)C2=NC=CCC2=C1
81 264.0879863601 C#[N+]C1=CC(=NC2=CC=NC(O)=N2)C2=NC=CCC2=C1
82 239.0927373921 OC1=NC([NH+]=C2C=CC=C3CC=CN=C32)=CC=N1
83 308.1254344881 C=NC(N)=NC1=C2CC=CN=C2C(=[NH+]C2=CC=NC(O)=N2)C=C1 Intermediate Fragment 
84 252.0879863601 N=C1C=CC(=[NH+]C2=CC=NC(O)=N2)C2=C1C=CC=N2
85 277.0832353281 N#CN=C1C=CC(=[NH+]C2=CC=NC(O)=N2)C2=C1C=CC=N2
86 308.1254344881 C=NC1=CC(=[NH+]C2=CC=NC(O)=N2)C2=NC=CCC2=C1N=CN Intermediate Fragment 
87 279.0988853921 C=NC1=CC(=[NH+]C2=CC=NC(O)=N2)C2=C(C=CC=N2)C1=N
88 308.1254344881 CN(C#N)C1=CC(=[NH+]C2=CC=NC(O)=N2)C2=NC=CCC2=C1N Intermediate Fragment 
89 281.1145354561 C=NC1=CC(=[NH+]C2=CC=NC(O)=N2)C2=NC=CCC2C1=N
90 256.1192864881 NC1C=CC(=[NH+]C2=CC=NC(O)=N2)C2=NC=CCC21
91 254.1036364241 N=C1C=CC(=[NH+]C2=CC=NC(O)=N2)C2=NC=CCC12
92 288.0992197401 [CH2+]N1C(=N)N=C2C1=CC(=NC1=CC=NC=N1)C1=C2C=CC=N1
93 306.1097844241 C=C=NC(=O)N=C=[NH+]C1=CC2=C(N=C(N)N2C)C2=C1N=CC=C2 Intermediate Fragment 
94 306.1097844241 C=NC(O)=NC(=C)N=C1C=C2C(=NC(=N)N2[CH2+])C2=C1N=CC=C2 Intermediate Fragment 
95 306.1097844241 C=NC1=CC(=[NH+]C2=CC=NC(O)=N2)C2=NC=CCC2=C1N=C=N Intermediate Fragment 
96 115.0389705041 OC1C=COC1=C[OH2+]
97 117.0546205681 OC1C=COC1C[OH2+]
98 99.0440558841 C=C1OCC=C1[OH2+]
99 99.0440558841 [OH2+]C=C1C=CCO1
100 117.0546205681 C=C=C(O)C(O)C[OH2+] Intermediate Fragment 
101 99.0440558841 C=C=C(O)C=C[OH2+]
102 117.0546205681 OC=C=C(O)CC[OH2+] Intermediate Fragment 
103 117.0546205681 OC=C=COCC[OH2+] Intermediate Fragment 
104 406.1622139201 CN1C2=CC(=[NH+]C3=NCN(C4C=C(O)C(=C=O)O4)C=C3)C3=NC=CCC3=C2NC1N
105 220.1556719961 CN1C2=CC(=[NH2+])C3=NCCCC3C2NC1N
106 216.1243718681 CN1C2=CC(=[NH2+])C3=NC=CCC3C2=NC1N
107 197.0821727081 [CH2+]N1C=NC2=C3CC=CN=C3C(=N)C=C21
108 214.1087218041 CN1C(=CC#[NH+])C(=C2C=NC=CC2)N=C1N Intermediate Fragment 
109 214.1087218041 C=CC1=C2N=C(N)N([CH2+])C2=CC(=N)C1=NC Intermediate Fragment 
110 214.1087218041 [CH2+]N(C(=N)N)C1=CC(=N)C2=NC=CCC2=C1 Intermediate Fragment 
111 214.1087218041 C=NC1=CC(=[NH2+])C2=NC=CCC2=C1N=CN Intermediate Fragment 
112 214.1087218041 CN(C#N)C1=CC(=[NH2+])C2=NC=CCC2=C1N Intermediate Fragment 
113 187.0978227721 C=NC1=CC(=[NH2+])C2=NC=CCC2C1=N
114 185.0821727081 C=NC1=CC(=[NH2+])C2=C(C=CC=N2)C1=N
115 213.0869833161 OC1C=C(N2CCCNC2O)OC1=C=[OH+]
116 213.0869833161 OC(=C=C(O)N1CCCNC1O)C#C[OH2+] Intermediate Fragment 
117 199.0978227721 CN1C([NH3+])=NC2=C1C=CC1=C2C=CC=N1
118 407.1462295081 CN1CNC2=C3CCCN=C3C(=[NH+]C3=NC(=O)N(C4C=C(O)C(=C=O)O4)C=C3)C=C21
119 406.1622139201 CN1C2=CC(=[NH+]C3=NC(=O)N(C4C=CC(=C=O)O4)C=C3)C3=NCCCC3=C2NC1N
120 376.1516492361 CN1C2=CC(=[NH+]C3=NC(=O)N(C4C=CCO4)C=C3)C3=NC=CCC3=C2N=C1N
121 424.1727786041 C=C(OC(=C=O)CO)N1C=CC([NH+]=C2C=C3C(=C4CCCN=C24)NC(N)N3C)=NC1=O Intermediate Fragment 
122 332.1254344881 C#CN1C=CC([NH+]=C2C=C3C(=C4CC=CN=C24)N=C(N)N3C)=NC1=O
123 334.1410845521 C#CN1C=CC([NH+]=C2C=C3C(=C4CC=CN=C24)NC(N)N3C)=NC1=O
124 336.1567346161 C#CN1C=CC([NH+]=C2C=C3C(=C4CCCN=C24)NC(N)N3C)=NC1=O
125 338.1723846801 C#CN1C=CC([NH+]=C2C=C3C(=C4CCCNC24)NC(N)N3C)=NC1=O
126 340.1880347441 C#CN1C=CC([NH+]=C2C=C3C(NC(N)N3C)C3CCCNC23)=NC1=O
127 75.0440558841 OCC=C[OH2+]
128 57.0334912001 C#CC[OH2+]
129 348.1203491081 [CH+]=C(O)N1C=CC(N=C2C=C3C(=C4CC=CN=C24)N=C(N)N3C)=NC1=O
130 350.1359991721 C=C(O)N1C=CC([NH+]=C2C=C3C(=C4CC=CN=C24)N=C(N)N3C)=NC1=O
131 352.1516492361 C=C(O)N1C=CC([NH+]=C2C=C3C(=C4CC=CN=C24)NC(N)N3C)=NC1=O
132 354.1672993001 C=C(O)N1C=CC([NH+]=C2C=C3C(=C4CCCN=C24)NC(N)N3C)=NC1=O
133 356.1829493641 C=C(O)N1C=CC([NH+]=C2C=C3C(=C4CCCNC24)NC(N)N3C)=NC1=O
134 424.1727786041 C=C(O)C(=C=O)OCN1C=CC([NH+]=C2C=C3C(=C4CCCN=C24)NC(N)N3C)=NC1=O Intermediate Fragment 
135 320.1254344881 CN1C=CC([NH+]=C2C=C3C(=NC(=N)N3C)C3=C2N=CC=C3)=NC1=O
136 322.1410845521 CN1C=CC([NH+]=C2C=C3C(=NC(=N)N3C)C3CC=CN=C23)=NC1=O
137 338.1359991721 CN1C2=CC(=[NH+]C3=NC(=O)N(C=O)C=C3)C3=NC=CCC3=C2NC1N
138 424.1727786041 CN1C2=CC(=[NH+]C3=NC(=O)N(C=C=C(O)C(=O)C=O)C=C3)C3NCCCC3=C2NC1N Intermediate Fragment 
139 84.9920203121 O=CC(=O)C#[O+]
140 87.0076703761 O=CC(=[OH+])C=O
141 89.0233204401 O=CC(=[OH+])CO
142 71.0127557561 O=CC#C[OH2+]
143 61.0284058201 OCC=[OH+]
144 71.0127557561 CC(=O)C#[O+]
145 91.0389705041 OCC(=[OH+])CO
146 73.0284058201 OCC#C[OH2+]
147 73.0284058201 CC(=[OH+])C=O
148 93.0546205681 OCC([OH2+])CO
149 75.0440558841 CC(=[OH+])CO
150 326.1723846801 CN1C=CC([NH+]=C2C=C3C(NC(N)N3C)C3CC=CN=C23)=NC1=O
151 324.1567346161 CN1C=CC([NH+]=C2C=C3C(=NC(N)N3C)C3CC=CN=C23)=NC1=O
152 318.1097844241 [CH2+]N1C=CC(N=C2C=C3C(=NC(=N)N3C)C3=C2N=CC=C3)=NC1=O
153 318.1097844241 [CH+]=NC=C=C(N=C=O)N=C1C=C2C(=C3CC=CN=C13)N=C(N)N2C Intermediate Fragment 
154 275.1039707721 C#[N+]C#CC=NC1=CC2=C(N=C(N)N2C)C2=C1N=CC=C2
155 288.0992197401 C#[N+]C#CC(=N)N=C1C=C2C(=NC(=N)N2C)C2=C1N=CC=C2
156 290.1148698041 C=[NH+]C#CC(=N)N=C1C=C2C(=NC(=N)N2C)C2=C1N=CC=C2
157 318.1097844241 [CH+]=NC(O)=NC(=C=C)N=C1C=C2C(=NC(=N)N2C)C2=C1N=CC=C2 Intermediate Fragment 
158 318.1097844241 C=NC1=CC(=NC2=NC(=O)N([CH2+])C=C2)C2=NC=CCC2=C1N=C=N Intermediate Fragment 
159 318.1097844241 [CH2+]N1C=CC(N=C2C=C(N(C)C#N)C(=N)C3=C2N=CC=C3)=NC1=O Intermediate Fragment 
160 406.1622139201 CN1C2=CC(=[NH+]C3=NC(=O)N(C=C=C(O)C#CO)C=C3)C3=NCCCC3=C2NC1N
161 388.1516492361 C#CC(O)=C=CN1C=CC([NH+]=C2C=C3C(=C4CC=CN=C24)NC(N)N3C)=NC1=O
162 388.1516492361 CN1C2=CC(=[NH+]C3=NC(=O)N(CC#CC#CO)C=C3)C3=NC=CCC3=C2NC1N
163 364.1516492361 CN1C2=CC(=[NH+]C3=NC(=O)N(CC#CO)C=C3)C3=NC=CCC3=C2NC1N
164 362.1359991721 CN1C2=CC(=[NH+]C3=NC(=O)N(CC#CO)C=C3)C3=NC=CCC3=C2N=C1N
165 360.1203491081 CN1C2=CC(=NC3=NC(=O)N([CH+]C#CO)C=C3)C3=NC=CCC3=C2N=C1N
166 406.1622139201 CN1C2=CC(=[NH+]C(=C=CN=C=C=C(O)C#CO)N=C=O)C3NCCCC3=C2NC1N Intermediate Fragment 
167 368.1829493641 CN1C2=CC(=[NH+]C3=NC(=O)N(CC#CO)C=C3)C3NCCCC3=C2NC1N
168 366.1672993001 CN1C2=CC(=[NH+]C3=NC(=O)N(CC#CO)C=C3)C3=NCCCC3=C2NC1N
169 348.1567346161 C#CCN1C=CC([NH+]=C2C=C3C(=C4CC=CN=C24)NC(N)N3C)=NC1=O
170 366.1672993001 CN1C2=CC(=[NH+]C(N)=C=CN(C=O)CC#CO)C3=NC=CCC3=C2NC1N Intermediate Fragment 
171 346.1410845521 C#CCN1C=CC([NH+]=C2C=C3C(=C4CC=CN=C24)N=C(N)N3C)=NC1=O
172 364.1516492361 CN1C2=CC(=[NH+]C(=C=CN=CC#CO)N=C=O)C3=NCCCC3=C2NC1N Intermediate Fragment 
173 364.1516492361 CN1C2=CC(=[NH+]C(N)=C=CN(C=O)CC#CO)C3=NC=CCC3=C2N=C1N Intermediate Fragment 
174 362.1359991721 CN1C2=CC(=[NH+]C(=C=CN=CC#CO)N=C=O)C3=NC=CCC3=C2NC1N Intermediate Fragment 
175 59.0127557561 O=C=C[OH2+]
176 41.0021910721 [C+]#CO
177 43.0178411361 C#C[OH2+]
178 63.0440558841 OCC[OH2+]
179 45.0334912001 C=C[OH2+]
180 424.1727786041 CN1C2=CC(=[NH+]C3=NC(=O)N(C(O)=C=C(O)C#CO)C=C3)C3NCCCC3=C2NC1N Intermediate Fragment 
181 336.1203491081 CN1C2=CC(=[NH+]C3=NC(=O)N(C=O)C=C3)C3=NC=CCC3=C2N=C1N
182 334.1046990441 CN1C2=CC(=NC3=NC(=O)N(C#[O+])C=C3)C3=NC=CCC3=C2N=C1N
183 89.0597059481 C=C(O)CC[OH2+]
184 71.0491412641 C=CC(=C)[OH2+]
185 71.0491412641 C#CCC[OH2+]
186 382.1622139201 CN1C2=CC(=[NH+]C3=NC(=O)N(C(=O)C#CO)C=C3)C3NCCCC3=C2NC1N
187 364.1516492361 C#CC(=O)N1C=CC([NH+]=C2C=C3C(=C4CCCN=C24)NC(N)N3C)=NC1=O
188 380.1465638561 CN1C2=CC(=[NH+]C3=NC(=O)N(C(=O)C#CO)C=C3)C3=NCCCC3=C2NC1N
189 362.1359991721 C#CC(=O)N1C=CC([NH+]=C2C=C3C(=C4CC=CN=C24)NC(N)N3C)=NC1=O
190 380.1465638561 CN1C2=CC(=[NH+]C(=C=C=NC(=O)C#CO)N=C=O)C3NCCCC3=C2NC1N Intermediate Fragment 
191 378.1309137921 CN1C2=CC(=[NH+]C3=NC(=O)N(C(=O)C#CO)C=C3)C3=NC=CCC3=C2NC1N
192 360.1203491081 C#CC(=O)N1C=CC([NH+]=C2C=C3C(=C4CC=CN=C24)N=C(N)N3C)=NC1=O
193 424.1727786041 CN1C2=CC(=[NH+]C3=NC(=O)N(C(=C=CO)OC#CO)C=C3)C3NCCCC3=C2NC1N Intermediate Fragment 
194 396.1778639841 C=C(OC#CO)N1C=CC([NH+]=C2C=C3C(=C4CCCNC24)NC(N)N3C)=NC1=O
195 424.1727786041 C=C(N=C(O)N(C)C1C=C(O)C(=C=O)O1)[NH+]=C1C=C2C(=C3CC=CN=C13)NC(N)N2C Intermediate Fragment 
196 255.1352709001 C=C([NH3+])N=C1C=C2C(=NC(=N)N2C)C2CC=CN=C12
197 146.0811696641 C[NH2+]C1C=C(O)C(CO)O1
198 144.0655196001 C[NH2+]C1C=C(O)C(=CO)O1
199 142.0498695361 C[NH2+]C1C=C(O)C(=C=O)O1
200 283.1301855201 C=C(N=C1C=C2C(=NC(N)N2C)C2CC=CN=C12)[NH+]=C=O
201 285.1458355841 C=C(N=C1C=C2C(NC(N)N2C)C2CC=CN=C12)[NH+]=C=O
202 424.1727786041 C=CN(C(=O)N=C=[NH+]C1=CC2=C(NC(N)N2C)C2=C1NCCC2)C1C=C(O)C(=C=O)O1 Intermediate Fragment 
203 269.1145354561 CN1C2=C(NC1N)C1=C(N=CC=C1)C(N=C=[NH+]C=O)=C2
204 424.1727786041 CN1C2=C(NC1N)C1=C(NCCC1)C([NH+]=C=C=CN(C(=N)O)C1C=C(O)C(=C=O)O1)=C2 Intermediate Fragment 
205 407.1462295081 CN1C2=C(NC1N)C1=C(N=CCC1)C(N=CC#C[NH+](C=O)C1C=C(O)C(=C=O)O1)=C2
206 381.1669649521 CN1C2=C(NC1N)C1CCCNC1C(N=CC#C[NH+]=C1C=C(O)C(=C=O)O1)=C2
207 379.1513148881 CN1C2=C(NC1N)C1=C(NCCC1)C(N=CC#C[NH+]=C1C=C(O)C(=C=O)O1)=C2
208 424.1727786041 CN1C2=CC(=[NH+]C(N)=C=CN(C=O)C3C=C(O)C(=C=O)O3)C3=NCCCC3=C2NC1N Intermediate Fragment 
209 396.1778639841 CN1C2=CC(=NC(=N)C#C[NH+]=C3C=C(O)C(=C=O)O3)C3NCCCC3C2NC1N
210 396.1778639841 CN1C2=CC(=NC(N)=C=C=[NH+]C(O)=C=C(O)C#CO)C3NCCCC3=C2NC1N Intermediate Fragment 
211 424.1727786041 CN1C2=CC(=[NH+]C(=C=CN=C3C=C(O)C(=C=O)O3)N=C=O)C3NCCCC3C2NC1N Intermediate Fragment 
212 424.1727786041 C=C=C(N=C(O)N=C1C=C(O)C(=C=O)O1)[NH+]=C1C=C2C(=C3CCCNC13)NC(N)N2C Intermediate Fragment 
213 424.1727786041 CC(=[NH+]C1=NC(=O)N(C2C=C(O)C(=C=O)O2)C=C1)C1=C(C2=CN(C)C(N)N2)CCC=N1 Intermediate Fragment 
214 327.1087813801 CC(=[NH+]C1=NC(=O)N(C2C=C(O)C(=C=O)O2)C=C1)C1=CCCC=N1
215 424.1727786041 CN1C(=CC(=[NH+]C2=NC(=O)N(C3C=C(O)C(=C=O)O3)C=C2)C2=CCCC=N2)CNC1N Intermediate Fragment 
216 98.0712736761 CN1C=CN=C1[NH3+]
217 424.1727786041 C=C1C(=C2CCCN=C2C=[NH+]C2=NC(=O)N(C3C=C(O)C(=C=O)O3)C=C2)NC(N)N1C Intermediate Fragment 
218 424.1727786041 CCC1=C2NC(N)N(C)C2=CC(=[NH+]C2=NC(=O)N(C3C=C(O)C(=C=O)O3)C=C2)C1=NC Intermediate Fragment 
219 397.1618795721 CCC1=C2NC(N)N(C)C2=CC(=[NH+]C2=NC(=O)N(C3C=C(O)C(=C=O)O3)C=C2)C1
220 424.1727786041 CCCN=C1C=C2NC(N)N(C)C2=CC1=[NH+]C1=NC(=O)N(C2C=C(O)C(=C=O)O2)C=C1 Intermediate Fragment 
221 424.1727786041 CN(C1=CC(=[NH+]C2=NC(=O)N(C3C=C(O)C(=C=O)O3)C=C2)C2=NCCCC2=C1)C(N)N Intermediate Fragment 
222 407.1462295081 CN(CN)C1=CC(=[NH+]C2=NC(=O)N(C3C=C(O)C(=C=O)O3)C=C2)C2=NC=CCC2=C1
223 382.1509805401 CNC1=CC(=[NH+]C2=NC(=O)N(C3C=C(O)C(=C=O)O3)C=C2)C2NCCCC2=C1
224 353.1244314441 O=C=C1OC(N2C=CC([NH+]=C3C=CC=C4CCCNC43)=NC2=O)C=C1O
225 351.1087813801 O=C=C1OC(N2C=CC([NH+]=C3C=CC=C4CCCN=C43)=NC2=O)C=C1O
226 424.1727786041 CNC(N)NC1=C2CCCN=C2C(=[NH+]C2=NC(=O)N(C3C=C(O)C(=C=O)O3)C=C2)C=C1 Intermediate Fragment 
227 368.1353304761 NC1=C2CCCNC2C(=[NH+]C2=NC(=O)N(C3C=C(O)C(=C=O)O3)C=C2)C=C1
228 424.1727786041 CNC1=CC(=[NH+]C2=NC(=O)N(C3C=C(O)C(=C=O)O3)C=C2)C2=NCCCC2=C1NCN Intermediate Fragment 
229 380.1353304761 CNC1=CC(=[NH+]C2=NC(=O)N(C3C=C(O)C(=C=O)O3)C=C2)C2=NCCCC2=C1
230 424.1727786041 CN(CN)C1=CC(=[NH+]C2=NC(=O)N(C3C=C(O)C(=C=O)O3)C=C2)C2=NCCCC2=C1N Intermediate Fragment 
231 397.1618795721 CNC1=CC(=[NH+]C2=NC(=O)N(C3C=C(O)C(=C=O)O3)C=C2)C2NCCCC2=C1N
232 397.1618795721 CNC1=CC(=[NH+]C2=NC(=O)N(C(O)=C=C(O)C#CO)C=C2)C2NCCCC2=C1N Intermediate Fragment 
233 366.1196804121 NC1=C2CCCN=C2C(=[NH+]C2=NC(=O)N(C3C=C(O)C(=C=O)O3)C=C2)C=C1
234 364.1040303481 NC1=C2CC=CN=C2C(=[NH+]C2=NC(=O)N(C3C=C(O)C(=C=O)O3)C=C2)C=C1
235 422.1571285401 CN1C2=CC(=[NH+]C3=NC(=O)N(C4C=C(O)C(=C=O)O4)C=C3)C3=NCCCC3=C2NC1N
