#In-silico ESI-MS/MS [M+H]+ Spectra
#PREDICTED BY CFM-ID 4.0.8
#SMILES=[C@H]1(C[C@@H](O[C@@H]1CO)n1c(c(c(=O)[nH]c1=O)C)Nc1ccc2c(n1)[nH]c1c2cccc1)O
#InChiKey=LJQPCEQFRMFRAM-BFYDXBDKSA-N
energy0
308.11420 71.69 5 65 78 91 74 106 105 55 103 98 99 108 107 109 86 101 97 206 (34.992 1.0911 0.25166 0.1341 0.10184 0.071829 0.041374 0.037991 0.02547 0.011324 0.010491 0.0049273 0.0034404 0.0013417 0.0004571 0.0003196 3.3819e-05 4.6905e-06)
424.16155 100.00 0 186 245 227 161 238 157 271 244 228 263 256 247 146 284 274 269 251 257 280 278 255 275 259 (49.967 0.72123 0.20712 0.13304 0.076815 0.032441 0.03243 0.024215 0.023246 0.01966 0.013247 0.010029 0.008015 0.0079805 0.0064508 0.006224 0.005485 0.0032664 0.0020879 0.0010386 0.0010018 0.00059121 0.00051351 5.9235e-05)
energy1
87.04406 3.20 116 218 (1.3854 0.13679)
99.04406 4.64 8 132 128 (1.3573 0.59662 0.25052)
111.00767 2.94 111 (1.3968)
184.08692 4.03 10 140 (1.9109 0.0067347)
237.11347 6.72 28 (3.1962)
263.09274 12.56 62 70 67 (3.4702 2.3809 0.1229)
265.10839 5.09 63 71 66 (0.89114 0.86822 0.65876)
280.11929 5.04 64 77 (1.896 0.50085)
291.08765 3.15 72 104 95 100 208 (1.1622 0.20765 0.10512 0.018831 0.0039068)
306.09855 4.28 6 73 96 (2.0003 0.032095 0.0015493)
308.11420 100.00 5 78 55 65 74 91 103 86 109 105 107 98 108 106 99 101 206 97 (37.22 3.7707 3.3267 1.5851 0.61533 0.38476 0.12342 0.10793 0.10601 0.091873 0.077306 0.04732 0.039737 0.022145 0.020386 0.0056868 0.00129 0.0012637)
318.09855 3.36 169 170 172 (1.4201 0.11838 0.059719)
320.11420 3.12 158 159 (1.4308 0.051725)
336.10912 6.76 200 201 210 203 209 205 213 (2.9261 0.12628 0.058741 0.040385 0.036686 0.025547 0.00023867)
353.16082 2.81 232 234 235 (1.1051 0.13279 0.09912)
424.16155 3.32 0 186 161 245 146 157 228 227 244 251 263 238 269 278 256 274 280 284 271 247 257 255 275 259 (1.0285 0.37871 0.043176 0.040269 0.018337 0.016135 0.013752 0.010343 0.0076647 0.0074161 0.0040873 0.0031994 0.0014464 0.0013468 0.0011234 0.0010527 0.00099228 0.00072224 0.00042789 0.00040555 0.00032867 0.00011993 0.00011551 4.5702e-05)
energy2
45.03349 13.00 123 (1.6907)
55.01784 7.31 192 (0.95023)
57.03349 33.96 121 (4.4175)
71.04914 6.97 219 220 (0.58023 0.32663)
99.04406 6.53 8 128 132 (0.40546 0.37759 0.065903)
127.05020 7.86 25 (1.0218)
182.07127 10.28 51 (1.3368)
184.08692 11.41 10 140 (1.2748 0.2099)
209.08217 6.16 56 (0.80166)
220.08692 11.39 80 (1.4814)
222.10257 26.04 79 (3.3873)
237.11347 15.51 28 (2.0179)
248.08184 16.73 75 (2.1756)
252.11314 7.79 36 (1.0126)
263.09274 7.83 70 62 67 (0.83547 0.11496 0.067537)
263.12912 24.76 150 (3.2199)
265.10839 12.06 71 63 66 (1.295 0.17586 0.097367)
267.12404 11.25 198 (1.4637)
291.08765 10.86 72 95 104 208 100 (1.0851 0.17108 0.093105 0.037282 0.02656)
306.09855 16.29 6 96 73 (1.7792 0.31622 0.023032)
308.11420 57.36 5 91 78 55 74 86 101 65 109 103 105 99 106 108 98 107 97 206 (2.5432 2.4942 0.76117 0.41919 0.40103 0.36012 0.074596 0.073228 0.056803 0.053282 0.046483 0.040722 0.037542 0.029718 0.024409 0.023392 0.019727 0.0018905)
318.09855 17.18 169 172 170 (1.1443 0.73223 0.35829)
320.11420 23.18 159 158 (2.5209 0.49366)
322.12985 10.07 160 (1.3105)
332.11420 36.05 147 (4.6888)
334.09347 18.88 214 215 217 216 (1.4429 0.57898 0.2631 0.17057)
334.12985 100.00 149 151 148 (7.4383 3.4191 2.1497)
336.10912 33.37 200 210 205 201 203 209 213 (1.1123 1.1025 1.0755 0.49205 0.37013 0.10845 0.079822)
338.16115 11.68 153 (1.5193)
340.17680 11.68 154 (1.5193)

0 424.1615452241 Cc1c([NH2+]c2ccc3c(n2)[nH]c2ccccc23)n(C2CC(O)C(CO)O2)c(=O)[nH]c1=O
1 392.1353304761 CC1=C([NH+]=C2C=CC3=C(N=C4CC=CC=C43)N2)N(C2C=C(O)CO2)C(O)=NC1=O
2 394.1509805401 CC1=C([NH+]=C2C=CC3=C(N=C4CCCC=C43)N2)N(C2C=C(O)CO2)C(O)=NC1=O
3 406.1509805401 C=C1OC(N2C(O)=NC(=O)C(C)=C2[NH+]=C2C=CC3=C(N=C4CCCC=C43)N2)C=C1O
4 310.1298511721 C=C1C(=O)N=C(O)N=C1[NH+]=C1C=CC2=C(N=C3CCCCC32)N1
5 308.1142011081 C=C1C(=O)N=C(O)N=C1[NH+]=C1C=CC2=C(N=C3CCCC=C32)N1
6 306.0985510441 C=C1C(=O)N=C(O)N=C1[NH+]=C1C=CC2=C(N=C3CC=CC=C32)N1
7 304.0829009801 [CH+]=C1C(=O)N=C(O)N=C1N=C1C=CC2=C(N=C3CC=CC=C32)N1
8 99.0440558841 C=C1OC=CC1[OH2+]
9 101.0597059481 CC1OC=CC1[OH2+]
10 184.0869237401 [NH2+]=C1C=CC2C(=N1)N=C1C=CC=CC12
11 225.0869833161 C=C1OC(N2C=C(C)C(=[OH+])NC2O)=CC1O
12 388.1404158561 C=C1C=CC(N2C(O)=NC(=O)C(C)=C2[NH+]=C2C=CC3=C(N=C4CC=CC=C43)N2)O1
13 406.1509805401 CC(=O)C(O)=C=CN1C(O)=NC(=O)C(C)=C1[NH+]=C1C=CC2=C(N=C3CCCC=C32)N1 Intermediate Fragment 
14 406.1509805401 C#CC(O)=C=C(O)N1C(O)=NC(=O)C(C)=C1[NH+]=C1C=CC2=C(N=C3CCCCC32)N1 Intermediate Fragment 
15 406.1509805401 C#COC(=C=CO)N1C(O)=NC(=O)C(C)=C1[NH+]=C1C=CC2=C(N=C3CCCCC32)N1 Intermediate Fragment 
16 364.1404158561 CC1=C([NH+]=C2C=CC3=C(N=C4CCCC=C43)N2)N(CC#CO)C(O)=NC1=O
17 380.1353304761 CC1=C([NH+]=C2C=CC3=C(N=C4CCCCC43)N2)N(C(=O)C#CO)C(O)=NC1=O
18 406.1509805401 C=C=C([NH+]=C1C=CC2=C(N=C3CCCCC32)N1)N(C(=O)N=C=O)C1C=C(O)C(=C)O1 Intermediate Fragment 
19 406.1509805401 C=C1OC(N(C(=N)O)C([NH+]=C2C=CC3=C(N=C4CC=CC=C43)N2)=C(C)C=O)C=C1O Intermediate Fragment 
20 406.1509805401 C=C1OC(=NC([NH+]=C2C=CC3=C(N=C4CCCCC43)N2)=C(C)C(=O)N=C=O)C=C1O Intermediate Fragment 
21 406.1509805401 C=C1OC(=NC(O)=NC(=O)C(C)=C=[NH+]C2=CC=C3C(=N2)N=C2CCCCC32)C=C1O Intermediate Fragment 
22 314.1611513001 CC1=C(O)N=C(O)N=C1[NH+]=C1C=CC2=C(N1)NC1CCCCC21
23 296.1505866161 CC1=C(O)N=CN=C1[NH+]=C1C=CC2=C(N=C3CCCCC32)N1
24 125.0345538201 C=C1C=NC(O)=NC1=[OH+]
25 127.0502038841 CC1C=NC(O)=NC1=[OH+]
26 142.0611029161 CC1C(=O)N=C(O)N=C1[NH3+]
27 314.1611513001 CC(C(=N)[NH+]=C1C=CC2=C(N1)NC1CCCCC21)=C(O)N=C=O Intermediate Fragment 
28 237.1134728361 C#CC(=[NH2+])N=C1C=CC2=C(N=C3CCCC=C32)N1
29 314.1611513001 CC(=C=O)C(=NC(=N)O)[NH+]=C1C=CC2=C(N1)NC1CCCCC21 Intermediate Fragment 
30 297.1346022041 CC(=C=O)C(N=C1C=CC2=C(N=C3CCCCC32)N1)=[NH+]C=O
31 314.1611513001 C#CC(=NC(=O)N=C=O)[NH+]=C1CCC2C(N1)NC1CCCCC12 Intermediate Fragment 
32 314.1611513001 C=C=C(O)N=C(O)N=C=[NH+]C1=CC=C2C(N1)NC1CCCCC21 Intermediate Fragment 
33 314.1611513001 CC(=C=[NH+]C1=CC=C2C(=N1)NC1CCCCC21)C(=O)N=C(N)O Intermediate Fragment 
34 224.1182238681 CC#C[NH+]=C1C=CC2=C(N=C3CCCC=C32)N1
35 228.1495239961 CC#C[NH+]=C1C=CC2=C(N1)NC1CCCCC21
36 252.1131384881 CC(=C=[NH+]C1=CC=C2C3=CCCCC3=NC2=N1)C=O
37 297.1346022041 CC(=C=NC1=CC=C2C(=N1)NC1CCCCC21)C(=O)[NH+]=C=O
38 314.1611513001 CC1=C(O)N=C(O)N=C1[NH+]=C1C=CC(C2CCCCC2=N)=CN1 Intermediate Fragment 
39 297.1346022041 CC1=C(O)N=C(O)N=C1[NH+]=C1C=CC(C2=CCCC=C2)=CN1
40 314.1611513001 CCCCC1C=NC2=C1C=CC(=[NH+]C1=NC(O)=NC(O)=C1C)N2 Intermediate Fragment 
41 312.1455012361 CC1=C(O)N=C(O)N=C1[NH+]=C1C=CC2=C(N=C3CCCCC32)N1
42 312.1455012361 CC(C(=N)[NH+]=C1C=CC2=C(N=C3CCCCC32)N1)=C(O)N=C=O Intermediate Fragment 
43 312.1455012361 C#CC(=NC(=O)N=C=O)[NH+]=C1C=CC2C(N1)NC1CCCCC12 Intermediate Fragment 
44 312.1455012361 CC(=C=[NH+]C1=CC=C2C(=N1)N=C1CCCCC21)C(=O)N=C(N)O Intermediate Fragment 
45 292.1192864881 CC1=C(O)N=CN=C1[NH+]=C1C=CC2=C(N=C3CC=CC=C32)N1
46 310.1298511721 CC(C(=N)[NH+]=C1C=CC2=C(N=C3CCCC=C32)N1)=C(O)N=C=O Intermediate Fragment 
47 310.1298511721 CC(=C=[NH+]C1=CC=C2C3=CCCCC3=NC2=N1)C(=O)N=C(N)O Intermediate Fragment 
48 290.1036364241 [CH2+]C1=CN=C(O)N=C1N=C1C=CC2=C(N=C3CC=CC=C32)N1
49 290.1036364241 [CH2+]C1=C(O)N=CN=C1N=C1C=CC2=C(N=C3CC=CC=C32)N1
50 292.0829009801 OC1=CC([NH+]=C2C=CC3=C4C=CC=CC4=NC3=N2)=NC(O)=N1
51 182.0712736761 [NH2+]=C1C=CC2=C3C=CC=CC3=NC2=N1
52 123.0189037561 [CH+]=C1C=NC(O)=NC1=O
53 169.0760247081 C1=C[NH2+]C2=NC3=C(C=CC=C3)C2=C1
54 140.0454528521 C=C1C(=O)N=C(O)N=C1[NH3+]
55 308.1142011081 CC(C(=N)[NH+]=C1C=CC2=C(N=C3CC=CC=C32)N1)=C(O)N=C=O Intermediate Fragment 
56 209.0821727081 [NH+]#CN=C1C=CC2C(=N1)N=C1C=CC=CC12
57 211.0978227721 [NH+]#CN=C1C=CC2C(=N1)N=C1CCC=CC12
58 213.1134728361 [NH+]#CN=C1C=CC2C(=N1)N=C1CCCCC12
59 233.0821727081 C#CC(=[NH2+])N=C1C=CC2=C3C=CC=CC3=NC2=N1
60 235.0978227721 C#CC(=[NH2+])N=C1C=CC2C(=N1)N=C1C=CC=CC12
61 261.0770873281 [CH2+]C(=C=O)C(=N)N=C1C=CC2=C3C=CC=CC3=NC2=N1
62 263.0927373921 CC(=C=O)C(=[NH2+])N=C1C=CC2=C3C=CC=CC3=NC2=N1
63 265.1083874561 CC(=C=O)C(=[NH2+])N=C1C=CC2C(=N1)N=C1C=CC=CC12
64 280.1192864881 C=C(C(=[NH2+])N=C1C=CC2C(=N1)N=C1C=CC=CC12)C(N)=O
65 308.1142011081 CC(C(N=C1C=CC2=C(N=C3CC=CC=C32)N1)=NC#[O+])=C(N)O Intermediate Fragment 
66 265.1083874561 CC(=C=NC1=CC=C2C(=NC3=C2C=CC=C3)N1)C([NH3+])=O
67 263.0927373921 [CH2+]C(=C=NC1=CC=C2C(=NC3=C2C=CC=C3)N1)C(N)=O
68 74.0600402961 CCC([NH3+])=O
69 237.0770873281 O=C[NH+]=C=NC1=CC=C2C(=NC3=C2C=CC=C3)N1
70 263.0927373921 C#CC(N=C1C=CC2=C(N=C3CC=CC=C32)N1)=[NH+]C=O
71 265.1083874561 C#CC(N=C1C=CC2=C(N=C3CCCC=C32)N1)=[NH+]C=O
72 291.0876520121 CC(=C=O)C(N=C1C=CC2=C(N=C3CC=CC=C32)N1)=NC#[O+]
73 306.0985510441 C=C(C(N)=O)C(N=C1C=CC2=C(N=C3CC=CC=C32)N1)=NC#[O+]
74 308.1142011081 CC(=C=O)C(=NC(=N)O)[NH+]=C1C=CC2=C(N=C3CC=CC=C32)N1 Intermediate Fragment 
75 248.0818383601 CC(=C=NC1=CC=C2C(=NC3=C2C=CC=C3)N1)C#[O+]
76 250.0723362961 N=C(O)N=C=[N+]=C1C=CC2=C3C=CC=CC3=NC2=N1
77 280.1192864881 C#CC(N=C1C=CC2=C(N=C3CCCC=C32)N1)=[NH+]C(=N)O
78 308.1142011081 C#CC(=NC(=O)N=C=O)[NH+]=C1C=CC2=C(N=C3CCCCC32)N1 Intermediate Fragment 
79 222.1025738041 C=C=C=[NH+]C1=CC=C2C3=CC=CCC3NC2=N1
80 220.0869237401 C=C=C=[NH+]C1=CC=C2C(=N1)NC1=C2C=CC=C1
81 218.0712736761 [CH+]=C=C=NC1=CC=C2C(=N1)NC1=C2C=CC=C1
82 278.1036364241 C#CC(N=C1C=CC2=C(N=C3CC=CC=C32)N1)=[NH+]C(=N)O
83 261.0770873281 C#CC(=NC#[O+])N=C1C=CC2=C(N=C3CC=CC=C32)N1
84 72.0080047241 O=C=[NH+]C=O
85 74.0236547881 O=C=[NH+]CO
86 308.1142011081 C=C=C(O)N=C(O)N=C=[NH+]C1=CC=C2C3=CCCCC3=NC2=N1 Intermediate Fragment 
87 194.0712736761 C#[N+]C1=CC=C2C(=NC3=C2C=CC=C3)N1
88 280.0829009801 O=C=NC(=O)[NH+]=C=NC1=CC=C2C3=CCCCC3=NC2=N1
89 252.0879863601 N=C(O)[NH+]=C=NC1C=CC2=C3C=CC=CC3=NC2=N1
90 235.0614372641 [O+]#CN=C=NC1=CC=C2C(=NC3=C2C=CC=C3)N1
91 308.1142011081 CC(=C=[NH+]C1=CC=C2C3=CC=CCC3=NC2=N1)C(=O)N=C(N)O Intermediate Fragment 
92 115.0502038841 C=CC(=O)N=C([NH3+])O
93 113.0345538201 C#CC(=O)N=C([NH3+])O
94 196.0869237401 C=[NH+]C1=CC=C2C(=NC3=C2C=CC=C3)N1
95 291.0876520121 CC(=C=NC1=CC=C2C3=CC=CCC3=NC2=N1)C(=O)[NH+]=C=O
96 306.0985510441 [CH2+]C(=C=NC1=CC=C2C3=CC=CCC3=NC2=N1)C(=O)N=C(N)O
97 308.1142011081 C=C1C2=CC=CCC2=NC1=NC(C)=NC1=NC(O)=NC(O)=C1[CH2+] Intermediate Fragment 
98 308.1142011081 CC1=C(O)N=C(O)N=C1[NH+]=C(N)C=C=C1C=NC2=C1C=CC=C2 Intermediate Fragment 
99 308.1142011081 CC1=C(O)N=C(O)N=C1[NH+]=C=C=C=C1C(=N)N=C2CCCC=C12 Intermediate Fragment 
100 291.0876520121 CC1=C(O)N=C(O)N=C1[NH+]=C=C=C=C1C=NC2=C1C=CC=C2
101 308.1142011081 C=C=C1C2=CC=CCC2=NC1=NC=[NH+]C1=NC(O)=NC(O)=C1C Intermediate Fragment 
102 157.0760247081 C#CC1C(=[NH2+])N=C2C=CC=CC21
103 308.1142011081 [CH2+]C1=C(O)N=C(O)N=C1N=C1C=CC(C2=CC=CCC2=N)=CN1 Intermediate Fragment 
104 291.0876520121 [CH+]=C1C(=O)N=C(O)N=C1N=C1C=CC(C2=CC=CC=C2)=CN1
105 308.1142011081 [CH2+]C1=C(O)N=C(O)N=C1N=C1C=CC=C(N=C2C=CC=CC2)N1 Intermediate Fragment 
106 308.1142011081 [CH2+]C1=C(O)N=C(O)N=C1N=C1C=CC(C2=CC=CC=C2)=C(N)N1 Intermediate Fragment 
107 308.1142011081 C=C=CC1=NC2=C(C=CC(=[NH+]C3=NC(O)=NC(O)=C3C)N2)C1=C Intermediate Fragment 
108 308.1142011081 C=C=C1C(C=C)=NC2=C1C=CC(=[NH+]C1=NC(O)=NC(O)=C1C)N2 Intermediate Fragment 
109 308.1142011081 CC=C=C=C1C=NC2=C1C=CC(=[NH+]C1=NC(O)=NC(O)=C1C)N2 Intermediate Fragment 
110 266.0672509161 [CH+]=C1C(=O)N=C(O)N=C1N=C1C=CC2=C(N=CC2=C)N1
111 111.0076703761 O=C1C=COC1=C=[OH+]
112 113.0233204401 OC1C=COC1=C=[OH+]
113 85.0284058201 [OH+]=C1C=COC1
114 113.0233204401 C=C=C(O)C(=O)C=[OH+] Intermediate Fragment 
115 115.0389705041 OC1C=COC1=C[OH2+]
116 87.0440558841 [OH2+]C1C=COC1
117 97.0284058201 [CH+]=C1OCC=C1O
118 97.0284058201 [OH+]=C=C1C=CCO1
119 115.0389705041 C=C=C(O)C(=O)C[OH2+] Intermediate Fragment 
120 97.0284058201 C=C=C(O)C#C[OH2+]
121 57.0334912001 C=C=C[OH2+]
122 115.0389705041 O=C=C=C(O)CC[OH2+] Intermediate Fragment 
123 45.0334912001 C=C[OH2+]
124 43.0178411361 C#C[OH2+]
125 115.0389705041 OC=C=COC=C[OH2+] Intermediate Fragment 
126 117.0546205681 OC1C=COC1C[OH2+]
127 89.0597059481 [OH2+]C1CCOC1
128 99.0440558841 [OH2+]C=C1C=CCO1
129 117.0546205681 C=COC(=C[OH2+])CO Intermediate Fragment 
130 91.0389705041 OCC(=[OH+])CO
131 117.0546205681 C=C=C(O)C(O)C[OH2+] Intermediate Fragment 
132 99.0440558841 C=C=C(O)C=C[OH2+]
133 59.0491412641 CC=C[OH2+]
134 61.0284058201 OCC=[OH+]
135 117.0546205681 OC=C=C(O)CC[OH2+] Intermediate Fragment 
136 89.0597059481 C=C(O)CC[OH2+]
137 117.0546205681 OC=C=COCC[OH2+] Intermediate Fragment 
138 406.1509805401 CC1=C([NH+]=C2C=CC3=C(N=C4CCCCC43)N2)N(C2C=C(O)C(=C=O)O2)C(=O)N=C1
139 406.1509805401 CC1=C([NH+]=C2C=CC3=C(N=C4CCCCC43)N2)N(C2C=C(O)C(=C=O)O2)C=NC1=O
140 184.0869237401 N=C1C=CC=CC1=C1C=CC(=[NH2+])N=C1 Intermediate Fragment 
141 239.0662478721 CC1=CN(C2C=C(O)C(=C=[OH+])O2)C(O)NC1=O
142 241.0818979361 CC1=CN(C2C=C(O)C(=C=[OH+])O2)C(O)NC1O
143 241.0818979361 CC1=CN(C=C=C(O)C(=O)C=[OH+])C(O)NC1O Intermediate Fragment 
144 243.0975480001 CC1CN(C2C=C(O)C(=C=[OH+])O2)C(O)NC1O
145 406.1509805401 CC1=C([NH+]=C2C=CC3=C(N=C4CCCCC43)N2)N(C2C=CC(=C=O)O2)C(O)=NC1=O
146 424.1615452241 C=C(OC(=C=O)CO)N1C(O)=NC(=O)C(C)=C1[NH+]=C1C=CC2=C(N=C3CCCCC32)N1 Intermediate Fragment 
147 332.1142011081 C#CN1C(O)=NC(=O)C(C)=C1[NH+]=C1C=CC2=C(N=C3CC=CC=C32)N1
148 334.1298511721 C#CN1C(O)=NC(=O)C(C)=C1[NH+]=C1C=CC2=C(N=C3CCCC=C32)N1
149 334.1298511721 C#CN(C(=O)N=C=O)C(=C=C)[NH+]=C1C=CC2=C(N=C3CCCCC32)N1 Intermediate Fragment 
150 263.1291229001 C#C[NH+]=C(C#C)N=C1C=CC2=C(N=C3CCCCC32)N1
151 334.1298511721 C#CNC(O)=NC(=O)C(C)=C=[NH+]C1=CC=C2C3=CCCCC3=NC2=N1 Intermediate Fragment 
152 336.1455012361 C#CN1C(O)=NC(=O)C(C)=C1[NH+]=C1C=CC2=C(N=C3CCCCC32)N1
153 338.1611513001 C#CN1C(O)=NC(=O)C(C)=C1[NH+]=C1C=CC2=C(N1)NC1CCCCC21
154 340.1768013641 C#CN1C(O)=NC(=O)C(C)=C1[NH+]=C1C=CC2C(N1)NC1CCCCC12
155 350.1247657921 C=C(O)N1C(O)=NC(=O)C(C)=C1[NH+]=C1C=CC2=C(N=C3CC=CC=C32)N1
156 352.1404158561 C=C(O)N1C(O)=NC(=O)C(C)=C1[NH+]=C1C=CC2=C(N=C3CCCC=C32)N1
157 424.1615452241 C=C(O)C(=C=O)OCN1C(O)=NC(=O)C(C)=C1[NH+]=C1C=CC2=C(N=C3CCCCC32)N1 Intermediate Fragment 
158 320.1142011081 C=C1C(=O)N=C(O)N(C)C1=[NH+]C1=CC=C2C3=CC=CCC3=NC2=N1
159 320.1142011081 C=C=C([NH+]=C1C=CC2=C(N=C3CC=CC=C32)N1)N(C)C(=O)N=C=O Intermediate Fragment 
160 322.1298511721 C=C1C(=O)N=C(O)N(C)C1=[NH+]C1C=CC2=C(N=C3CC=CC=C32)N1
161 424.1615452241 CC1=C([NH+]=C2C=CC3=C(N2)NC2CCCCC32)N(C=C=C(O)C(=O)C=O)C(O)=NC1=O Intermediate Fragment 
162 87.0076703761 O=CC(=[OH+])C=O
163 89.0233204401 O=CC(=[OH+])CO
164 73.0284058201 OCC#C[OH2+]
165 93.0546205681 OCC([OH2+])CO
166 75.0440558841 OCC=C[OH2+]
167 326.1611513001 C=C1C(=O)N=C(O)N(C)C1=[NH+]C1C=CC2=C(N=C3CCCCC32)N1
168 324.1455012361 C=C1C(=O)N=C(O)N(C)C1=[NH+]C1C=CC2=C(N=C3CCCC=C32)N1
169 318.0985510441 C=C1C(=O)N=C(O)N([CH2+])C1=NC1=CC=C2C3=CC=CCC3=NC2=N1
170 318.0985510441 [CH+]=NC(N=C1C=CC2=C(N=C3CC=CC=C32)N1)=C(C)C(=O)N=C=O Intermediate Fragment 
171 275.0927373921 C#[N+]C(=NC1=CC=C2C(=N1)NC1=C2C=CC=C1)C(C)=C=O
172 318.0985510441 C=C=C(N=C1C=CC2=C(N=C3CC=CC=C32)N1)N([CH2+])C(=O)N=C=O Intermediate Fragment 
173 275.0927373921 C#CC(=NC1=CC=C2C(=N1)NC1=C2C=CC=C1)[N+](=C)C=O
174 247.0978227721 C#CC(=NC1=CC=C2C3=CC=CCC3=NC2=N1)[NH+]=C
175 406.1509805401 CC1=C([NH+]=C2C=CC3=C(N=C4CCCCC43)N2)N(C=C=C(O)C#CO)C(O)=NC1=O
176 388.1404158561 C#CC(O)=C=CN1C(O)=NC(=O)C(C)=C1[NH+]=C1C=CC2=C(N=C3CCCC=C32)N1
177 388.1404158561 CC1=C([NH+]=C2C=CC3=C(N=C4CCCC=C43)N2)N(CC#CC#CO)C(O)=NC1=O
178 362.1247657921 CC1=C([NH+]=C2C=CC3=C(N=C4CC=CC=C43)N2)N(CC#CO)C(O)=NC1=O
179 368.1717159841 CC1=C([NH+]=C2C=CC3=C(N2)NC2CCCCC32)N(CC#CO)C(O)=NC1=O
180 366.1560659201 CC1=C([NH+]=C2C=CC3=C(N=C4CCCCC43)N2)N(CC#CO)C(O)=NC1=O
181 348.1455012361 C#CCN1C(O)=NC(=O)C(C)=C1[NH+]=C1C=CC2=C(N=C3CCCC=C32)N1
182 346.1298511721 C#CCN1C(O)=NC(=O)C(C)=C1[NH+]=C1C=CC2=C(N=C3CC=CC=C32)N1
183 364.1404158561 C=C=C([NH+]=C1C=CC2=C(N=C3CCCCC32)N1)N(CC#CO)C(=O)N=C=O Intermediate Fragment 
184 293.1396875841 C=C=C(N=C1C=CC2=C(N=C3CCCCC32)N1)[NH+]=CC#CO
185 364.1404158561 CC(=C=[NH+]C1=CC=C2C(=N1)N=C1CCCCC21)C(=O)N=C(O)N=CC#CO Intermediate Fragment 
186 424.1615452241 CC1=C([NH+]=C2C=CC3=C(N2)NC2CCCCC32)N(C(O)=C=C(O)C#CO)C(O)=NC1=O Intermediate Fragment 
187 356.1717159841 C=C(O)N1C(O)=NC(=O)C(C)=C1[NH+]=C1C=CC2=C(N1)NC1CCCCC21
188 354.1560659201 C=C(O)N1C(O)=NC(=O)C(C)=C1[NH+]=C1C=CC2=C(N=C3CCCCC32)N1
189 348.1091157281 [CH+]=C(O)N1C(O)=NC(=O)C(C)=C1N=C1C=CC2=C(N=C3CC=CC=C32)N1
190 68.9971056921 [O+]#CC#CO
191 71.0127557561 O=CC#C[OH2+]
192 55.0178411361 C#CC=[OH+]
193 340.1404158561 CC1=C([NH+]=C2C=CC3=C(N=C4CCCCC43)N2)N(C=O)C(O)=NC1=O
194 338.1247657921 CC1=C([NH+]=C2C=CC3=C(N=C4CCCC=C43)N2)N(C=O)C(O)=NC1=O
195 338.1247657921 CC(C(=O)N=C=O)=C(N=C=O)[NH+]=C1C=CC2=C(N=C3CCCCC32)N1 Intermediate Fragment 
196 338.1247657921 CC(C=O)=C([NH+]=C1C=CC2=C(N=C3CC=CC=C32)N1)N(C=O)C(=N)O Intermediate Fragment 
197 338.1247657921 C=C=C([NH+]=C1C=CC2=C(N=C3CCCCC32)N1)N(C=O)C(=O)N=C=O Intermediate Fragment 
198 267.1240375201 C=C=C(N=C1C=CC2=C(N=C3CCCCC32)N1)[NH+]=C=O
199 338.1247657921 CC(=C=[NH+]C1=CC=C2C(=N1)N=C1CCCCC21)C(=O)N=C(O)N=C=O Intermediate Fragment 
200 336.1091157281 CC1=C([NH+]=C2C=CC3=C(N=C4CC=CC=C43)N2)N(C=O)C(O)=NC1=O
201 336.1091157281 CC(C(=O)N=C=O)=C(N=C=O)[NH+]=C1C=CC2=C(N=C3CCCC=C32)N1 Intermediate Fragment 
202 293.1033020761 CC(=C=O)C(=NC1C=CC2=C(N=C3CC=CC=C32)N1)[NH+]=C=O
203 336.1091157281 CC(C=O)=C(N=C1C=CC2=C(N=C3CC=CC=C32)N1)N(C#[O+])C(=N)O Intermediate Fragment 
204 250.0974884241 CC(=C=[NH+]C1=CC=C2C(=NC3=C2C=CC=C3)N1)C=O
205 336.1091157281 C=C=C([NH+]=C1C=CC2=C(N=C3CCCC=C32)N1)N(C=O)C(=O)N=C=O Intermediate Fragment 
206 308.1142011081 C#CC(=NC1C=CC2=C(N=C3CC=CC=C32)N1)[NH+](C=O)C(=N)O
207 293.1033020761 C#CC(=NC1C=CC2=C(N=C3CC=CC=C32)N1)[NH+](C=O)C=O
208 291.0876520121 C#CC(=NC1=CC=C2C3=CC=CCC3=NC2=N1)[NH+](C=O)C=O
209 336.1091157281 C=C=C(O)N=C(O)N(C=O)C=[NH+]C1=CC=C2C3=CC=CCC3=NC2=N1 Intermediate Fragment 
210 336.1091157281 CC(=C=[NH+]C1=CC=C2C3=CCCCC3=NC2=N1)C(=O)N=C(O)N=C=O Intermediate Fragment 
211 289.0720019481 [CH2+]C(=C=NC1=CC=C2C3=CC=CCC3=NC2=N1)C(=O)N=C=O
212 293.1033020761 CC(=C=NC1=CC=C2C3=CCCCC3=NC2=N1)C(=O)[NH+]=C=O
213 336.1091157281 C=C=C1C2=CC=CCC2=NC1=NC=[NH+]C1=C(C)C(=O)N=C(O)N1C=O Intermediate Fragment 
214 334.0934656641 CC1=C(N=C2C=CC3=C(N=C4CC=CC=C43)N2)N(C#[O+])C(O)=NC1=O
215 334.0934656641 CC(C(=O)N=C=O)=C(N=C=O)[NH+]=C1C=CC2=C(N=C3CC=CC=C32)N1 Intermediate Fragment 
216 334.0934656641 CC(=C=O)C(=NC1=CC=C2C3=CC=CCC3=NC2=N1)N(C#[O+])C(=N)O Intermediate Fragment 
217 334.0934656641 C=C=C([NH+]=C1C=CC2=C(N=C3CC=CC=C32)N1)N(C=O)C(=O)N=C=O Intermediate Fragment 
218 87.0440558841 C=C(O)C=C[OH2+]
219 71.0491412641 C=CC(=C)[OH2+]
220 71.0491412641 C#CCC[OH2+]
221 91.0753560121 CC(O)CC[OH2+]
222 73.0647913281 C=C([OH2+])CC
223 382.1509805401 CC1=C([NH+]=C2C=CC3=C(N2)NC2CCCCC32)N(C(=O)C#CO)C(O)=NC1=O
224 364.1404158561 C#CC(=O)N1C(O)=NC(=O)C(C)=C1[NH+]=C1C=CC2=C(N=C3CCCCC32)N1
225 378.1196804121 CC1=C([NH+]=C2C=CC3=C(N=C4CCCC=C43)N2)N(C(=O)C#CO)C(O)=NC1=O
226 47.0491412641 CC[OH2+]
227 424.1615452241 CC1=C([NH+]=C2C=CC3=C(N2)NC2CCCCC32)N(C(=C=CO)OC#CO)C(O)=NC1=O Intermediate Fragment 
228 424.1615452241 C=C=C([NH+]=C1C=CC2C(N1)NC1CCCCC12)N(C(=O)N=C=O)C1C=C(O)C(=C=O)O1 Intermediate Fragment 
229 396.1666306041 C=C=C(N=C1C=CC2=C(N1)NC1CCCCC21)[NH+](C(=N)O)C1C=C(O)C(=C=O)O1
230 381.1557315721 C=C=C(N=C1C=CC2=C(N1)NC1CCCCC21)[NH+](C=O)C1C=C(O)C(=C=O)O1
231 379.1400815081 C=C=C(N=C1C=CC2=C(N=C3CCCCC32)N1)[NH+](C=O)C1C=C(O)C(=C=O)O1
232 353.1608169521 C=C=C(N=C1C=CC2C(N1)NC1CCCCC12)[NH+]=C1C=C(O)C(=C=O)O1
233 335.1502522681 C=C=C(N=C1C=CC2=C(N=C3CCCCC32)N1)[NH+]=C1C=C(O)C(=C)O1
234 353.1608169521 C=C=C(N=C1C=CC2C(N1)NC1CCCCC12)[NH+]=C=C=C(O)C(=O)C=O Intermediate Fragment 
235 353.1608169521 C#CC(N=C1C=CC2C(N1)NC1CCCCC12)=[NH+]C(O)=C=C(O)C#CO Intermediate Fragment 
236 309.1346022041 C#CC(N=C1C=CC2=C(N1)NC1CCCCC21)=[NH+]C(=O)C#CO
237 351.1451668881 C=C=C(N=C1C=CC2=C(N1)NC1CCCCC21)[NH+]=C1C=C(O)C(=C=O)O1
238 424.1615452241 CC(C=O)=C([NH+]=C1C=CC2=C(N=C3CCCCC32)N1)N(C(=N)O)C1C=C(O)C(=C=O)O1 Intermediate Fragment 
239 394.1509805401 C=C=C(N=C1C=CC2=C(N=C3CCCCC32)N1)[NH+](C(=N)O)C1C=C(O)C(=C=O)O1
240 407.1349961281 CC(C=O)=C(N=C1C=CC2=C(N=C3CCCC=C32)N1)[NH+](C=O)C1C=C(O)C(=C=O)O1
241 381.1557315721 CC(C=O)=C(N=C1C=CC2=C(N1)NC1CCCCC21)[NH+]=C1C=C(O)C(=C=O)O1
242 381.1557315721 CC(=C=O)C(N=C1C=CC2=C(N1)NC1CCCCC21)=[NH+]C(O)=C=C(O)C#CO Intermediate Fragment 
243 379.1400815081 CC(C=O)=C(N=C1C=CC2=C(N=C3CCCCC32)N1)[NH+]=C1C=C(O)C(=C=O)O1
244 424.1615452241 CC(C(N)=O)=C([NH+]=C1C=CC2=C(N=C3CCCCC32)N1)N(C=O)C1C=C(O)C(=C=O)O1 Intermediate Fragment 
245 424.1615452241 CC(C(=O)N=C=O)=C(N=C1C=C(O)C(=C=O)O1)[NH+]=C1C=CC2C(N1)NC1CCCCC12 Intermediate Fragment 
246 396.1666306041 CC(C(N)=O)=C(N=C1C=CC2=C(N1)NC1CCCCC21)[NH+]=C1C=C(O)C(=C=O)O1
247 424.1615452241 CC(=C=[NH+]C1=CC=C2C(N1)NC1CCCCC21)C(=O)N=C(O)N=C1C=C(O)C(=C=O)O1 Intermediate Fragment 
248 160.0604342201 OC=C1OC([NH2+]CO)C=C1O
249 130.0498695361 [NH3+]C1C=C(O)C(=CO)O1
250 295.1189521401 CC(=C=NC1=CC=C2C(=N1)N=C1CCCCC21)C(=O)[NH+]=C=O
251 424.1615452241 C=C=C(O)N=C(O)N(C=[NH+]C1=CC=C2C(=N1)NC1CCCCC21)C1C=C(O)C(=C=O)O1 Intermediate Fragment 
252 353.1244314441 O=C=C1OC([NH+](C=O)C=NC2=CC=C3C(=N2)N=C2CCCCC32)C=C1O
253 327.1451668881 O=C=C1OC(=[NH+]C=NC2=CC=C3C(N2)NC2CCCCC32)C=C1O
254 327.1451668881 OC#CC(O)=C=C(O)[NH+]=C=NC1=CC=C2C(N1)NC1CCCCC21 Intermediate Fragment 
255 424.1615452241 C=CC(NC1=CC2CCCCC2=N1)=[NH+]C1=C(C)C(=O)N=C(O)N1C1C=C(O)C(=C=O)O1 Intermediate Fragment 
256 424.1615452241 CC1=C([NH+]=C(N)C=C=C2C=NC3CCCCC23)N(C2C=C(O)C(=C=O)O2)C(O)=NC1=O Intermediate Fragment 
257 424.1615452241 CC1=C([NH+]=C=C=C=C2C(N)NC3CCCCC23)N(C2C=C(O)C(=C=O)O2)C(O)=NC1=O Intermediate Fragment 
258 407.1349961281 CC1=C([NH+]=C=C=C=C2C=NC3CCCCC23)N(C2C=C(O)C(=C=O)O2)C(O)=NC1=O
259 424.1615452241 C=C=C1C(=NC=[NH+]C2=C(C)C(=O)N=C(O)N2C2C=C(O)C(=C=O)O2)NC2CCCCC12 Intermediate Fragment 
260 398.1458951601 CC1=C([NH+]=CNC2=CC3CCCCC3=N2)N(C2C=C(O)C(=C=O)O2)C(O)=NC1=O
261 282.0985510441 CC1=C(O)N=C(O)N=C1[NH+]=C=NC1=CC2=CC=CCC2=N1
262 283.1036960001 CC1=C([NH2+]CN)N(C2C=C(O)C(=C=O)O2)C(O)NC1=O
263 424.1615452241 CC1=C([NH+]=C2C=CC(C3CCCCC3=N)=CN2)N(C2C=C(O)C(=C=O)O2)C(O)=NC1=O Intermediate Fragment 
264 407.1349961281 CC1=C([NH+]=C2C=CC(C3=CCCC=C3)=CN2)N(C2C=C(O)C(=C=O)O2)C(O)=NC1=O
265 293.1033020761 C=C1C(=O)N=C(O)N=C1[NH+]=C1C=CC(C2=CC=CC=C2)=CN1
266 407.1349961281 CC1=C([NH+]=C2C=CC(C3=CCCC=C3)=CN2)N(C=C=C(O)C(=O)C=O)C(O)=NC1=O Intermediate Fragment 
267 407.1349961281 CC1=C([NH+]=C2C=CC(C3=CCCC=C3)=CN2)N(C(O)=C=C(O)C#CO)C(O)=NC1=O Intermediate Fragment 
268 329.0880459361 CC1=C([NH+]=C2C=CC=CN2)N(C2C=C(O)C(=C=O)O2)C(O)=NC1=O
269 424.1615452241 CC1=C([NH+]=C2C=CC=C(N=C3CCCCC3)N2)N(C2C=C(O)C(=C=O)O2)C(O)=NC1=O Intermediate Fragment 
270 331.1036960001 CC1=C([NH+]=C2C=CCCN2)N(C2C=C(O)C(=C=O)O2)C(O)=NC1=O
271 424.1615452241 CC1=C([NH+]=C2C=CC(C3=CCCCC3)=C(N)N2)N(C2C=C(O)C(=C=O)O2)C(O)=NC1=O Intermediate Fragment 
272 346.1145950321 CC1=C([NH+]=C2C=CCC(N)N2)N(C2C=C(O)C(=C=O)O2)C(O)=NC1=O
273 344.0989449681 CC1=C([NH+]=C2C=CC=C(N)N2)N(C2C=C(O)C(=C=O)O2)C(O)=NC1=O
274 424.1615452241 CCCC1=NC2=C(C=CC(=[NH+]C3=C(C)C(=O)N=C(O)N3C3C=C(O)C(=C=O)O3)N2)C1C Intermediate Fragment 
275 424.1615452241 CCC1=NC2=C(C=CC(=[NH+]C3=C(C)C(=O)N=C(O)N3C3C=C(O)C(=C=O)O3)N2)C1CC Intermediate Fragment 
276 396.1302450961 CCC1=NC2=C(C=CC(=[NH+]C3=C(C)C(=O)N=C(O)N3C3C=C(O)C(=C=O)O3)N2)C1
277 398.1458951601 CCC1CNC2=C1C=CC(=[NH+]C1=C(C)C(=O)N=C(O)N1C1C=C(O)C(=C=O)O1)N2
278 424.1615452241 CCCC1C(C)=NC2=C1C=CC(=[NH+]C1=C(C)C(=O)N=C(O)N1C1C=C(O)C(=C=O)O1)N2 Intermediate Fragment 
279 384.1302450961 CC1=C([NH+]=C2C=CC3=C(N2)NC(C)C3)N(C2C=C(O)C(=C=O)O2)C(O)=NC1=O
280 424.1615452241 CCCCC1C=NC2=C1C=CC(=[NH+]C1=C(C)C(=O)N=C(O)N1C1C=C(O)C(=C=O)O1)N2 Intermediate Fragment 
281 372.1302450961 CC1=C([NH+]=C2C=CC3CCNC3N2)N(C2C=C(O)C(=C=O)O2)C(O)=NC1=O
282 374.1458951601 CC1=C([NH+]=C2CCC3CCNC3N2)N(C2C=C(O)C(=C=O)O2)C(O)=NC1=O
283 384.1302450961 CC1=C([NH+]=C2C=CC3=C(NCC3C)N2)N(C2C=C(O)C(=C=O)O2)C(O)=NC1=O
284 424.1615452241 CCCCC1=NC2=C(C=CC(=[NH+]C3=C(C)C(=O)N=C(O)N3C3C=C(O)C(=C=O)O3)N2)C1 Intermediate Fragment 
285 422.1458951601 CC1=C([NH+]=C2C=CC3=C(N=C4CCCCC43)N2)N(C2C=C(O)C(=C=O)O2)C(O)=NC1=O
