#In-silico ESI-MS/MS [M+H]+ Spectra
#PREDICTED BY CFM-ID 4.0.8
#SMILES=O1[C@H](CO)[C@@H](C[C@@H]1n1ccc(nc1=O)NC1c2c(C(C(C1O)O)O)cc1c3c2c2c(c4c3c(cc1)ccc4)cccc2)O
#InChiKey=MFGHQBVHWGJIIU-NNXNYRAHSA-N
energy0
446.14992 100.00 35 34 33 24 (41.363 9.4319 1.2418 0.0014658)
464.16048 38.98 2 84 75 67 48 36 95 90 63 81 94 52 82 86 87 55 59 93 (19.521 0.28674 0.19592 0.099713 0.06769 0.039141 0.017896 0.017121 0.013604 0.0090491 0.0075842 0.0042002 0.0038497 0.0012673 0.0004707 0.00022763 0.00014413 5.6271e-05)
580.20783 19.58 0 152 215 204 259 271 251 249 246 209 214 268 242 281 276 270 275 273 250 280 272 235 240 279 278 (9.6553 0.1372 0.090484 0.079016 0.060845 0.052058 0.035426 0.021356 0.018176 0.014583 0.013397 0.0032975 0.0026688 0.0015191 0.0013802 0.00064675 0.00041595 0.0002622 0.00012841 0.00010918 8.8843e-05 3.8133e-05 3.2626e-05 2.8662e-05 1.6519e-05)
energy1
112.05054 7.13 20 (4.2746)
446.14992 100.00 35 33 34 24 (55.256 3.1571 1.5388 0.0091506)
448.16557 4.61 23 133 135 (2.4113 0.25638 0.095875)
464.16048 11.43 2 36 75 48 82 84 81 67 95 63 59 87 52 90 94 55 93 86 (6.5475 0.070834 0.062192 0.041713 0.041035 0.030918 0.014447 0.013294 0.011416 0.0083708 0.0039541 0.0025855 0.0018997 0.0012346 0.00099019 0.00036517 0.00030706 6.031e-05)
490.17613 5.10 173 172 261 (2.3217 0.71846 0.019916)
518.17105 3.03 163 164 162 161 258 260 (0.77042 0.66735 0.35504 0.014673 0.0078461 0.00052392)
544.18670 4.74 13 14 141 12 142 146 (1.9345 0.33441 0.2649 0.1067 0.10417 0.099994)
energy2
43.01784 7.11 179 (1.6676)
45.03349 5.35 182 (1.255)
55.01784 3.52 181 (0.82639)
57.03349 14.87 105 (3.4898)
59.04914 3.71 185 (0.87137)
71.04914 3.40 197 198 (0.55275 0.24507)
73.02841 4.29 226 180 (0.92905 0.078492)
112.05054 15.43 20 (3.6202)
352.13321 5.72 111 (1.3414)
353.11722 6.52 30 (1.5299)
362.08117 6.55 28 (1.5376)
364.09682 5.74 27 (1.3462)
366.11247 11.46 26 (2.69)
368.12812 6.55 25 114 (1.3416 0.19453)
370.14377 7.31 19 112 (0.96171 0.75399)
374.17507 4.36 17 (1.024)
394.14377 4.29 53 (1.006)
404.13935 4.65 73 85 (0.64035 0.45054)
419.13902 9.83 44 50 (2.2113 0.095335)
434.14992 4.51 79 72 (0.6562 0.40271)
446.14992 38.44 35 34 24 33 (4.1077 3.517 0.95858 0.43937)
462.14483 6.31 10 47 66 97 (0.82264 0.50353 0.08151 0.073869)
464.16048 100.00 2 36 75 67 48 55 63 84 59 81 52 82 90 87 95 86 93 94 (7.0717 5.5077 1.9957 1.8362 1.1516 0.99226 0.91049 0.69625 0.60692 0.55536 0.5409 0.51637 0.33319 0.27268 0.16215 0.11267 0.10659 0.10038)
468.19178 3.15 22 (0.73812)
474.14483 10.96 192 191 190 (2.5404 0.018827 0.012976)
476.16048 9.70 188 187 (2.2617 0.014155)
496.22308 6.61 213 (1.5516)
518.17105 5.93 164 258 163 260 162 161 (1.0284 0.22999 0.072651 0.057004 0.0025423 0.0017522)
522.20235 14.01 208 264 269 (2.483 0.45228 0.35265)
537.20201 5.29 244 (1.2417)

0 580.2078267201 O=c1nc([NH2+]C2c3c(cc4ccc5cccc6c7ccccc7c3c4c56)C(O)C(O)C2O)ccn1C1CC(O)C(CO)O1
1 548.1816119721 O=C1C(=[NH+]C2=NC(=O)N(C3=CC(O)=CO3)C=C2)C2=C(C=C3CC=C4CCCC5=C4C3=C2C2=C5CCCC2)C(O)=C1O
2 464.1604826041 O=C1C(=[NH+]C2=CC=NC(O)=N2)C2=C(C=C3CC=C4C=CCC5=C4C3=C2C2=C5CCCC2)C(O)=C1O
3 530.1710472881 O=C1C(O)=CC2=C(C1=[NH+]C1=NC(=O)N(C3=CC(O)=CO3)C=C1)C1=C3C(=C2)CC=C2C=CCC(=C23)C2=C1CCCC2
4 550.1972620361 O=C1C(=[NH+]C2=NC(=O)N(C3=CC(O)=CO3)C=C2)C2=C(C=C3CCC4CCCC5=C4C3=C2C2=C5CCCC2)C(O)=C1O
5 532.1866973521 O=C1C(O)=CC2=C(C1=[NH+]C1=NC(=O)N(C3=CC(O)=CO3)C=C1)C1=C3C(=C2)CC=C2CCCC(=C23)C2=C1CCCC2
6 552.2129121001 O=C1C(=[NH+]C2=NC(=O)N(C3=CC(O)=CO3)C=C2)C2=C(C=C3CCC4CCCC5C6=C(CCCC6)C2=C3C45)C(O)=C1O
7 534.2023474161 O=C1C(O)=CC2=C(C1=[NH+]C1=NC(=O)N(C3=CC(O)=CO3)C=C1)C1=C3C(=C2)CCC2CCCC(=C32)C2=C1CCCC2
8 562.1972620361 C=C1OC(N2C=CC([NH+]=C3C(=O)C(O)=C(O)C4=C3C3=C5C(=C4)CC=C4CCCC(=C45)C4=C3CCCC4)=NC2=O)C=C1O
9 466.1761326681 O=C1C(=[NH+]C2=CC=NC(O)=N2)C2=C(C=C3CC=C4CCCC5=C4C3=C2C2=C5CCCC2)C(O)=C1O
10 462.1448325401 O=C1C(=[NH+]C2=CC=NC(O)=N2)C2=C(C=C3CC=C4C=CCC5=C4C3=C2C2=C5C=CCC2)C(O)=C1O
11 210.0873176641 C=C1OC(N2C=CC([NH3+])=NC2O)=CC1O
12 544.1866973521 C=C1OC(N2C=CC([NH+]=C3C(=O)C=C(O)C4=C3C3=C5C(=C4)CC=C4C=CCC(=C45)C4=C3CCCC4)=NC2=O)C=C1O
13 544.1866973521 C=C1OC(N2C=CC([NH+]=C3C(=O)C(O)=CC4=C3C3=C5C(=C4)CC=C4C=CCC(=C45)C4=C3CCCC4)=NC2=O)C=C1O
14 544.1866973521 C=C1C=CC(N2C=CC([NH+]=C3C(=O)C(O)=C(O)C4=C3C3=C5C(=C4)CC=C4C=CCC(=C45)C4=C3CCCC4)=NC2=O)O1
15 562.1972620361 C=C(CO)OC(=C)N1C=CC([NH+]=C2C(=O)C(O)=C(O)C3=C2C2=C4C(=C3)CC=C3C=CCC(=C34)C3=C2CCCC3)=NC1=O Intermediate Fragment 
16 470.2074327961 O=C1C(=[NH+]C2=CC=NC(O)=N2)C2=C(C=C3CCC4CCCC5C6=C(CCCC6)C2=C3C45)C(O)=C1O
17 374.1750700481 [NH2+]=C1C(=O)C(O)=C(O)C2=C1C1=C3C(=C2)CCC2CCCC(=C32)C2=C1CCCC2
18 372.1594199841 [NH2+]=C1C(=O)C(O)=C(O)C2=C1C1=C3C(=C2)CC=C2CCCC(=C23)C2=C1CCCC2
19 370.1437699201 [NH2+]=C1C(=O)C(O)=C(O)C2=C1C1=C3C(=C2)CC=C2C=CCC(=C23)C2=C1CCCC2
20 112.0505382321 [NH3+]C1=CC=NC(O)=N1
21 452.1968681121 O=C1C(O)=CC2=C(C1=[NH+]C1=CC=NC(O)=N1)C1=C3C(=C2)CCC2CCCC(=C32)C2=C1CCCC2
22 468.1917827321 O=C1C(=[NH+]C2=CC=NC(O)=N2)C2=C(C=C3CCC4CCCC5=C4C3=C2C2=C5CCCC2)C(O)=C1O
23 448.1655679841 O=C1C(O)=CC2=C(C1=[NH+]C1=CC=NC(O)=N1)C1=C3C(=C2)CC=C2C=CCC(=C23)C2=C1CCCC2
24 446.1499179201 O=C1C(=[NH+]C2=CC=NC=N2)C2=C(C=C3CC=C4C=CCC5=C4C3=C2C2=C5C=CCC2)C(O)=C1O
25 368.1281198561 [NH2+]=C1C(=O)C(=O)C(=O)C2=C1C1=C3C(=C2)C=CC2=CCCC(=C23)C2=C1CCCC2
26 366.1124697921 [NH2+]=C1C(=O)C(=O)C(=O)C2=C1C1=C3C(=C2)C=CC2=CC=CC(=C23)C2=C1CCCC2
27 364.0968197281 [NH2+]=C1C(=O)C(=O)C(=O)C2=C1C1=C3C(=C2)C=CC2=CC=CC(=C23)C2=C1CCC=C2
28 362.0811696641 [NH2+]=C1C(=O)C(=O)C(=O)C2=C1C1=C3C(=C2)C=CC2=CC=CC(=C23)C2=C1C=CC=C2
29 97.0396392001 [OH2+]C1=NC=CC=N1
30 353.1172208241 O=C1C(=[OH+])C=C2C(=C1O)C=C1C=CC3=CC=CC4=C3C1=C2C1=C4CCCC1
31 351.1015707601 O=C1C(=[OH+])C=C2C(=C1O)C=C1C=CC3=CC=CC4=C3C1=C2C1=C4C=CCC1
32 114.0661882961 [NH3+]C1=CC=NC(O)N1
33 446.1499179201 OC1=NC([NH+]=C2CC(O)=C(O)C3=C2C2=C4C(=C3)CC=C3C=CCC(=C34)C3=C2C=CC=C3)=CC=N1
34 446.1499179201 O=C1C=C(O)C2=C(C1=[NH+]C1=CC=NC(O)=N1)C1=C3C(=C2)CC=C2C=CCC(=C23)C2=C1CCC=C2
35 446.1499179201 O=C1C(O)=CC2=C(C1=[NH+]C1=CC=NC(O)=N1)C1=C3C(=C2)CC=C2C=CCC(=C23)C2=C1CCC=C2
36 464.1604826041 N=C=C=C(N=C=O)[NH+]=C1C(=O)C(O)=C(O)C2=C1C1=C3C(=C2)CC=C2CCCC(=C23)C2=C1CCCC2 Intermediate Fragment 
37 447.1339335081 C#CC(N=C1C(=O)C(O)=C(O)C2=C1C1=C3C(=C2)CC=C2C=CCC(=C23)C2=C1CCC=C2)=[NH+]C=O
38 437.1495835721 C=C(N=C1C(=O)C(O)=C(O)C2=C1C1=C3C(=C2)CC=C2C=CCC(=C23)C2=C1CCCC2)[NH+]=C=O
39 435.1339335081 C=C(N=C1C(=O)C(O)=C(O)C2=C1C1=C3C(=C2)CC=C2C=CCC(=C23)C2=C1CCC=C2)[NH+]=C=O
40 423.1339335081 O=C[NH+]=C=NC1=C2C(=C(O)C(O)=C1O)C=C1CC=C3C=CCC4=C3C1=C2C1=C4C=CCC1
41 421.1182834441 O=C[NH+]=C=NC1=C2C(=C(O)C(O)=C1O)C=C1CC=C3C=CCC4=C3C1=C2C1=C4C=CC=C1
42 419.1026333801 O=C=[N+]=C=NC1=C2C(=C(O)C(O)=C1O)C=C1CC=C3C=CCC4=C3C1=C2C1=C4C=CC=C1
43 417.1233688241 [NH+]#CC#CN=C1C(=O)C(O)=C(O)C2=C1C1=C3C(=C2)CC=C2C=CCC(=C23)C2=C1CCC=C2
44 419.1390188881 [NH+]#CC#CN=C1C(=O)C(O)=C(O)C2=C1C1=C3C(=C2)CC=C2C=CCC(=C23)C2=C1CCCC2
45 421.1546689521 [NH+]#CC#CN=C1C(=O)C(O)=C(O)C2=C1C1=C3C(=C2)CC=C2CCCC(=C23)C2=C1CCCC2
46 436.1655679841 [NH+]#CC=C(N)N=C1C(=O)C(O)=C(O)C2=C1C1=C3C(=C2)CC=C2C=CCC(=C23)C2=C1CCCC2
47 462.1448325401 [NH+]#CC=C(N=C=O)N=C1C(=O)C(O)=C(O)C2=C1C1=C3C(=C2)CC=C2C=CCC(=C23)C2=C1CCCC2
48 464.1604826041 NC(=C=C=NC=O)[NH+]=C1C(=O)C(O)=C(O)C2=C1C1=C3C(=C2)CC=C2C=CCC(=C23)C2=C1CCCC2 Intermediate Fragment 
49 421.1546689521 C#CC(=[NH2+])N=C1C(=O)C(O)=C(O)C2=C1C1=C3C(=C2)CC=C2C=CCC(=C23)C2=C1CCCC2
50 419.1390188881 C#CC(=[NH2+])N=C1C(=O)C(O)=C(O)C2=C1C1=C3C(=C2)CC=C2C=CCC(=C23)C2=C1CCC=C2
51 417.1233688241 C#CC(=[NH2+])N=C1C(=O)C(O)=C(O)C2=C1C1=C3C(=C2)CC=C2C=CCC(=C23)C2=C1C=CC=C2
52 464.1604826041 N=C(O)N=C=C=C=[NH+]C1=C2C(=C(O)C(O)=C1O)C=C1CC=C3C=CCC4=C3C1=C2C1=C4CCCC1 Intermediate Fragment 
53 394.1437699201 C#C[NH+]=C1C(=O)C(O)=C(O)C2=C1C1=C3C(=C2)CC=C2C=CCC(=C23)C2=C1CCCC2
54 447.1339335081 O=C[NH+]=C=C=C=NC1=C2C(=C(O)C(O)=C1O)C=C1CC=C3C=CCC4=C3C1=C2C1=C4C=CCC1
55 464.1604826041 C=C=NC(=O)N=C=[NH+]C1=C2C(=C(O)C(O)=C1O)C=C1CC=C3C=CCC4=C3C1=C2C1=C4CCCC1 Intermediate Fragment 
56 380.1281198561 C=[NH+]C1=C2C(=C(O)C(=O)C1=O)C=C1CC=C3C=CCC4=C3C1=C2C1=C4C=CCC1
57 395.1390188881 [NH+]#CN=C1C(=O)C(O)=C(O)C2=C1C1=C3C(=C2)C=CC2=CCCC(=C23)C2=C1CCCC2
58 397.1546689521 [NH+]#CN=C1C(=O)C(O)=C(O)C2=C1C1=C3C(=C2)C=CC2CCCC(=C32)C2=C1CCCC2
59 464.1604826041 C=NC(O)=NC(=C)[NH+]=C1C(=O)C(O)=C(O)C2=C1C1=C3C(=C2)CC=C2C=CCC(=C23)C2=C1CCC=C2 Intermediate Fragment 
60 390.1124697921 C#C[NH+]=C1C(=O)C(O)=C(O)C2=C1C1=C3C(=C2)CC=C2C=CCC(=C23)C2=C1C=CC=C2
61 392.1281198561 C#C[NH+]=C1C(=O)C(O)=C(O)C2=C1C1=C3C(=C2)CC=C2C=CCC(=C23)C2=C1CCC=C2
62 409.1546689521 C=C([NH3+])N=C1C(=O)C(=O)C(=O)C2=C1C1=C3C(=C2)CC=C2C=CCC(=C23)C2=C1CCCC2
63 464.1604826041 C=C=C(N=C(N)O)[NH+]=C1C(=O)C(O)=C(O)C2=C1C1=C3C(=C2)CC=C2C=CCC(=C23)C2=C1CCC=C2 Intermediate Fragment 
64 402.1124697921 C#CC#[N+]C1=C2C(=C(O)C(O)=C1O)C=C1CC=C3C=CCC4=C3C1=C2C1=C4C=CC=C1
65 404.1281198561 C#CC=[NH+]C1=C2C(=C(O)C(O)=C1O)C=C1CC=C3C=CCC4=C3C1=C2C1=C4C=CC=C1
66 462.1448325401 C#CC(=NC([NH3+])=O)N=C1C(=O)C(O)=C(O)C2=C1C1=C3C(=C2)CC=C2C=CCC(=C23)C2=C1CCC=C2
67 464.1604826041 O=C=C(O)C(=[NH+]C1=CC=NC(O)=N1)C1=C(C=O)C=C2CC=C3C=CCC4=C3C2=C1C1=C4CCCC1 Intermediate Fragment 
68 283.1117415201 [OH+]=CC1=CC2=C3C(=C1)C=CC1=CC=CC(=C13)C1=C2CCC=C1
69 281.0960914561 [OH+]=CC1=CC2=C3C(=C1)C=CC1=CC=CC(=C13)C1=C2C=CC=C1
70 279.0804413921 [O+]#CC1=CC2=C3C(=C1)C=CC1=CC=CC(=C13)C1=C2C=CC=C1
71 184.0716676001 OCC(O)C=[NH+]C1=CC=NC(O)=N1
72 434.1499179201 O=CC(=[NH+]C1=CC=NC(O)=N1)C1=C(C=O)C=C2CC=C3C=CCC4=C3C2=C1C1=C4C=CCC1
73 404.1393532361 O=C=C1C=C2CC=C3C=CCC4=C3C2=C(C1=C=[NH+]C1=CC=NC(O)=N1)C1=C4C=CCC1
74 402.1237031721 O=C=C1C=C2CC=C3C=CCC4=C3C2=C(C1=C=[NH+]C1=CC=NC(O)=N1)C1=C4C=CC=C1
75 464.1604826041 O=C=C(O)C1=C(C(C=O)=[NH+]C2=CC=NC(O)=N2)C2=C3C(=C1)CC=C1C=CCC(=C13)C1=C2CCCC1 Intermediate Fragment 
76 311.1066561401 O=C(C=[OH+])C1=CC2=C3C(=C1)C=CC1=CC=CC(=C13)C1=C2CCC=C1
77 402.1237031721 [O+]#CC(=NC1=CC=NC(O)=N1)C1=CC=C2CC=C3C=CCC4=C3C2=C1C1=C4C=CC=C1
78 408.1706533641 O=CC(=[NH+]C1=CC=NC(O)=N1)C1=CC=C2CC=C3C=CCC4=C3C2=C1C1=C4CCCC1
79 434.1499179201 O=CC(O)=C1C=C2CC=C3C=CCC4=C3C2=C(C1=C=[NH+]C1=CC=NC(O)=N1)C1=C4C=CCC1
80 432.1342678561 O=CC(O)=C1C=C2CC=C3C=CCC4=C3C2=C(C1=C=[NH+]C1=CC=NC(O)=N1)C1=C4C=CC=C1
81 464.1604826041 O=C=C(O)C(O)=C1C=C2CC=C3C=CCC4=C3C2=C(C1=C=[NH+]C1=CC=NC(O)=N1)C1=C4CCCC1 Intermediate Fragment 
82 464.1604826041 O=C(C=[NH+]C1=CC=NC(O)=N1)C(O)=C(O)C1=CC2=C3C(=C1)CC=C1C=CCC(=C13)C1=C2CCC=C1 Intermediate Fragment 
83 341.1172208241 O=C(C=[OH+])C(=O)C1=CC2=C3C(=C1)C=CC1=CC=CC(=C13)C1=C2CCCC1
84 464.1604826041 O=C=C(O)C(=O)C(=[NH+]C1=CC=NC(O)=N1)C1=CC=C2CC=C3C=CCC4=C3C2=C1C1=C4CCCC1 Intermediate Fragment 
85 404.1393532361 O=CC(=[NH+]C1=CC=NC(O)=N1)C1=CC=C2CC=C3C=CCC4=C3C2=C1C1=C4C=CC=C1
86 464.1604826041 C=C1CC=C2C=CCC3=C2C1=C(C1=CC(O)=C(O)C(=O)C1=[NH+]C1=CC=NC(O)=N1)C1=C3C=CCC1 Intermediate Fragment 
87 464.1604826041 C=C=CC1=CCC2=CC3=C(C(=[NH+]C4=CC=NC(O)=N4)C(=O)C(O)=C3O)C3=C2C1=CC1=C3CCCC1 Intermediate Fragment 
88 420.0978823481 O=C1C(=O)C(=[NH+]C2=CC=NC(O)=N2)C2=C(C=C3CC=CC4=CC5=C(C=CC=C5)C2=C43)C1=O
89 424.1291824761 O=C1C(=O)C(=[NH+]C2=CC=NC(O)=N2)C2=C(C=C3CC=CC4=CC5=C(CCCC5)C2=C43)C1=O
90 464.1604826041 C=CCC1=C(C)C2=C3C(=CCC4=CC5=C(C(=[NH+]C6=CC=NC(O)=N6)C(=O)C(O)=C5O)C1=C43)C=CC2 Intermediate Fragment 
91 438.1448325401 CC1=C(C)C2=C3C(=CC4=C2C(=[NH+]C2=CC=NC(O)=N2)C(=O)C(O)=C4O)C=CC2=CCCC1=C23
92 436.1291824761 CC1=C(C)C2=C3C(=CC4=C2C(=[NH+]C2=CC=NC(O)=N2)C(=O)C(O)=C4O)C=CC2=CC=CC1=C23
93 464.1604826041 C=CC1=C(CC)C2=C3C(=CC4=C2C(=[NH+]C2=CC=NC(O)=N2)C(=O)C(O)=C4O)CC=C2C=CCC1=C23 Intermediate Fragment 
94 464.1604826041 O=C1C(=[NH+]C2=CC=NC(O)=N2)C2=C(C=C3CC=C4C=CCC=C4C3=C2C2=CC=CCC2)C(O)=C1O Intermediate Fragment 
95 464.1604826041 O=C1C(=[NH+]C2=CC=NC(O)=N2)C2=C(C=C3CC=C4C=CCC(C5=CCCC=C5)=C4C3=C2)C(O)=C1O Intermediate Fragment 
96 444.1342678561 O=C1C(O)=CC2=C(C1=[NH+]C1=CC=NC(O)=N1)C1=C3C(=C2)CC=C2C=CCC(=C23)C2=C1C=CC=C2
97 462.1448325401 O=C=C(O)C1=C(C(C=O)=[NH+]C2=CC=NC(O)=N2)C2=C3C(=C1)CC=C1C=CCC(=C13)C1=C2CCC=C1 Intermediate Fragment 
98 115.0389705041 OC1CCOC1=C=[OH+]
99 117.0546205681 OC1CCOC1=C[OH2+]
100 99.0440558841 C=C1OCC=C1[OH2+]
101 117.0546205681 OCCC(O)C#C[OH2+] Intermediate Fragment 
102 117.0546205681 OCCCOC#C[OH2+] Intermediate Fragment 
103 117.0546205681 CCC(O)C(=O)C=[OH+] Intermediate Fragment 
104 99.0440558841 CC=C(O)C#C[OH2+]
105 57.0334912001 CC#C[OH2+]
106 119.0702706321 OC1CCOC1C[OH2+]
107 119.0702706321 OCCC(O)C=C[OH2+] Intermediate Fragment 
108 562.1972620361 O=C=C1OC(N2C=CC([NH+]=C3C(=O)C(O)=C(O)C4=C3C3=C5C(=C4)CC=C4CCCC(=C45)C4=C3CCCC4)=NC2)C=C1O
109 376.1907201121 [NH2+]=C1C(=O)C(=O)C(=O)C2=C1C1=C3C(=C2)CCC2CCCC(C4CCCCC14)C32
110 354.1488553001 [NH2+]=C1C(=O)C(O)=CC2=C1C1=C3C(=C2)CC=C2C=CCC(=C23)C2=C1CCCC2
111 352.1332052361 [NH2+]=C1C(=O)C(O)=CC2=C1C1=C3C(=C2)CC=C2C=CCC(=C23)C2=C1CCC=C2
112 370.1437699201 [NH2+]=C(C(O)=C=O)C1=C(C=O)C=C2CC=C3C=CCC4=C3C2=C1C1=C4CCCC1 Intermediate Fragment 
113 350.1175551721 [NH2+]=C1C(=O)C(O)=CC2=C1C1=C3C(=C2)CC=C2C=CCC(=C23)C2=C1C=CC=C2
114 368.1281198561 [NH2+]=C(C(O)=C=O)C1=C(C=O)C=C2CC=C3C=CCC4=C3C2=C1C1=C4C=CCC1 Intermediate Fragment 
115 209.0556831881 OC1C=C(N2C=CC=NC2O)OC1=C=[OH+]
116 211.0713332521 OC1C=C(N2C=CCNC2O)OC1=C=[OH+]
117 211.0713332521 O=C(C=[OH+])C(O)=C=CN1C=CCNC1O Intermediate Fragment 
118 213.0869833161 OC1C=C(N2CCCNC2O)OC1=C=[OH+]
119 213.0869833161 OC(=C=C(O)N1CCCNC1O)C#C[OH2+] Intermediate Fragment 
120 361.1798210801 O=C1C(=[OH+])C=C2C(=C1O)C=C1CCC3CCCC4C5=C(CCCC5)C2=C1C34
121 359.1641710161 O=C1C(=[OH+])C=C2C(=C1O)C=C1CCC3CCCC4=C3C1=C2C1=C4CCCC1
122 355.1328708881 O=C1C(=[OH+])C=C2C(=C1O)C=C1C=CC3=CCCC4=C3C1=C2C1=C4CCCC1
123 337.1223062041 OC1=C2C=C3CC=C4C=CCC5=C4C3=C(C2=CC=C1[OH2+])C1=C5C=CC=C1
124 337.1223062041 OC1=C([OH2+])C=C2C(=C1)C=C1CC=C3C=CCC4=C3C1=C2C1=C4C=CC=C1
125 355.1328708881 O=C=C([OH2+])C=C1C(=C=O)C=C2CC=C3C=CCC4=C3C2=C1C1=C4CCCC1 Intermediate Fragment 
126 220.0352820921 [NH3+]C1=NC(=O)N(C2=CC(=O)C(=C=O)O2)C=C1
127 224.0665822201 [NH3+]C1=NC(O)N(C2=CC(O)C(=C=O)O2)C=C1
128 226.0822322841 [NH3+]C1C=CN(C2=CC(O)C(=C=O)O2)C(O)N1
129 226.0822322841 [NH3+]C1C=CN(C=C=C(O)C(=O)C=O)C(O)N1 Intermediate Fragment 
130 228.0978823481 [NH3+]C1CCN(C2=CC(O)C(=C=O)O2)C(O)N1
131 228.0978823481 [NH3+]C1CCN(C(O)=C=C(O)C#CO)C(O)N1 Intermediate Fragment 
132 562.1972620361 O=C=C1OC(N2C=CC([NH+]=C3CC(O)=C(O)C4=C3C3=C5C(=C4)CC=C4CCCC(=C45)C4=C3CCCC4)=NC2=O)C=C1O
133 448.1655679841 O=C1C(O)=CC(=[NH+]C2=CC=NC(O)=N2)C2=C1C=C1CC=C3C=CCC4=C3C1=C2C1=C4CCCC1
134 562.1972620361 O=C=C1OC(N2C=CC([NH+]=C3C(=O)C=C(O)C4=C3C3=C5C(=C4)CCC4CCCC(=C54)C4=C3CCCC4)=NC2=O)C=C1O
135 448.1655679841 O=C1C=C(O)C2=C(C1=[NH+]C1=CC=NC(O)=N1)C1=C3C(=C2)CC=C2C=CCC(=C23)C2=C1CCCC2
136 444.1342678561 O=C1C=C(O)C2=C(C1=[NH+]C1=CC=NC(O)=N1)C1=C3C(=C2)CC=C2C=CCC(=C23)C2=C1C=CC=C2
137 562.1972620361 C=C(OC(=C=O)CO)N1C=CC([NH+]=C2C(=O)C=C(O)C3=C2C2=C4C(=C3)CC=C3CCCC(=C34)C3=C2CCCC3)=NC1=O Intermediate Fragment 
138 562.1972620361 O=CC(=O)C(O)=C=CN1C=CC([NH+]=C2C(=O)C=C(O)C3=C2C2=C4C(=C3)CCC3CCCC(=C43)C3=C2CCCC3)=NC1=O Intermediate Fragment 
139 502.1761326681 O=C1C=C(O)C2=C(C1=[NH+]C1=NC(=O)N(CC#CO)C=C1)C1=C3C(=C2)CC=C2C=CCC(=C23)C2=C1CCCC2
140 562.1972620361 O=C=C1OC(N2C=CC([NH+]=C3C(=O)C(O)=CC4=C3C3=C5C(=C4)CCC4CCCC(=C54)C4=C3CCCC4)=NC2=O)C=C1O
141 544.1866973521 O=C=C1OC(N2C=CC([NH+]=C3C(=O)C=CC4=C3C3=C5C(=C4)CC=C4CCCC(=C45)C4=C3CCCC4)=NC2=O)C=C1O
142 544.1866973521 O=C=C1C=CC(N2C=CC([NH+]=C3C(=O)C(O)=CC4=C3C3=C5C(=C4)CC=C4CCCC(=C45)C4=C3CCCC4)=NC2=O)O1
143 562.1972620361 O=C1C(O)=CC2=C(C1=[NH+]C1=NC(=O)N(C(O)=C=C(O)C#CO)C=C1)C1=C3C(=C2)CCC2CCCC(=C32)C2=C1CCCC2 Intermediate Fragment 
144 562.1972620361 C=C(OC(=C=O)CO)N1C=CC([NH+]=C2C(=O)C(O)=CC3=C2C2=C4C(=C3)CC=C3CCCC(=C34)C3=C2CCCC3)=NC1=O Intermediate Fragment 
145 562.1972620361 O=CC(=O)C(O)=C=CN1C=CC([NH+]=C2C(=O)C(O)=CC3=C2C2=C4C(=C3)CCC3CCCC(=C43)C3=C2CCCC3)=NC1=O Intermediate Fragment 
146 544.1866973521 O=C1C(O)=CC2=C(C1=[NH+]C1=NC(=O)N(C=C=C(O)C#CO)C=C1)C1=C3C(=C2)CC=C2CCCC(=C23)C2=C1CCCC2
147 504.1917827321 O=C1C(O)=CC2=C(C1=[NH+]C1=NC(=O)N(CC#CO)C=C1)C1=C3C(=C2)CC=C2CCCC(=C23)C2=C1CCCC2
148 502.1761326681 O=C1C(O)=CC2=C(C1=[NH+]C1=NC(=O)N(CC#CO)C=C1)C1=C3C(=C2)CC=C2C=CCC(=C23)C2=C1CCCC2
149 476.1968681121 C#CN1C=CC([NH+]=C2C(=O)C(O)=CC3=C2C2=C4C(=C3)CCC3CCCC(=C43)C3=C2CCCC3)=NC1=O
150 474.1812180481 C#CN1C=CC([NH+]=C2C(=O)C(O)=CC3=C2C2=C4C(=C3)CC=C3CCCC(=C34)C3=C2CCCC3)=NC1=O
151 562.1972620361 O=C=CC1=C(C(C=O)=[NH+]C2=NC(=O)N(C3C=C(O)C(=C=O)O3)C=C2)C2=C3C(=C1)CCC1CCCC(=C31)C1=C2CCCC1 Intermediate Fragment 
152 580.2078267201 O=C1C(=[NH+]C2=NC(=O)N(C(O)=C=C(O)C#CO)C=C2)C2=C(C=C3CCC4CCCC5C6=C(CCCC6)C2=C3C45)C(O)=C1O Intermediate Fragment 
153 538.1972620361 O=C1C(=[NH+]C2=NC(=O)N(C(O)C#CO)C=C2)C2=C(C=C3CCC4CCCC5=C4C3=C2C2=C5CCCC2)C(O)=C1O
154 520.1866973521 C#CC(O)N1C=CC([NH+]=C2C(=O)C(O)=C(O)C3=C2C2=C4C(=C3)CC=C3CCCC(=C34)C3=C2CCCC3)=NC1=O
155 520.1866973521 O=C1C(=[NH+]C2=NC(=O)N(CC#CO)C=C2)C2=C(C=C3CC=C4CCCC5=C4C3=C2C2=C5CCCC2)C(O)=C1O
156 536.1816119721 O=C1C(=[NH+]C2=NC(=O)N(C(O)C#CO)C=C2)C2=C(C=C3CC=C4CCCC5=C4C3=C2C2=C5CCCC2)C(O)=C1O
157 508.1866973521 C=C(O)N1C=CC([NH+]=C2C(=O)C(O)=C(O)C3=C2C2=C4C(=C3)CC=C3CCCC(=C34)C3=C2CCCC3)=NC1=O
158 506.1710472881 C=C(O)N1C=CC([NH+]=C2C(=O)C(O)=C(O)C3=C2C2=C4C(=C3)CC=C3C=CCC(=C34)C3=C2CCCC3)=NC1=O
159 494.1710472881 O=C1C(=[NH+]C2=NC(=O)N(CO)C=C2)C2=C(C=C3CC=C4C=CCC5=C4C3=C2C2=C5CCCC2)C(O)=C1O
160 492.1553972241 O=C1C(=[NH+]C2=NC(=O)N(CO)C=C2)C2=C(C=C3CC=C4C=CCC5=C4C3=C2C2=C5C=CCC2)C(O)=C1O
161 518.1710472881 O=C1C=C(O)C2=C(C1=[NH+]C1=NC(=O)N(C(O)C#CO)C=C1)C1=C3C(=C2)CC=C2C=CCC(=C23)C2=C1CCCC2
162 518.1710472881 O=C1C(O)=CC2=C(C1=[NH+]C1=NC(=O)N(C(O)C#CO)C=C1)C1=C3C(=C2)CC=C2C=CCC(=C23)C2=C1CCCC2
163 518.1710472881 C#CC(O)N1C=CC([NH+]=C2C(=O)C(O)=C(O)C3=C2C2=C4C(=C3)CC=C3C=CCC(=C34)C3=C2CCCC3)=NC1=O
164 518.1710472881 O=C1C(=[NH+]C2=NC(=O)N(CC#CO)C=C2)C2=C(C=C3CC=C4C=CCC5=C4C3=C2C2=C5CCCC2)C(O)=C1O
165 536.1816119721 O=C=NC(=C=CN=C(O)C#CO)[NH+]=C1C(=O)C(O)=C(O)C2=C1C1=C3C(=C2)CCC2CCCC(=C32)C2=C1CCCC2 Intermediate Fragment 
166 534.1659619081 O=C1C(=[NH+]C2=NC(=O)N(C(O)C#CO)C=C2)C2=C(C=C3CC=C4C=CCC5=C4C3=C2C2=C5CCCC2)C(O)=C1O
167 516.1553972241 O=C1C(O)=CC2=C(C1=[NH+]C1=NC(=O)N(C(O)C#CO)C=C1)C1=C3C(=C2)CC=C2C=CCC(=C23)C2=C1CCC=C2
168 516.1553972241 C#CC(O)N1C=CC([NH+]=C2C(=O)C(O)=C(O)C3=C2C2=C4C(=C3)CC=C3C=CCC(=C34)C3=C2CCC=C3)=NC1=O
169 47.0491412641 CC[OH2+]
170 512.2179974801 C=C(O)N1C=CC([NH+]=C2C(=O)C(O)=C(O)C3=C2C2=C4C(=C3)CCC3CCCC(C5=C2CCCC5)C43)=NC1=O
171 510.2023474161 C=C(O)N1C=CC([NH+]=C2C(=O)C(O)=C(O)C3=C2C2=C4C(=C3)CCC3CCCC(=C43)C3=C2CCCC3)=NC1=O
172 490.1761326681 C=C(O)N1C=CC([NH+]=C2C(=O)C(O)=CC3=C2C2=C4C(=C3)CC=C3C=CCC(=C34)C3=C2CCCC3)=NC1=O
173 490.1761326681 C#CN1C=CC([NH+]=C2C(=O)C(O)=C(O)C3=C2C2=C4C(=C3)CC=C3CCCC(=C34)C3=C2CCCC3)=NC1=O
174 488.1604826041 C=C(O)N1C=CC([NH+]=C2C(=O)C(O)=CC3=C2C2=C4C(=C3)CC=C3C=CCC(=C34)C3=C2CCC=C3)=NC1=O
175 506.1710472881 C=C(O)N=C=C=C(N=C=O)[NH+]=C1C(=O)C(O)=C(O)C2=C1C1=C3C(=C2)CC=C2CCCC(=C23)C2=C1CCCC2 Intermediate Fragment 
176 504.1553972241 C=C(O)N1C=CC([NH+]=C2C(=O)C(O)=C(O)C3=C2C2=C4C(=C3)CC=C3C=CCC(=C34)C3=C2CCC=C3)=NC1=O
177 68.9971056921 [O+]#CC#CO
178 71.0127557561 O=CC#C[OH2+]
179 43.0178411361 C#C[OH2+]
180 73.0284058201 OCC#C[OH2+]
181 55.0178411361 C#CC=[OH+]
182 45.0334912001 C=C[OH2+]
183 75.0440558841 OCC=C[OH2+]
184 77.0597059481 OCCC[OH2+]
185 59.0491412641 C=CC[OH2+]
186 496.1866973521 O=C1C(=[NH+]C2=NC(=O)N(CO)C=C2)C2=C(C=C3CC=C4CCCC5=C4C3=C2C2=C5CCCC2)C(O)=C1O
187 476.1604826041 O=C1C(O)=CC2=C(C1=[NH+]C1=NC(=O)N(CO)C=C1)C1=C3C(=C2)CC=C2C=CCC(=C23)C2=C1CCC=C2
188 476.1604826041 CN1C=CC([NH+]=C2C(=O)C(O)=C(O)C3=C2C2=C4C(=C3)CC=C3C=CCC(=C34)C3=C2CCC=C3)=NC1=O
189 140.0454528521 [NH3+]C1=NC(=O)N(C=O)C=C1
190 474.1448325401 O=C1C=C(O)C2=C(C1=[NH+]C1=NC(=O)N(CO)C=C1)C1=C3C(=C2)CC=C2C=CCC(=C23)C2=C1C=CC=C2
191 474.1448325401 O=C1C(O)=CC2=C(C1=[NH+]C1=NC(=O)N(CO)C=C1)C1=C3C(=C2)CC=C2C=CCC(=C23)C2=C1C=CC=C2
192 474.1448325401 CN1C=CC([NH+]=C2C(=O)C(O)=C(O)C3=C2C2=C4C(=C3)CC=C3C=CCC(=C34)C3=C2C=CC=C3)=NC1=O
193 492.1553972241 O=C=NC(=C=CN=CO)[NH+]=C1C(=O)C(O)=C(O)C2=C1C1=C3C(=C2)CC=C2C=CCC(=C23)C2=C1CCCC2 Intermediate Fragment 
194 490.1397471601 O=C1C(=[NH+]C2=NC(=O)N(CO)C=C2)C2=C(C=C3CC=C4C=CCC5=C4C3=C2C2=C5C=CC=C2)C(O)=C1O
195 87.0440558841 CC(O)C#C[OH2+]
196 89.0597059481 CC(O)C=C[OH2+]
197 71.0491412641 C#CC(C)[OH2+]
198 71.0491412641 CCC#C[OH2+]
199 91.0753560121 CC(O)CC[OH2+]
200 73.0647913281 C=CC(C)[OH2+]
201 73.0647913281 CCC=C[OH2+]
202 562.1972620361 O=C1C(=[NH+]C2=NC(=O)N(C=C=C(O)C#CO)C=C2)C2=C(C=C3CCC4CCCC5=C4C3=C2C2=C5CCCC2)C(O)=C1O
203 578.1921766561 O=C1C(=[NH+]C2=NC(=O)N(C(O)=C=C(O)C#CO)C=C2)C2=C(C=C3CCC4CCCC5=C4C3=C2C2=C5CCCC2)C(O)=C1O
204 580.2078267201 O=C1C(=[NH+]C2=NC(=O)N(C(=C=CO)OC#CO)C=C2)C2=C(C=C3CCC4CCCC5C6=C(CCCC6)C2=C3C45)C(O)=C1O Intermediate Fragment 
205 552.2129121001 C=C(OC#CO)N1C=CC([NH+]=C2C(=O)C(O)=C(O)C3=C2C2=C4C(=C3)CCC3CCCC(C5=C2CCCC5)C43)=NC1=O
206 550.1972620361 C=C(OC#CO)N1C=CC([NH+]=C2C(=O)C(O)=C(O)C3=C2C2=C4C(=C3)CCC3CCCC(=C43)C3=C2CCCC3)=NC1=O
207 63.0440558841 OCC[OH2+]
208 522.2023474161 O=C1C(=[NH+]C2=NC(=O)N(CC#CO)C=C2)C2=C(C=C3CCC4CCCC5=C4C3=C2C2=C5CCCC2)C(O)=C1O
209 580.2078267201 C=C(OC(=C=O)CO)N1C=CC([NH+]=C2C(=O)C(O)=C(O)C3=C2C2=C4C(=C3)CCC3CCCC(=C43)C3=C2CCCC3)=NC1=O Intermediate Fragment 
210 488.1604826041 C#CN1C=CC([NH+]=C2C(=O)C(O)=C(O)C3=C2C2=C4C(=C3)CC=C3C=CCC(=C34)C3=C2CCCC3)=NC1=O
211 492.1917827321 C#CN1C=CC([NH+]=C2C(=O)C(O)=C(O)C3=C2C2=C4C(=C3)CCC3CCCC(=C43)C3=C2CCCC3)=NC1=O
212 494.2074327961 C#CN1C=CC([NH+]=C2C(=O)C(O)=C(O)C3=C2C2=C4C(=C3)CCC3CCCC(C5=C2CCCC5)C43)=NC1=O
213 496.2230828601 C#CN1C=CC([NH+]=C2C(=O)C(O)=C(O)C3=C2C2=C4C(=C3)CCC3CCCC(C5CCCCC25)C43)=NC1=O
214 580.2078267201 C=C(O)C(=C=O)OCN1C=CC([NH+]=C2C(=O)C(O)=C(O)C3=C2C2=C4C(=C3)CCC3CCCC(=C43)C3=C2CCCC3)=NC1=O Intermediate Fragment 
215 580.2078267201 O=CC(=O)C(O)=C=CN1C=CC([NH+]=C2C(=O)C(O)=C(O)C3=C2C2=C4C(=C3)CCC3CCCC(C5=C2CCCC5)C43)=NC1=O Intermediate Fragment 
216 524.2179974801 O=C1C(=[NH+]C2=NC(=O)N(CC#CO)C=C2)C2=C(C=C3CCC4CCCC5C6=C(CCCC6)C2=C3C45)C(O)=C1O
217 56.9971056921 O=C=C=[OH+]
218 59.0127557561 O=C=C[OH2+]
219 41.0021910721 [C+]#CO
220 61.0284058201 OC=C[OH2+]
221 84.9920203121 O=CC(=O)C#[O+]
222 87.0076703761 O=CC(=[OH+])C=O
223 89.0233204401 O=CC(=[OH+])CO
224 71.0127557561 CC(=O)C#[O+]
225 91.0389705041 OCC(=[OH+])CO
226 73.0284058201 CC(=[OH+])C=O
227 93.0546205681 OCC([OH2+])CO
228 75.0440558841 CC(=[OH+])CO
229 482.2074327961 CN1C=CC([NH+]=C2C(=O)C(O)=C(O)C3=C2C2=C4C(=C3)CCC3CCCC(=C43)C3=C2CCCC3)=NC1=O
230 480.1917827321 CN1C=CC([NH+]=C2C(=O)C(O)=C(O)C3=C2C2=C4C(=C3)CC=C3CCCC(=C34)C3=C2CCCC3)=NC1=O
231 478.1761326681 CN1C=CC([NH+]=C2C(=O)C(O)=C(O)C3=C2C2=C4C(=C3)CC=C3C=CCC(=C34)C3=C2CCCC3)=NC1=O
232 124.0505382321 [CH2+]N1C=CC(N)=NC1=O
233 460.1655679841 CN1C=CC([NH+]=C2C(=O)C(O)=CC3=C2C2=C4C(=C3)CC=C3C=CCC(=C34)C3=C2CCC=C3)=NC1=O
234 578.1921766561 O=CC(=O)C(O)=C=CN1C=CC([NH+]=C2C(=O)C(O)=C(O)C3=C2C2=C4C(=C3)CCC3CCCC(=C43)C3=C2CCCC3)=NC1=O
235 580.2078267201 C=C(N=C(O)N(C)C1C=C(O)C(=C=O)O1)[NH+]=C1C(=O)C(O)=C(O)C2=C1C1=C3C(=C2)CC=C2CCCC(=C23)C2=C1CCCC2 Intermediate Fragment 
236 411.1703190161 C=C([NH3+])N=C1C(=O)C(O)=C(O)C2=C1C1=C3C(=C2)C=CC2=CCCC(=C23)C2=C1CCCC2
237 146.0811696641 C[NH2+]C1CC(O)C(=CO)O1
238 144.0655196001 C[NH2+]C1CC(O)C(=C=O)O1
239 441.1808837001 C=C(N=C1C(=O)C(O)=C(O)C2=C1C1=C3C(=C2)CCC2CCCC(=C32)C2=C1CCCC2)[NH+]=C=O
240 580.2078267201 C=CN(C(=O)N=C=[NH+]C1=C2C(=C(O)C(O)=C1O)C=C1CCC3CCCC4=C3C1=C2C1=C4CCCC1)C1C=C(O)C(=C=O)O1 Intermediate Fragment 
241 186.0760842841 CC[NH+](CO)C1C=C(O)C(=C=O)O1
242 580.2078267201 N=C(O)N(C=C=C=[NH+]C1=C2C(=C(O)C(O)=C1O)C=C1CCC3CCCC4=C3C1=C2C1=C4CCCC1)C1C=C(O)C(=C=O)O1 Intermediate Fragment 
243 563.1812776241 O=C=C1OC([NH+](C#CC=NC2=C3C(=C(O)C(O)=C2O)C=C2CC=C4CCCC5=C4C2=C3C2=C5CCCC2)C=O)C=C1O
244 537.2020130681 O=C=C1OC(=[NH+]C#CC=NC2=C3C(=C(O)C(O)=C2O)C=C2CCC4CCCC5C6=C(CCCC6)C3=C2C45)C=C1O
245 535.1863630041 O=C=C1OC(=[NH+]C#CC=NC2=C3C(=C(O)C(O)=C2O)C=C2CCC4CCCC5=C4C2=C3C2=C5CCCC2)C=C1O
246 580.2078267201 NC(=C=CN(C=O)C1C=C(O)C(=C=O)O1)[NH+]=C1C(=O)C(O)=C(O)C2=C1C1=C3C(=C2)CCC2CCCC(=C32)C2=C1CCCC2 Intermediate Fragment 
247 552.2129121001 N=C(C#C[NH+]=C1C=C(O)C(=C=O)O1)N=C1C(=O)C(O)=C(O)C2=C1C1=C3C(=C2)CCC2CCCC(C4CCCCC14)C32
248 552.2129121001 NC(=C=C=[NH+]C(O)=C=C(O)C#CO)N=C1C(=O)C(O)=C(O)C2=C1C1=C3C(=C2)CCC2CCCC(C4=C1CCCC4)C32 Intermediate Fragment 
249 580.2078267201 O=C=NC(=C=CN=C1C=C(O)C(=C=O)O1)[NH+]=C1C(=O)C(O)=C(O)C2=C1C1=C3C(=C2)CCC2CCCC(C4CCCCC14)C32 Intermediate Fragment 
250 580.2078267201 C=C=C(N=C(O)N=C1C=C(O)C(=C=O)O1)[NH+]=C1C(=O)C(O)=C(O)C2=C1C1=C3C(=C2)CCC2CCCC(C4=C1CCCC4)C32 Intermediate Fragment 
251 580.2078267201 O=C=C(O)C(=[NH+]C1=NC(=O)N(C2C=C(O)C(=C=O)O2)C=C1)C1=C(C=O)C=C2CCC3CCCC4C5=C(CCCC5)C1=C2C34 Intermediate Fragment 
252 300.1190117161 O=C=C1OC(N2C=CC([NH2+]CC(O)CO)NC2O)C=C1O
253 302.1346617801 O=C=C1OC(N2CCC([NH2+]CC(O)CO)NC2O)C=C1O
254 552.2129121001 O=C=C1OC(N2C=CC([NH+]=C(C=O)C3=C(C=O)C=C4CCC5CCCC6C7=C(CCCC7)C3=C4C56)=NC2=O)C=C1O
255 550.1972620361 O=C=C1OC(N2C=CC([NH+]=C(C=O)C3=C(C=O)C=C4CCC5CCCC6=C5C4=C3C3=C6CCCC3)=NC2=O)C=C1O
256 520.1866973521 O=C=C1C=C2CCC3CCCC4=C3C2=C(C1=C=[NH+]C1=NC(=O)N(C2C=C(O)C(=C=O)O2)C=C1)C1=C4CCCC1
257 520.1866973521 O=C=C1C=C2CCC3CCCC4=C3C2=C(C1=C=[NH+]C1=NC(=O)N(C=C=C(O)C(=O)C=O)C=C1)C1=C4CCCC1 Intermediate Fragment 
258 518.1710472881 O=C=C1C=C2CC=C3CCCC4=C3C2=C(C1=C=[NH+]C1=NC(=O)N(C2C=C(O)C(=C=O)O2)C=C1)C1=C4CCCC1
259 580.2078267201 O=C=C(O)C1=C(C(C=O)=[NH+]C2=NC(=O)N(C3C=C(O)C(=C=O)O3)C=C2)C2=C3C(=C1)CCC1CCCC(C4=C2CCCC4)C31 Intermediate Fragment 
260 518.1710472881 O=C=C1OC(N2C=CC([NH+]=C(C=O)C3=CC=C4CC=C5C=CCC6=C5C4=C3C3=C6CCCC3)=NC2=O)C=C1O
261 490.1761326681 O=C=C1OC(N2C=CC([NH+]=C=C3C=CC4=CC=C5CCCC6=C5C4=C3C3=C6CCCC3)=NC2=O)C=C1O
262 520.1866973521 O=C=C1OC(N2C=CC([NH+]=C(C=O)C3=CC=C4CC=C5CCCC6=C5C4=C3C3=C6CCCC3)=NC2=O)C=C1O
263 520.1866973521 O=CC(=O)C(O)=C=CN1C=CC([NH+]=C(C=O)C2=CC=C3CC=C4CCCC5=C4C3=C2C2=C5CCCC2)=NC1=O Intermediate Fragment 
264 522.2023474161 O=C=C1OC(N2C=CC([NH+]=C(C=O)C3=CC=C4CCC5CCCC6=C5C4=C3C3=C6CCCC3)=NC2=O)C=C1O
265 524.2179974801 O=C=C1OC(N2C=CC([NH+]=C(C=O)C3=CC=C4CCC5CCCC6C7=C(CCCC7)C3=C4C56)=NC2=O)C=C1O
266 552.2129121001 O=C=C1OC(N2C=CC([NH+]=C=C3C(=C(O)C=O)C=C4CCC5CCCC6C7=C(CCCC7)C3=C4C56)=NC2=O)C=C1O
267 550.1972620361 O=C=C1OC(N2C=CC([NH+]=C=C3C(=C(O)C=O)C=C4CCC5CCCC6=C5C4=C3C3=C6CCCC3)=NC2=O)C=C1O
268 580.2078267201 O=C=C(O)C(O)=C1C=C2CCC3CCCC4C5=C(CCCC5)C(=C2C34)C1=C=[NH+]C1=NC(=O)N(C2C=C(O)C(=C=O)O2)C=C1 Intermediate Fragment 
269 522.2023474161 O=C=C1C=C2CCC3CCCC4C5=C(CCCC5)C(=C2C34)C1=C=[NH+]C1=NC(=O)N(C2C=C(O)C(=C=O)O2)C=C1
270 580.2078267201 O=C=C1OC(N2C=CC([NH+]=CC(=O)C(O)=C(O)C3=CC4=C5C(=C3)CCC3CCCC(=C53)C3=C4CCCC3)=NC2=O)C=C1O Intermediate Fragment 
271 580.2078267201 O=C=C(O)C(=O)C(=[NH+]C1=NC(=O)N(C2C=C(O)C(=C=O)O2)C=C1)C1=CC=C2CCC3CCCC4C5=C(CCCC5)C1=C2C34 Intermediate Fragment 
272 580.2078267201 CCC1=CC2=C(C(=[NH+]C3=NC(=O)N(C4C=C(O)C(=C=O)O4)C=C3)C(=O)C(O)=C2O)C2=C1C1=C(CCCC1)C1=C2CCCC1 Intermediate Fragment 
273 580.2078267201 CCCC1CCC2=CC3=C(C(=[NH+]C4=NC(=O)N(C5C=C(O)C(=C=O)O5)C=C4)C(=O)C(O)=C3O)C3=C2C1=CC1=C3CCCC1 Intermediate Fragment 
274 536.1452264641 O=C=C1OC(N2C=CC([NH+]=C3C(=O)C(O)=C(O)C4=C3C3=C5C(=CC6=C3CCCC6)C=CCC5=C4)=NC2=O)C=C1O
275 580.2078267201 CCCC1=C2CCCC3=CC4=C(C(=[NH+]C5=NC(=O)N(C6C=C(O)C(=C=O)O6)C=C5)C(=O)C(O)=C4O)C(=C32)C2=C1CCCC2 Intermediate Fragment 
276 580.2078267201 CCCC1=C(C)C2=C3C4=C1C1=C(C=C4CCC3CCC2)C(O)=C(O)C(=O)C1=[NH+]C1=NC(=O)N(C2C=C(O)C(=C=O)O2)C=C1 Intermediate Fragment 
277 552.1765265921 CC1=C(C)C2=C3C(=CC4=C2C(=[NH+]C2=NC(=O)N(C5C=C(O)C(=C=O)O5)C=C2)C(=O)C(O)=C4O)CCC2CCCC1=C32
278 580.2078267201 CCC1=C(CC)C2=C3C(=CC4=C2C(=[NH+]C2=NC(=O)N(C5C=C(O)C(=C=O)O5)C=C2)C(=O)C(O)=C4O)CCC2CCCC1=C32 Intermediate Fragment 
279 580.2078267201 CCCC1=C(C)C2=C3C(=CC4=C2C(=[NH+]C2=NC(=O)N(C5C=C(O)C(=C=O)O5)C=C2)C(=O)C(O)=C4O)CCC2CCCC1=C32 Intermediate Fragment 
280 580.2078267201 CCCCC1=CC2=C3C(=CC4=C2C(=[NH+]C2=NC(=O)N(C5C=C(O)C(=C=O)O5)C=C2)C(=O)C(O)=C4O)CCC2CCCC1=C32 Intermediate Fragment 
281 580.2078267201 O=C=C1OC(N2C=CC([NH+]=C3C(=O)C(O)=C(O)C4=C3C(C3=CCCCC3)=C3C(=C4)CCC4CCCC=C34)=NC2=O)C=C1O Intermediate Fragment 
