#In-silico ESI-MS/MS [M+H]+ Spectra
#PREDICTED BY CFM-ID 4.0.8
#SMILES=n1cnc2c(c1NC)N(C(N2[C@H]1C[C@H]([C@H](O1)CO)O)O)O
#InChiKey=JQYUBOZMUXRAPU-XHZDPASRSA-N
energy0
184.08290 33.49 47 87 69 83 74 79 61 52 67 50 (20.627 0.16885 0.02732 0.016349 0.0057177 0.0034145 0.0022942 0.001985 0.0013146 0.00131)
300.13025 100.00 0 140 128 198 224 136 142 225 158 113 126 111 127 135 124 (60.644 1.2851 0.074515 0.060303 0.049317 0.040491 0.036401 0.03399 0.03244 0.0036831 0.0032917 0.0027927 0.0014859 0.00068444 0.00027619)
energy1
99.04406 7.39 19 35 20 (1.6566 0.94454 0.6362)
166.07234 100.00 48 49 (24.019 19.79)
184.08290 76.10 47 87 83 67 74 52 61 69 50 79 (30.367 1.9524 0.28549 0.20544 0.19361 0.16468 0.082113 0.049779 0.020925 0.015857)
energy2
45.03349 7.21 23 (0.99113)
57.03349 17.25 32 (2.3717)
59.04914 19.36 175 (2.6626)
61.02841 16.93 161 (2.3279)
71.04914 14.01 147 (1.9267)
73.02841 11.73 165 28 (1.4868 0.12607)
75.04406 10.47 162 29 (1.3045 0.13466)
108.05562 6.53 78 (0.89745)
123.06652 31.58 42 (4.3431)
128.04545 14.97 53 (2.0584)
135.06652 6.25 157 (0.85947)
154.07234 18.07 46 (2.4846)
166.07234 100.00 48 49 (12.696 1.0555)
168.08799 24.35 91 92 (2.2993 1.0496)
170.06725 6.33 7 (0.87113)
170.10364 15.63 96 97 (1.9015 0.24753)
172.11929 10.54 101 (1.4491)
179.09274 9.59 177 (1.3192)
181.10839 8.63 181 (1.1868)
184.08290 67.79 47 83 74 87 69 52 61 67 79 50 (3.6236 1.8778 1.0673 0.97237 0.67908 0.43176 0.30746 0.14459 0.12204 0.095914)
194.06725 7.64 156 155 (0.62765 0.4225)
196.08290 6.95 154 153 (0.71031 0.24583)
198.09855 11.03 152 (1.5167)
210.09855 9.57 170 216 178 (1.1187 0.12048 0.077177)
212.07782 47.84 144 (6.5781)
212.10297 9.73 133 (1.3384)
212.11420 6.94 171 182 (0.86217 0.091915)
217.08190 5.82 119 (0.79985)
224.07782 6.23 206 (0.85736)
241.12952 27.01 130 (3.7145)

0 300.1302450961 C[NH2+]c1ncnc2c1N(O)C(O)N2C1CC(O)C(CO)O1
1 269.0880459361 OC1C=C(N2C3=NC=NC=C3N(O)C2O)OC1C[OH2+]
2 153.0407018201 ON1C2=CN=CN=C2N=C1[OH2+]
3 155.0563518841 ON1C2=CN=CN=C2NC1[OH2+]
4 271.1036960001 OC1CC(N2C3=NC=NC=C3N(O)C2O)OC1C[OH2+]
5 284.0989449681 [NH3+]C1=C2C(=NC=N1)N(C1=CC(O)C(CO)O1)C(O)N2O
6 168.0516008521 [NH3+]C1=C2C(=NC=N1)N=C(O)N2O
7 170.0672509161 [NH3+]C1=C2C(=NC=N1)NC(O)N2O
8 119.0702706321 OC1CCOC1C[OH2+]
9 101.0597059481 CC1OC=CC1[OH2+]
10 101.0597059481 [OH2+]CC1CC=CO1
11 119.0702706321 C=COC(CO)C[OH2+] Intermediate Fragment 
12 119.0702706321 OC=CC(O)CC[OH2+] Intermediate Fragment 
13 119.0702706321 C=CC(O)C(O)C[OH2+] Intermediate Fragment 
14 101.0597059481 C#CC(O)CC[OH2+]
15 117.0546205681 OC1C=COC1C[OH2+]
16 85.0284058201 [OH2+]C1=COC=C1
17 87.0440558841 [OH2+]C1C=COC1
18 89.0597059481 [OH2+]C1CCOC1
19 99.0440558841 CC1=C([OH2+])C=CO1
20 99.0440558841 [OH2+]CC1=CC=CO1
21 117.0546205681 C=C(O)C(=C[OH2+])OC Intermediate Fragment 
22 43.0178411361 C#C[OH2+]
23 45.0334912001 C=C[OH2+]
24 89.0597059481 C=C(O)CC[OH2+]
25 117.0546205681 C=COC(=CO)C[OH2+] Intermediate Fragment 
26 89.0597059481 C=C[OH+]CCO
27 47.0491412641 CC[OH2+]
28 73.0284058201 OC#CC[OH2+]
29 75.0440558841 OC=CC[OH2+]
30 91.0389705041 OC=C([OH2+])CO
31 117.0546205681 OC=C=COCC[OH2+] Intermediate Fragment 
32 57.0334912001 C#CC[OH2+]
33 117.0546205681 OC=C=C(O)CC[OH2+] Intermediate Fragment 
34 87.0440558841 C=C(O)C=C[OH2+]
35 99.0440558841 C#CC(O)=CC[OH2+]
36 117.0546205681 C=C=C(O)C(O)C[OH2+] Intermediate Fragment 
37 115.0389705041 OC1=C(C[OH2+])OC=C1
38 111.0076703761 [O+]#CC1=C(O)C=CO1
39 182.0672509161 C=[NH+]C1=C2C(=NC=N1)NC(O)N2O
40 164.0566862321 C=[NH+]C1=C2C(=NC=N1)N=CN2O
41 182.0672509161 C=[NH+]C1=CC(NC(O)=NO)=NC=N1 Intermediate Fragment 
42 123.0665226441 C=[NH+]C1=CC(N)=NC=N1
43 106.0399735481 C#[N+]C1=CC=NC=N1
44 182.0672509161 C=[NH+]C1=C(N(O)C=O)C(N)=NC=N1 Intermediate Fragment 
45 121.0508725801 C#[N+]C1=CC(N)=NC=N1
46 154.0723362961 C=[NH+]C1=C(NO)C(N)=NC=N1
47 184.0829009801 C[NH2+]C1=C2C(=NC=N1)NC(O)N2O
48 166.0723362961 C=[NH+]C1=C2C(=NC=N1)NCN2O
49 166.0723362961 C=[NH+]C1=C2NC(O)NC2=NC=N1
50 184.0829009801 C[NH+]=CC1=C(N=C=N)NC(O)N1O Intermediate Fragment 
51 157.0720019481 CN=C=C1C(=[NH2+])NC(O)N1O
52 184.0829009801 C[NH+]=CN=C=NC1=CN(O)C(O)N1 Intermediate Fragment 
53 128.0454528521 C=[NH+]C1=CN(O)C(O)=N1
54 126.0298027881 C#[N+]C1=CN(O)C(O)=N1
55 116.0454528521 [NH2+]=C1CN(O)C(O)=N1
56 69.0447245801 C#[N+]C=NC
57 82.0399735481 CN=C=[NH+]C#N
58 84.0556236121 CN=C[NH2+]C#N
59 143.0563518841 [NH+]#CN=C1CN(O)C(O)N1
60 141.0407018201 [NH+]#CN=C1CN(O)C(O)=N1
61 184.0829009801 C[NH+]=C(N=C=N)C1=CNC(O)N1O Intermediate Fragment 
62 157.0720019481 C=NC([NH3+])C1=CN=C(O)N1O
63 167.0563518841 C#[N+]C(=NC)C1=CN=C(O)N1O
64 101.0345538201 ON1C=CN=C1[OH2+]
65 140.0454528521 C[NH+]=C=C1C=NC(=O)N1O
66 142.0611029161 C[NH+]=C=C1CNC(=O)N1O
67 184.0829009801 C=NC([NH+]=C)=C1C(=N)NC(O)N1O Intermediate Fragment 
68 155.0563518841 CN=C=C1C(=[NH2+])N=C(O)N1O
69 184.0829009801 C=NC1=C(C(N)=[NH+]C)N(O)C(O)=N1 Intermediate Fragment 
70 155.0563518841 C=NC(=[NH2+])C1=CN=C(O)N1O
71 57.0447245801 C=NC=[NH2+]
72 55.0290745161 C=NC#[NH+]
73 167.0563518841 C=NC1=C(C=[N+]=C)N(O)C(O)=N1
74 184.0829009801 C=[NH+]C1=CC(NC(O)NO)=NC=N1 Intermediate Fragment 
75 153.0770873281 C=[NH+]C1=CC(NCO)=NC=N1
76 151.0614372641 C=[NH+]C1=CC(N=CO)=NC=N1
77 110.0712736761 C[NH2+]C1=CC=NC=N1
78 108.0556236121 C=[NH+]C1=CC=NC=N1
79 184.0829009801 C=[NH+]C1=C(N(O)C(N)O)C=NC=N1 Intermediate Fragment 
80 139.0614372641 C=[NH+]C1=C(NO)C=NC=N1
81 141.0770873281 C[NH2+]C1=C(NO)C=NC=N1
82 167.0563518841 C=[NH+]C1=C(N(O)C=O)C=NC=N1
83 184.0829009801 C=[NH+]C1=C(N(O)CO)C(N)=NC=N1 Intermediate Fragment 
84 64.0393048521 OC[NH2+]O
85 62.0236547881 OC=[NH+]O
86 125.0821727081 C[NH2+]C1=CC(N)=NC=N1
87 184.0829009801 C=[NH+]C1=C(NO)C(NCO)=NC=N1 Intermediate Fragment 
88 156.0879863601 C[NH2+]C1=C(NO)C(N)=NC=N1
89 137.0457872001 C=[NH+]C1=C(N=O)C=NC=N1
90 186.0985510441 C[NH2+]C1N=CN=C2NC(O)N(O)C21
91 168.0879863601 C[NH2+]C1=C2C(=NC=N1)NCN2O
92 168.0879863601 C[NH2+]C1=C2NC(O)NC2=NC=N1
93 186.0985510441 C[NH2+]C(N=C=N)C1=CNC(O)N1O Intermediate Fragment 
94 186.0985510441 C[NH2+]C1=C(N(O)CO)C(N)=NC=N1 Intermediate Fragment 
95 188.1142011081 C[NH2+]C1N=CNC2NC(O)N(O)C21
96 170.1036364241 C[NH2+]C1N=CN=C2NCN(O)C21
97 170.1036364241 C[NH2+]C1N=CN=C2NC(O)NC21
98 188.1142011081 C[NH2+]C1N=CN=C(N)C1N(O)CO Intermediate Fragment 
99 188.1142011081 C[NH2+]C1N=CN=C(NCO)C1NO Intermediate Fragment 
100 190.1298511721 C[NH2+]C1NCNC2NC(O)N(O)C21
101 172.1192864881 C[NH2+]C1N=CNC2NCN(O)C21
102 268.1040303481 C=[NH+]C1=C2C(=NC=N1)N(C1CC(O)CO1)C(O)N2O
103 270.1196804121 C[NH2+]C1=C2C(=NC=N1)N(C1CC(O)CO1)C(O)N2O
104 272.1353304761 C[NH2+]C1N=CN=C2C1N(O)C(O)N2C1CC(O)CO1
105 282.1196804121 C=[NH+]C1=C2C(=NC=N1)N(C1CC(O)C(C)O1)C(O)N2O
106 282.1196804121 C=[NH+]C1=C2C(=NC=N1)N(C(O)=CC(O)CC)C(O)N2O Intermediate Fragment 
107 282.1196804121 C=[NH+]C1=C2C(=NC=N1)N(C1CCC(CO)O1)C(O)N2O
108 282.1196804121 C=[NH+]C1=C2C(=NC=N1)N(C(O)=CCCCO)C(O)N2O Intermediate Fragment 
109 282.1196804121 C=[NH+]C1=C2C(=NC=N1)N(C1CC(O)C(CO)O1)CN2O
110 282.1196804121 C=[NH+]C1=C2NC(O)N(C3CC(O)C(CO)O3)C2=NC=N1
111 300.1302450961 C[NH+]=CC1=C(N=C=N)N(C2CC(O)C(CO)O2)C(O)N1O Intermediate Fragment 
112 273.1193460641 CN=C=C1C(=[NH2+])N(C2CC(O)C(CO)O2)C(O)N1O
113 300.1302450961 C[NH+]=CN=C=NC1=CN(O)C(O)N1C1CC(O)C(CO)O1 Intermediate Fragment 
114 246.1084470321 C=[NH+]C1=CN(O)C(O)N1C1CC(O)C(CO)O1
115 244.0927969681 C=[NH+]C1=CN(O)C(O)N1C1=CC(O)C(CO)O1
116 242.0771469041 C=[NH+]C1=CN(O)C(O)N1C1=CC(O)=C(CO)O1
117 240.0614968401 C=[NH+]C1=CN(O)C(O)N1C1=CC(O)=C(C=O)O1
118 232.0927969681 [NH2+]=C1CN(O)C(O)N1C1=CC(O)C(CO)O1
119 217.0818979361 OC1C=C(N2C=CN(O)C2O)OC1C[OH2+]
120 259.1036960001 [NH+]#CN=C1CN(O)C(O)N1C1CC(O)C(CO)O1
121 215.0662478721 OC1=C(C[OH2+])OC(N2C=CN(O)C2O)=C1
122 259.1036960001 [NH+]#CN=C(C=NO)N(CO)C1CC(O)C(CO)O1 Intermediate Fragment 
123 259.1036960001 [NH+]#CN=C1CN(O)C(O)N1C=CC(O)C(O)CO Intermediate Fragment 
124 300.1302450961 C[NH+]=C(N=C=N)C1=CN(C2CC(O)C(CO)O2)C(O)N1O Intermediate Fragment 
125 273.1193460641 CN=C([NH3+])C1=CN(C2=CC(O)C(CO)O2)C(O)N1O
126 300.1302450961 C=NC([NH+]=C)=C1C(=N)N(C2CC(O)C(CO)O2)C(O)N1O Intermediate Fragment 
127 300.1302450961 C=NC1=C(C(N)=[NH+]C)N(O)C(O)N1C1=CC(O)C(CO)O1 Intermediate Fragment 
128 300.1302450961 C=[NH+]C1=CC(N(C(O)NO)C2CC(O)C(CO)O2)=NC=N1 Intermediate Fragment 
129 267.1087813801 C=[NH+]C1=CC(N(CO)C2=CC(O)C(CO)O2)=NC=N1
130 241.1295168241 C[NH2+]C1=CC(NC2CC(O)C(CO)O2)=NC=N1
131 239.1138667601 C=[NH+]C1=CC(NC2CC(O)C(CO)O2)=NC=N1
132 239.1138667601 C=NC(=CC(=N)N=C1CC(O)C(CO)O1)[NH+]=C Intermediate Fragment 
133 212.1029677281 C=NC#CC(=[NH2+])NC1CC(O)C(CO)O1
134 239.1138667601 C=[NH+]C1=CC(N=C(CCO)OCCO)=NC=N1 Intermediate Fragment 
135 300.1302450961 C=[NH+]C1=C(N(O)C(O)NC2CC(O)C(CO)O2)C=NC=N1 Intermediate Fragment 
136 300.1302450961 C=[NH+]C1=C(N(O)CO)C(NC2CC(O)C(CO)O2)=NC=N1 Intermediate Fragment 
137 237.0982166961 C=[NH+]C1=CC(N=C2CC(O)C(CO)O2)=NC=N1
138 270.1196804121 C=[NH+]C1=C(NO)C(NC2CC(O)C(CO)O2)=NC=N1
139 272.1353304761 C[NH2+]C1=C(NO)C(NC2CC(O)C(CO)O2)=NC=N1
140 300.1302450961 C=[NH+]C1=C(NO)C(N(CO)C2CC(O)C(CO)O2)=NC=N1 Intermediate Fragment 
141 269.1244314441 C=[NH+]C1=CC(N(CO)C2CC(O)C(CO)O2)=NC=N1
142 300.1302450961 C=[NH+]C1=C2C(=NC=N1)N(COC(CO)C(C)O)C(O)N2O Intermediate Fragment 
143 214.0934656641 C[NH2+]C1=C2C(=NC=N1)N(CO)C(O)N2O
144 212.0778156001 C=[NH+]C1=C2C(=NC=N1)N(CO)C(O)N2O
145 69.0334912001 C#CC(=C)[OH2+]
146 69.0334912001 C#CC=C[OH2+]
147 71.0491412641 C=CC(=C)[OH2+]
148 91.0753560121 CC(O)CC[OH2+]
149 73.0647913281 C=C([OH2+])CC
150 202.1298511721 C[NH2+]C1N=CNC2C1N(O)C(O)N2C
151 200.1142011081 C[NH2+]C1N=CN=C2C1N(O)C(O)N2C
152 198.0985510441 C[NH2+]C1=C2C(=NC=N1)N(C)C(O)N2O
153 196.0829009801 C=[NH+]C1=C2C(=NC=N1)N(C)C(O)N2O
154 196.0829009801 C=NC1=NC=NC([NH+]=C)=C1N(O)CO Intermediate Fragment 
155 194.0672509161 C=[NH+]C1=C2C(=NC=N1)N(C)C(=O)N2O
156 194.0672509161 C=NC1=NC=NC([NH+]=C)=C1N(O)C=O Intermediate Fragment 
157 135.0665226441 C=NC1=NC=NC([NH+]=C)=C1
158 300.1302450961 C=[NH+]C1=C2C(=NC=N1)N(CCC(O)C(O)CO)C(O)N2O Intermediate Fragment 
159 107.0702706321 CC(O)C([OH2+])CO
160 93.0546205681 OCC([OH2+])CO
161 61.0284058201 OC=C[OH2+]
162 75.0440558841 CC([OH2+])=CO
163 31.0178411361 C=[OH+]
164 59.0127557561 OC#C[OH2+]
165 73.0284058201 CC([OH2+])=C=O
166 89.0233204401 O=CC([OH2+])=CO
167 71.0127557561 OC#CC=[OH+]
168 71.0127557561 [CH2+]C(O)=C=O
169 208.0829009801 C=CN1C2=NC=NC([NH+]=C)=C2N(O)C1O
170 210.0985510441 C=[NH+]C1=C2C(=NC=N1)N(CC)C(O)N2O
171 212.1142011081 CCN1C2=NC=NC([NH2+]C)=C2N(O)C1O
172 214.1298511721 CCN1C2=NC=NC([NH2+]C)C2N(O)C1O
173 216.1455012361 CCN1C2NC=NC([NH2+]C)C2N(O)C1O
174 238.0934656641 C=[NH+]C1=C2C(=NC=N1)N(C=CCO)C(O)N2O
175 59.0491412641 C=CC[OH2+]
176 238.0934656641 C=[NH+]C1=C(N(O)CO)C(N=C=CCO)=NC=N1 Intermediate Fragment 
177 179.0927373921 C=[NH+]C1=CC(N=CCCO)=NC=N1
178 210.0985510441 C=[NH+]C1=C(NO)C(N=CCCO)=NC=N1
179 240.1091157281 C=[NH+]C1=C2C(=NC=N1)N(CCCO)C(O)N2O
180 240.1091157281 C=[NH+]C1=C(N(O)CO)C(N=CCCO)=NC=N1 Intermediate Fragment 
181 181.1083874561 C=[NH+]C1=CC(NCCCO)=NC=N1
182 212.1142011081 C=[NH+]C1=C(NO)C(NCCCO)=NC=N1
183 240.1091157281 C=[NH+]C1=C(NO)C(N(C=CCO)CO)=NC=N1 Intermediate Fragment 
184 242.1247657921 C[NH2+]C1=C2C(=NC=N1)N(CCCO)C(O)N2O
185 224.1142011081 C=[NH+]C1=C2C(=NC=N1)N(CCC)C(O)N2O
186 224.1142011081 C=[NH+]C1=C2NC(O)N(CCCO)C2=NC=N1
187 242.1247657921 C=[NH+]C1=C(N(O)CO)C(NCCCO)=NC=N1 Intermediate Fragment 
188 244.1404158561 C[NH2+]C1N=CN=C2C1N(O)C(O)N2CCCO
189 282.1196804121 C=[NH+]C1=C2C(=NC=N1)N(C=CC(O)CCO)C(O)N2O
190 103.0753560121 C=CC(O)CC[OH2+]
191 77.0597059481 OCCC[OH2+]
192 236.0778156001 C=[NH+]C1=C2C(=NC=N1)N(C#CCO)C(O)N2O
193 264.1091157281 C=[NH+]C1=C2C(=NC=N1)N(C#CC(O)CC)C(O)N2O
194 264.1091157281 C=[NH+]C1=C2C(=NC=N1)N(C#CCCCO)C(O)N2O
195 282.1196804121 C=[NH+]C1=C(N(O)CO)C(N=C=CC(O)CCO)=NC=N1 Intermediate Fragment 
196 223.1189521401 C=[NH+]C1=CC(N=CCC(O)CCO)=NC=N1
197 254.1247657921 C=[NH+]C1=C(NO)C(N=CCC(O)CCO)=NC=N1
198 300.1302450961 C=[NH+]C1=C2C(=NC=N1)N(C(O)CC(O)CCO)C(O)N2O Intermediate Fragment 
199 210.0621655361 C=[NH+]C1=C2C(=NC=N1)N(CO)C(=O)N2O
200 210.0621655361 C=[NH+]C1=CC(N(C=O)C(O)=NO)=NC=N1 Intermediate Fragment 
201 210.0621655361 C=[NH+]C1=C(N(O)C=O)C(N=CO)=NC=N1 Intermediate Fragment 
202 182.0672509161 C=[NH+]C1=C(NO)C(N=CO)=NC=N1
203 210.0621655361 C=[NH+]C1=C(N=O)C(N(C=O)CO)=NC=N1 Intermediate Fragment 
204 216.1091157281 C[NH2+]C1N=CN=C2C1N(O)C(O)N2CO
205 55.0178411361 [CH2+]C#CO
206 224.0778156001 C=[NH+]C1=C2C(=NC=N1)N(C(=C)O)C(O)N2O
207 226.0934656641 C=[NH+]C1=C2C(=NC=N1)N(C(C)O)C(O)N2O
208 226.0934656641 C=C(O)N1C(N=C=NC=[NH+]C)=CN(O)C1O Intermediate Fragment 
209 226.0934656641 C=[NH+]C1=CC(N(C(O)=NO)C(C)O)=NC=N1 Intermediate Fragment 
210 193.0720019481 C=[NH+]C1=CC(N(C=O)C(=C)O)=NC=N1
211 167.0927373921 C=[NH+]C1=CC(NC(C)O)=NC=N1
212 165.0770873281 C=[NH+]C1=CC(N=C(C)O)=NC=N1
213 226.0934656641 C=[NH+]C1=C(N(O)CO)C(N=C(C)O)=NC=N1 Intermediate Fragment 
214 226.0934656641 C=[NH+]C1=C(NO)C(N(CO)C(=C)O)=NC=N1 Intermediate Fragment 
215 228.1091157281 C[NH2+]C1=C2C(=NC=N1)N(C(C)O)C(O)N2O
216 210.0985510441 C=[NH+]C1=C2NC(O)N(C(C)O)C2=NC=N1
217 228.1091157281 C=[NH+]C1=C(N(O)CO)C(NC(C)O)=NC=N1 Intermediate Fragment 
218 228.1091157281 C=[NH+]C1=C(NO)C(N(CO)C(C)O)=NC=N1 Intermediate Fragment 
219 230.1247657921 C[NH2+]C1N=CN=C2C1N(O)C(O)N2C(C)O
220 232.1404158561 C[NH2+]C1N=CNC2C1N(O)C(O)N2C(C)O
221 254.0883802841 C=[NH+]C1=C2C(=NC=N1)N(C(O)=CCO)C(O)N2O
222 256.1040303481 C=[NH+]C1=C2C(=NC=N1)N(C(O)CCO)C(O)N2O
223 258.1196804121 C[NH2+]C1=C2C(=NC=N1)N(C(O)CCO)C(O)N2O
224 300.1302450961 C=[NH+]C1=C2C(=NC=N1)N(C(CCO)OCCO)C(O)N2O Intermediate Fragment 
225 300.1302450961 C=[NH+]C1=C2C(=NC=N1)N(C(C)OC(CO)CO)C(O)N2O Intermediate Fragment 
226 298.1145950321 C=[NH+]C1=C2C(=NC=N1)N(C1CC(O)C(CO)O1)C(O)N2O
