#In-silico ESI-MS/MS [M+H]+ Spectra
#PREDICTED BY CFM-ID 4.0.8
#SMILES=n12c(nc3c(c1=O)ncn3[C@@H]1O[C@H](CO)[C@@H](C1)O)nccc2
#InChiKey=QZDHOBJINVXQCJ-IWSPIJDZSA-N
energy0
188.05669 100.00 14 17 30 21 15 22 23 27 (93.544 1.1728 0.44274 0.07456 0.018931 0.015889 0.0065501 0.0027372)
energy1
188.05669 100.00 14 30 17 15 21 23 27 22 (89.579 0.79778 0.61014 0.27855 0.18305 0.053424 0.04361 0.037377)
energy2
45.03349 6.58 108 (3.3132)
57.03349 12.66 8 (6.3713)
71.04914 1.78 147 148 (0.6194 0.27461)
81.04472 1.84 19 (0.92395)
148.05054 1.84 81 84 82 (0.54915 0.25417 0.12378)
160.06177 3.06 16 (1.5412)
161.04579 1.76 31 (0.88533)
188.05669 100.00 14 17 15 22 21 23 30 27 (29.198 5.2385 4.8365 3.9691 3.2693 2.209 0.99048 0.62698)
194.10364 3.02 34 35 36 (1.1465 0.20316 0.17151)
212.05669 4.13 98 (2.0774)
214.07234 7.04 51 (3.5451)
216.05160 2.63 114 (1.3242)
218.06725 2.33 115 (1.1705)
236.11420 3.52 124 (1.7728)
244.08290 6.00 133 48 105 106 (1.9198 0.69443 0.20446 0.20087)
268.08290 2.44 99 47 45 (0.69063 0.36929 0.16632)

0 304.1040303481 OCC1OC(n2cnc3c(=[OH+])n4cccnc4nc32)CC1O
1 286.0934656641 OC1=CC(N2C=NC3=C2N=C2N=CCCN2C3)OC1=C=[OH+]
2 172.0617716121 C1=C[NH+]2C=C3N=CN=C3N=C2N=C1
3 117.0546205681 OC1CCOC1=C[OH2+]
4 99.0440558841 C=C1OCC=C1[OH2+]
5 99.0440558841 [OH+]=C=C1CCCO1
6 117.0546205681 CCC(O)C(=O)C=[OH+] Intermediate Fragment 
7 99.0440558841 CC=C(O)C#C[OH2+]
8 57.0334912001 CC#C[OH2+]
9 117.0546205681 O=CCC(O)C=C[OH2+] Intermediate Fragment 
10 117.0546205681 OCCCOC#C[OH2+] Intermediate Fragment 
11 117.0546205681 CCOC(=C=[OH+])CO Intermediate Fragment 
12 115.0389705041 OC1CCOC1=C=[OH+]
13 111.0076703761 O=C1C=COC1=C=[OH+]
14 188.0566862321 [OH+]=C1C2=C(N=C3N=CC=CN13)NC=N2
15 188.0566862321 [O+]#CN1C=CC=NC1=NC1=CN=CN1 Intermediate Fragment 
16 160.0617716121 C1=CN=C([NH+]=C2C=NC=N2)N=C1
17 188.0566862321 [OH+]=C=C1N=CNC1=NC1=NC=CC=N1 Intermediate Fragment 
18 108.0192381041 N=C1N=CN=C1C#[O+]
19 81.0447245801 C1=C[NH+]=CN=C1
20 186.0410361681 [O+]#CC1=NC=NC1=NC1=NC=CC=N1
21 188.0566862321 N=C=NC1=CC(=[OH+])N2C=CC=NC2=N1 Intermediate Fragment 
22 188.0566862321 N=C=NC1=CN=C2N=CC=CN2C1=[OH+] Intermediate Fragment 
23 188.0566862321 C=C=CN1C(=N)N=C2N=CN=C2C1=[OH+] Intermediate Fragment 
24 172.0253861041 [C+]#CN1C(=N)N=C2N=CN=C2C1=O
25 162.0410361681 [CH2+]N1C(=N)N=C2N=CN=C2C1=O
26 186.0410361681 [C+]#CCN1C(=N)N=C2N=CN=C2C1=O
27 188.0566862321 C=C=C=NC1=NC([OH2+])=C2N=CNC2=N1 Intermediate Fragment 
28 135.0301371361 [OH+]=C1N=CN=C2N=CN=C12
29 137.0457872001 [OH+]=C1N=CN=C2NCN=C12
30 188.0566862321 N=C=C=CN1C=NC2=C(N=CN2)C1=[OH+] Intermediate Fragment 
31 161.0457872001 C#CN1C=NC2=C(N=CN2)C1=[OH+]
32 190.0723362961 [OH+]=C1C2=C(N=C3N=CCCN13)NC=N2
33 192.0879863601 [OH+]=C1C2=C(N=C3NCCCN13)NC=N2
34 194.1036364241 [OH+]=C1C2=C(N=C3NCCCN13)NCN2
35 194.1036364241 N=C1NC=NC1=C([OH2+])N1C=NCCC1 Intermediate Fragment 
36 194.1036364241 C=NC1=C(N)N=C2NCCCN2C1=[OH+] Intermediate Fragment 
37 272.0778156001 OC1=COC(N2C=NC3=C2N=C2N=CC=CN2C3=[OH+])C1
38 254.0672509161 [OH+]=C1C2=C(N=C3N=CC=CN13)N(C1=CC=CO1)C=N2
39 272.0778156001 O=C=C(O)CCN1C=NC2=C1N=C1N=CC=CN1C2=[OH+] Intermediate Fragment 
40 274.0934656641 OC1=COC(N2C=NC3=C2N=C2N=CCCN2C3=[OH+])C1
41 256.0829009801 [OH+]=C1C2=C(N=C3N=CC=CN13)N(C1CC=CO1)C=N2
42 274.0934656641 C=C(O)CC(=O)N1C=NC2=C1N=C1N=CCCN1C2=[OH+] Intermediate Fragment 
43 276.1091157281 OC1=COC(N2C=NC3=C2N=C2NCCCN2C3=[OH+])C1
44 286.0934656641 C=C1OC(N2C=NC3=C2N=C2N=CCCN2C3=[OH+])C=C1O
45 268.0829009801 C=C1C=CC(N2C=NC3=C2N=C2N=CC=CN2C3=[OH+])O1
46 286.0934656641 CC(=O)C(O)=CCN1C=NC2=C1N=C1N=CC=CN1C2=[OH+] Intermediate Fragment 
47 268.0829009801 C#CC(O)=CCN1C=NC2=C1N=C1N=CC=CN1C2=[OH+]
48 244.0829009801 OC#CCN1C=NC2=C1N=C1N=CCCN1C2=[OH+]
49 242.0672509161 OC#CCN1C=NC2=C1N=C1N=CC=CN1C2=[OH+]
50 216.0879863601 CCN1C=NC2=C1N=C1N=CC=CN1C2=[OH+]
51 214.0723362961 C=CN1C=NC2=C1N=C1N=CC=CN1C2=[OH+]
52 286.0934656641 C=C(C=O)OC(C)N1C=NC2=C1N=C1N=CC=CN1C2=[OH+] Intermediate Fragment 
53 232.0829009801 CC(=O)N1C=NC2=C1N=C1N=CCCN1C2=[OH+]
54 286.0934656641 C#COC(C=C=O)N1C=NC2=C1N=C1NCCCN1C2=[OH+] Intermediate Fragment 
55 260.0778156001 O=C(C#CO)N1C=NC2=C1N=C1NCCCN1C2=[OH+]
56 286.0934656641 C#CC(O)=CC(=O)N1C=NC2=C1N=C1NCCCN1C2=[OH+] Intermediate Fragment 
57 304.1040303481 N=C1NCCCN1C(=[OH+])C1=CN(C2C=C(O)C(=C=O)O2)C=N1 Intermediate Fragment 
58 287.0774812521 O=C=C1OC(N2C=NC(C(=[OH+])N3C=NC=CC3)=C2)C=C1O
59 183.0764186321 OC1CC(N2C=CN=C2)OC1=C[OH2+]
60 96.0556236121 [NH3+]C1=NC=CC=N1
61 209.0556831881 O=C=C1OC(N2C=NC(C=[OH+])=C2)CC1O
62 181.0607685681 OC1CC(N2C=CN=C2)OC1=C=[OH+]
63 304.1040303481 O=C=C1OC(N2C=NC=C2N=C2NCCCN2C=[OH+])C=C1O Intermediate Fragment 
64 276.1091157281 O=C=C1OC(N2CN=CC2=[NH+]C2=NCCCN2)C=C1O
65 276.1091157281 O=C(C=C(O)C#CO)N1CN=CC1=[NH+]C1=NCCCN1 Intermediate Fragment 
66 304.1040303481 O=C=C1OC(N2C=NC(=C=[OH+])C2=NC2=NCCCN2)CC1O Intermediate Fragment 
67 304.1040303481 N=C1C(=C([OH2+])N2C=NCCC2)N=CN1C1C=C(O)C(=C=O)O1 Intermediate Fragment 
68 194.0560175361 [NH2+]=C1C=NCN1C1CC(=O)C(=C=O)O1
69 82.0399735481 [NH2+]=C1C=NC=N1
70 196.0716676001 [NH2+]=C1C=NCN1C1CC(O)C(=C=O)O1
71 196.0716676001 [NH2+]=C1C=NCN1CC=C(O)C(=O)C=O Intermediate Fragment 
72 83.0603746441 C1=NC=[NH+]CC1
73 224.0665822201 [NH2+]=C1C(=C=O)N=CN1C1CC(O)C(=CO)O1
74 110.0348881681 [NH2+]=C1N=CN=C1C=O
75 304.1040303481 N=CN(C1=CC(=[OH+])N2CCCNC2=N1)C1C=C(O)C(=C=O)O1 Intermediate Fragment 
76 287.0774812521 C[NH+](C1=CC(=O)N2C=CC=NC2=N1)C1C=C(O)C(=C=O)O1
77 287.0774812521 C[NH+](C=C=C(O)C(=O)C=O)C1=CC(=O)N2C=CC=NC2=N1 Intermediate Fragment 
78 277.0931313161 O=C=C1OC(=[NH+]C2=CC(=O)N3CCCNC3=N2)CC1O
79 152.0818383601 [OH+]=C1C=CN=C2NCCCN12
80 150.0661882961 [OH+]=C1C=CN=C2N=CCCN12
81 148.0505382321 [OH+]=C1C=CN=C2N=CC=CN12
82 148.0505382321 C=CN=C1N=CC=CN1C#[O+] Intermediate Fragment 
83 120.0556236121 C=C=[NH+]C1=NC=CC=N1
84 148.0505382321 [OH+]=C=C=C=NC1=NCCC=N1 Intermediate Fragment 
85 118.0399735481 [CH+]=C=NC1=NC=CC=N1
86 153.0294684401 [NH+]#CN=C1CC(O)C(=C=O)O1
87 43.0290745161 [NH+]#CN
88 155.0451185041 [NH+]#CN=C1CC(O)C(=CO)O1
89 304.1040303481 O=C=C1OC(N=C=NC2=CN=C3NCCCN3C2=[OH+])CC1O Intermediate Fragment 
90 142.0498695361 C=[NH+]C1CC(O)C(=C=O)O1
91 140.0342194721 C=[NH+]C1C=C(O)C(=C=O)O1
92 304.1040303481 C=NC1=C(N=C2CC(O)C(=C=O)O2)N=C2NCCCN2C1=[OH+] Intermediate Fragment 
93 175.0614372641 C=[NH+]C1=CN=C2N=CC=CN2C1=O
94 173.0457872001 C#[N+]C1=CN=C2N=CC=CN2C1=O
95 304.1040303481 CN(C1=C(N)C(=[OH+])N2CCC=NC2=N1)C1C=C(O)C(=C=O)O1 Intermediate Fragment 
96 304.1040303481 O=CC(=O)C(O)=CCN1C=NC2=C1N=C1NCCCN1C2=[OH+] Intermediate Fragment 
97 286.0934656641 OC#CC(O)=CCN1C=NC2=C1N=C1N=CCCN1C2=[OH+]
98 212.0566862321 C#CN1C=NC2=C1N=C1N=CC=CN1C2=[OH+]
99 268.0829009801 OC#CC#CCN1C=NC2=C1N=C1N=CCCN1C2=[OH+]
100 248.1142011081 OC=CCN1C=NC2=C1N=C1NCCCN1C2=[OH+]
101 246.0985510441 OC#CCN1C=NC2=C1N=C1NCCCN1C2=[OH+]
102 228.0879863601 C#CCN1C=NC2=C1N=C1N=CCCN1C2=[OH+]
103 226.0723362961 C#CCN1C=NC2=C1N=C1N=CC=CN1C2=[OH+]
104 200.0566862321 [CH2+]N1C=NC2=C1N=C1N=CC=CN1C2=O
105 244.0829009801 N=C1N=CC=CN1C(=[OH+])C1=CN(CC#CO)C=N1 Intermediate Fragment 
106 244.0829009801 N=C1C(=C(O)N2C=NC=CC2)N=CN1[CH+]C#CO Intermediate Fragment 
107 63.0440558841 OCC[OH2+]
108 45.0334912001 C=C[OH2+]
109 220.1192864881 CCN1C=NC2=C1N=C1NCCCN1C2=[OH+]
110 218.1036364241 CCN1C=NC2=C1N=C1N=CCCN1C2=[OH+]
111 216.0879863601 C#CN(C)C1=C(N)C(=[OH+])N2C=CC=NC2=N1 Intermediate Fragment 
112 91.0389705041 OCC(=[OH+])CO
113 304.1040303481 C=C(O)C(=C=O)OCN1C=NC2=C1N=C1NCCCN1C2=[OH+] Intermediate Fragment 
114 216.0516008521 O=CN1C=NC2=C1N=C1N=CC=CN1C2=[OH+]
115 218.0672509161 O=CN1C=NC2=C1N=C1N=CCCN1C2=[OH+]
116 304.1040303481 CC(OC(=C=O)C=O)N1C=NC2=C1N=C1NCCCN1C2=[OH+] Intermediate Fragment 
117 75.0440558841 OCC=C[OH2+]
118 73.0284058201 OCC#C[OH2+]
119 228.0516008521 [CH2+]C(=O)N1C=NC2=C1N=C1N=CC=CN1C2=O
120 230.0672509161 CC(=O)N1C=NC2=C1N=C1N=CC=CN1C2=[OH+]
121 232.0829009801 CC(=O)N1C=NC(C(=[OH+])N2C=CC=NC2=N)=C1 Intermediate Fragment 
122 232.0829009801 CC(=O)N(C=N)C1=CC(=[OH+])N2C=CC=NC2=N1 Intermediate Fragment 
123 234.0985510441 CC(=O)N1C=NC2=C1N=C1NCCCN1C2=[OH+]
124 236.1142011081 CC(O)N1C=NC2=C1N=C1NCCCN1C2=[OH+]
125 272.0778156001 CC(OC#CO)N1C=NC2=C1N=C1N=CC=CN1C2=[OH+]
126 274.0934656641 CC(OC#CO)N1C=NC2=C1N=C1N=CCCN1C2=[OH+]
127 276.1091157281 CC(OC#CO)N1C=NC2=C1N=C1NCCCN1C2=[OH+]
128 304.1040303481 OC#COC(C=CO)N1C=NC2=C1N=C1NCCCN1C2=[OH+] Intermediate Fragment 
129 47.0491412641 CC[OH2+]
130 29.0385765801 C=[CH3+]
131 258.0621655361 O=C(C#CO)N1C=NC2=C1N=C1N=CCCN1C2=[OH+]
132 262.0934656641 O=C(C=CO)N1C=NC2=C1N=C1NCCCN1C2=[OH+]
133 244.0829009801 C#CC(=O)N1C=NC2=C1N=C1NCCCN1C2=[OH+]
134 262.0934656641 OC#COCN1C=NC2=C1N=C1NCCCN1C2=[OH+]
135 260.0778156001 OC#COCN1C=NC2=C1N=C1N=CCCN1C2=[OH+]
136 258.0621655361 OC#COCN1C=NC2=C1N=C1N=CC=CN1C2=[OH+]
137 304.1040303481 O=C(CC(O)C#CO)N1C=NC2=C1N=C1NCCCN1C2=[OH+] Intermediate Fragment 
138 68.9971056921 [O+]#CC#CO
139 41.0021910721 [C+]#CO
140 71.0127557561 O=CC#C[OH2+]
141 43.0178411361 C#C[OH2+]
142 220.0829009801 O=CN1C=NC2=C1N=C1NCCCN1C2=[OH+]
143 214.0359507881 O=C1C2=C(N=C3N=CC=CN13)N(C#[O+])C=N2
144 87.0440558841 CC(O)C#C[OH2+]
145 69.0334912001 C=CC#C[OH2+]
146 89.0597059481 CC(O)C=C[OH2+]
147 71.0491412641 C#CC(C)[OH2+]
148 71.0491412641 CCC#C[OH2+]
149 91.0753560121 CC(O)CC[OH2+]
150 73.0647913281 C=CC(C)[OH2+]
151 73.0647913281 CCC=C[OH2+]
152 302.0883802841 O=C(C=C(O)C#CO)N1C=NC2=C1N=C1NCCCN1C2=[OH+]
153 304.1040303481 CCCN1C(=[OH+])C2=C(N=C1N)N(C1C=C(O)C(=C=O)O1)C=N2 Intermediate Fragment 
154 304.1040303481 CCN1C(=[OH+])C2=C(N=C1NC)N(C1C=C(O)C(=C=O)O1)C=N2 Intermediate Fragment 
155 273.0618311881 C=CN1C=NC2=C(N=CN2C2C=C(O)C(=C=O)O2)C1=[OH+]
156 277.0931313161 CCN1C=NC2=C(N=CN2C2CC(O)C(=C=O)O2)C1=[OH+]
157 278.0883802841 C[NH2+]C1=NC(O)=C2N=CN(C3CC(O)C(=C=O)O3)C2=N1
158 304.1040303481 CCNC1=NC2=C(N=CN2C2C=C(O)C(=C=O)O2)C(=[OH+])N1C Intermediate Fragment 
159 259.0461811241 [CH2+]N1C=NC2=C(N=CN2C2C=C(O)C(=C=O)O2)C1=O
160 149.0457872001 [CH2+]N1C=NC2=C(N=CN2)C1=O
161 261.0618311881 CN1C=NC2=C(N=CN2C2C=C(O)C(=C=O)O2)C1=[OH+]
162 263.0774812521 CN1C=NC2=C(N=CN2C2CC(O)C(=C=O)O2)C1=[OH+]
163 278.0883802841 CN1C(=O)C2=C(N=C1[NH3+])N(C1CC(O)C(=C=O)O1)C=N2
164 304.1040303481 CCCNC1=NC([OH2+])=C2N=CN(C3C=C(O)C(=C=O)O3)C2=N1 Intermediate Fragment 
165 251.0774812521 OC=C1OC(N2C=NC3=C([OH2+])N=CN=C32)CC1O
166 253.0931313161 OCC1OC(N2C=NC3=C([OH2+])N=CN=C32)CC1O
167 304.1040303481 NCCCN1C=NC2=C(N=CN2C2C=C(O)C(=C=O)O2)C1=[OH+] Intermediate Fragment 
168 287.0774812521 C=CCN1C=NC2=C(N=CN2C2C=C(O)C(=C=O)O2)C1=[OH+]
