#In-silico ESI-MS/MS [M+H]+ Spectra
#PREDICTED BY CFM-ID 4.0.8
#SMILES=[C@H]1(C[C@@H](O[C@@H]1CO)n1cc(c(=O)n(c1=O)C1OC2C(C1O)c1c(O2)cc(c2c1oc(=O)c1c2CCC1=O)O)C)O
#InChiKey=APNPYMGMRSMSNA-WDSUKYBVSA-N
energy0
315.04993 20.65 22 173 172 (9.9048 0.13714 0.0064934)
413.09794 5.15 44 113 65 110 129 (2.215 0.28093 0.0057636 0.0051257 0.0005398)
423.08229 7.47 30 31 32 118 33 81 23 (2.6691 0.57371 0.22135 0.090354 0.054114 0.022484 0.0053938)
441.09286 100.00 5 45 99 104 85 35 54 133 112 79 117 122 124 92 80 126 116 78 111 102 109 76 103 (41.591 3.5892 1.0798 0.52391 0.4363 0.27068 0.24196 0.23972 0.18503 0.10128 0.079267 0.05436 0.049968 0.0462 0.044034 0.038225 0.018377 0.013823 0.013313 0.01117 0.010826 0.0097831 0.002694)
539.12964 10.25 184 182 3 183 181 186 187 326 11 223 17 14 16 12 13 231 232 (2.6932 0.74412 0.52083 0.4308 0.38871 0.05953 0.046555 0.03073 0.023263 0.009807 0.0096081 0.0084306 0.0073101 0.0065223 0.0049696 0.00093847 0.00011494)
557.14020 23.47 0 286 338 250 270 204 279 381 409 312 391 325 401 394 421 419 412 188 339 201 417 399 404 400 398 272 324 407 395 392 274 (10.642 0.24091 0.11 0.10993 0.07656 0.053464 0.034525 0.033835 0.01714 0.014802 0.014513 0.014034 0.011618 0.0053979 0.0053019 0.0049696 0.0048738 0.0040422 0.0035471 0.0035215 0.0029898 0.0023083 0.0016307 0.0013991 0.00073904 0.00040951 0.00039993 0.000391 0.00033471 0.00027253 5.3993e-05)
energy1
99.04406 8.58 6 153 147 (0.9184 0.74411 0.30523)
125.03455 34.84 19 (7.9924)
127.05020 17.74 20 (4.0696)
137.03455 14.14 84 (3.2446)
313.03428 22.05 25 (5.0573)
315.04993 99.69 22 172 173 (22.608 0.17455 0.084832)
317.06558 15.50 24 171 (3.3479 0.20821)
413.09794 8.67 113 44 65 110 129 (1.0733 0.54443 0.30545 0.040864 0.025237)
423.08229 22.25 30 31 32 33 118 81 23 (3.1437 0.97072 0.73477 0.21042 0.021186 0.011872 0.011541)
425.06156 6.03 34 134 (1.3792 0.0036237)
441.09286 100.00 5 85 99 54 122 112 126 45 35 133 124 76 104 92 103 80 78 116 111 117 109 79 102 (17.55 2.2917 0.63069 0.62421 0.3035 0.27311 0.19915 0.17946 0.15455 0.14637 0.12018 0.091147 0.082777 0.081596 0.052983 0.037978 0.030895 0.026102 0.025911 0.017299 0.015062 0.0023086 0.0013688)
energy2
45.03349 18.46 150 (1.9865)
56.04948 7.11 277 (0.76521)
59.04914 9.37 154 (1.0084)
71.04914 32.49 57 260 261 (2.3699 0.71996 0.40529)
75.04406 19.38 196 213 (1.8906 0.19493)
99.04406 13.86 6 147 153 (0.7252 0.6722 0.093808)
101.05971 10.81 7 166 164 (0.42039 0.39568 0.34726)
125.03455 34.57 19 (3.7189)
127.05020 24.51 20 (2.6374)
139.05020 13.15 83 218 (1.3954 0.019263)
155.04512 9.37 91 (1.0083)
169.06077 13.32 178 94 (0.82569 0.60768)
185.05568 7.49 98 (0.806)
200.09173 9.79 285 293 (0.63964 0.41416)
225.08698 8.86 8 185 (0.55348 0.4002)
226.07100 8.45 284 (0.90956)
257.04445 24.71 96 354 342 346 (1.9864 0.29031 0.19471 0.18755)
273.03936 16.29 82 349 (1.4013 0.35141)
283.09246 8.04 328 (0.86546)
287.05501 20.17 88 388 (1.4266 0.74344)
332.07648 7.06 52 (0.75994)
358.05574 18.96 41 (2.0402)
360.07139 13.37 40 (1.4383)
441.09286 100.00 5 54 99 45 126 92 35 133 80 104 117 76 112 124 85 79 78 109 111 116 102 122 103 (2.7817 2.0897 1.3803 0.75072 0.56264 0.5398 0.52973 0.43042 0.28252 0.27984 0.26242 0.20447 0.1868 0.080427 0.079358 0.064478 0.058055 0.047249 0.04051 0.039173 0.02944 0.025584 0.013576)
467.10851 82.76 192 191 190 (3.5833 2.9229 2.3983)
469.08777 39.03 258 255 257 256 203 (1.0562 1.0453 0.86154 0.64181 0.59425)
471.13981 18.98 194 (2.0424)
473.15546 18.98 195 (2.0424)
525.11399 8.20 311 420 380 1 (0.33592 0.21338 0.16886 0.16431)
529.14529 7.47 275 377 402 306 396 305 303 300 309 294 308 (0.62087 0.096706 0.057687 0.011474 0.0051286 0.0043481 0.0031876 0.0014292 0.0012514 0.0006687 0.00044126)

0 557.1402006601 Cc1cn(C2CC(O)C(C[OH2+])O2)c(=O)n(C2OC3Oc4cc(O)c5c6c(c(=O)oc5c4C3C2O)C(=O)CC6)c1=O
1 525.1139859121 CC1=CN(C2C=C(O)CO2)C(=O)N(C2OC3=C(C2=O)C2=C(C=C(O)C4=C2OC(=O)C2C(O)CCC42)O3)C1=[OH+]
2 527.1296359761 CC1=CN(C2C=C(O)CO2)C(=O)N(C2OC3=C(C2=O)C2=C(C=C(O)C4=C2OC(O)C2C(O)CCC42)O3)C1=[OH+]
3 539.1296359761 C=C1OC(N2C=C(C)C(=[OH+])N(C3OC4=C(C3=O)C3=C(C=C(O)C5=C3OC(O)C3C(O)CCC53)O4)C2=O)C=C1O
4 443.1085066081 CC1=C([OH2+])N(C2OC3=C(C2=O)C2=C(C=C(O)C4=C2OC(O)C2C(O)CCC42)O3)C(=O)N=C1
5 441.0928565441 CC1=C([OH2+])N(C2OC3=C(C2=O)C2=C(C=C(O)C4=C2OC(=O)C2C(O)CCC42)O3)C(=O)N=C1
6 99.0440558841 C=C1OC=CC1[OH2+]
7 101.0597059481 CC1OC=CC1[OH2+]
8 225.0869833161 C=C1OC(N2C=C(C)C(=[OH+])NC2O)=CC1O
9 227.1026333801 C=C1OC(N2C=C(C)C([OH2+])NC2O)=CC1O
10 521.1190712921 C=C1C=CC(N2C=C(C)C(=[OH+])N(C3OC4=C(C3=O)C3=C(C=C(O)C5=C3OC(=O)C3C(O)CCC53)O4)C2=O)O1
11 539.1296359761 C#COC(=C=CO)N1C=C(C)C(=[OH+])N(C2OC3=C(C2=O)C2=C(C=C(O)C4C2OC(O)C2C(O)CCC42)O3)C1=O Intermediate Fragment 
12 539.1296359761 C=C1OC(N(C=C(C)C=[OH+])C(O)=NC2OC3=C(C2=O)C2=C(C=C(O)C4=C2OC(=O)C2C(O)CCC42)O3)C=C1O Intermediate Fragment 
13 539.1296359761 C=C1OC(=NC=C(C)C(=[OH+])N(C=O)C2OC3=C(C2=O)C2=C(C=C(O)C4=C2OC(O)C2C(O)CCC42)O3)C=C1O Intermediate Fragment 
14 539.1296359761 C=C1OC(N2C=C(C)C(=[OH+])N(CC(O)=C3C(=O)OC4=C3C3=C(C(O)=C4)C4CCC(O)C4C(=O)O3)C2=O)C=C1O Intermediate Fragment 
15 239.1026333801 C=C1OC(N2C=C(C)C(=[OH+])N(C)C2O)=CC1O
16 539.1296359761 C=C1OC(N2C=C(C)C(=[OH+])N(COC3=C(C=O)C4=C(C=C(O)C5=C4OC(=O)C4C(O)CCC54)O3)C2=O)C=C1O Intermediate Fragment 
17 539.1296359761 C=C1OC(N2C=C(C)C(=[OH+])N(C3OC4=C(C3=O)C3=C(C=C(O)C5=C3OC(=O)C(C(C)O)C5C)O4)C2=O)C=C1O Intermediate Fragment 
18 447.1398067361 CC1=C([OH2+])N(C2OC3=C(C2=O)C2=C(CC(O)C4C2OC(O)C2C(O)CCC24)O3)C(=O)N=C1
19 125.0345538201 C=C1C=NC(O)=NC1=[OH+]
20 127.0502038841 CC1C=NC(O)=NC1=[OH+]
21 445.1241566721 CC1=C([OH2+])N(C2OC3=C(C2=O)C2=C(C=C(O)C4C2OC(O)C2C(O)CCC42)O3)C(=O)N=C1
22 315.0499291121 O=C1OC2=C(C(O)=CC3=C2C2=C(OCC2=[OH+])O3)C2=C1C(O)CC2
23 423.0822918601 CC1=CN(C2OC3=C(C2=O)C2=C(C=C(O)C4=C2OC(=O)C2=C4CCC2O)O3)C(=[OH+])N=C1
24 317.0655791761 O=C1OC2=C(C(O)=CC3=C2C2=C(OCC2=[OH+])O3)C2CCC(O)C12
25 313.0342790481 O=C1OC2=C(C(O)=CC3=C2C2=C(OCC2=[OH+])O3)C2=C1C(O)C=C2
26 311.0186289841 O=C1C=CC2=C1C(=O)OC1=C2C(O)=CC2=C1C1=C(OCC1=[OH+])O2
27 123.0189037561 [CH+]=C1C=NC(O)=NC1=O
28 129.0658539481 CC1C=NC(O)NC1=[OH+]
29 131.0815040121 CC1C=NC(O)NC1[OH2+]
30 423.0822918601 CC1=C([OH2+])N(C2CC3=C(OC4=C3C3=C(C(O)=C4)C4=C(C(=O)O3)C(O)C=C4)O2)C(=O)N=C1
31 423.0822918601 CC1=C([OH2+])N(C2OC3=C(C2=O)C2=C(C=C(O)C4=C2OC=C2C4=CCC2O)O3)C(=O)N=C1
32 423.0822918601 CC1=C([OH2+])N(C2OC3=C(C2=O)C2=C(C=C(O)C4=C2OC(=O)C2=C4CCC2)O3)C(=O)N=C1
33 423.0822918601 CC1=C([OH2+])N(C2OC3=C(C2=O)C2=C(C=CC4=C2OC(=O)C2=C4CCC2O)O3)C(=O)N=C1
34 425.0615564161 O=C1OC2=C(C(O)=CC3=C2C2=C(O3)OC(N3C(=O)N=CC=C3[OH2+])C2=O)C2=C1C(O)CC2
35 441.0928565441 CC(=C=N)C(=[OH+])N(C=O)C1OC2=C(C1=O)C1=C(C=C(O)C3=C1OC(=O)C1C(O)CCC31)O2 Intermediate Fragment 
36 424.0663074481 C=C(C)C(=O)[NH+](C=O)C1OC2=C(C1=O)C1=C(C=C(O)C3=C1OC(=O)C1=C3C=CC1O)O2
37 414.0819575121 CC=C(O)[NH+](C=O)C1OC2=C(C1=O)C1=C(C=C(O)C3=C1OC(=O)C1=C3CCC1O)O2
38 412.0663074481 CC=C(O)[NH+](C=O)C1OC2=C(C1=O)C1=C(C=C(O)C3=C1OC(=O)C1=C3C=CC1O)O2
39 390.0819575121 O=C[NH+](C=O)C1OC2=C(C1=O)C1=C(C=C(O)C3=C1OC(O)C1C(O)CCC31)O2
40 360.0713928281 O=C=[NH+]C1OC2=C(C1=O)C1=C(C=C(O)C3=C1OC(O)C1C(O)CCC31)O2
41 358.0557427641 O=C=[NH+]C1OC2=C(C1=O)C1=C(C=C(O)C3=C1OC(=O)C1C(O)CCC31)O2
42 356.0400927001 O=C=[NH+]C1OC2=C(C1=O)C1=C(C=C(O)C3=C1OC(=O)C1=C3CCC1O)O2
43 354.0244426361 O=C=[NH+]C1OC2=C(C1=O)C1=C(C=C(O)C3=C1OC(=O)C1=C3C=CC1O)O2
44 413.0979419241 CC(C#[NH+])=C(O)N=C1OC2=C(C1=O)C1=C(C=C(O)C3=C1OC(O)C1C(O)CCC31)O2
45 441.0928565441 CC(=C=NC=O)C(=[OH+])N=C1OC2=C(C1=O)C1=C(C=C(O)C3=C1OC(O)C1C(O)CCC31)O2 Intermediate Fragment 
46 398.0870428921 C=C(C)C(=O)[NH+]=C1OC2=C(C1=O)C1=C(C=C(O)C3=C1OC(=O)C1C(O)CCC31)O2
47 396.0713928281 C=C(C)C(=O)[NH+]=C1OC2=C(C1=O)C1=C(C=C(O)C3=C1OC(=O)C1=C3CCC1O)O2
48 394.0557427641 C=C(C)C(=O)[NH+]=C1OC2=C(C1=O)C1=C(C=C(O)C3=C1OC(=O)C1=C3C=CC1O)O2
49 386.0870428921 CC=C(O)[NH+]=C1OC2=C(C1=O)C1=C(C=C(O)C3=C1OC(=O)C1C(O)CCC31)O2
50 384.0713928281 CC=C(O)[NH+]=C1OC2=C(C1=O)C1=C(C=C(O)C3=C1OC(=O)C1=C3CCC1O)O2
51 84.0443902321 CC=C=[NH+]C=O
52 332.0764782081 [NH2+]=C1OC2=C(C1=O)C1=C(C=C(O)C3=C1OC(O)C1C(O)CCC31)O2
53 439.0772064801 CC(=C=[NH+]C=O)C(=O)N=C1OC2=C(C1=O)C1=C(C=C(O)C3=C1OC(=O)C1C(O)CCC31)O2
54 441.0928565441 CC(=C=NC(O)=NC1OC2=C(C1=O)C1=C(C=C(O)C3=C1OC(=O)C1C(O)CCC31)O2)C=[OH+] Intermediate Fragment 
55 75.0804413921 CC(C)C[OH2+]
56 73.0647913281 C=C(C)C[OH2+]
57 71.0491412641 C=C(C)C=[OH+]
58 69.0334912001 C=C(C)C#[O+]
59 373.0666417961 [NH3+]C(O)=NC1OC2=C(C1=O)C1=C(C=C(O)C3=C1OC(=O)C1=C3CCC1O)O2
60 381.0353416681 C=[NH+]C(O)=NC1OC2=C(C1=O)C1=C(C=C(O)C3=C1OC(=O)C1=C3C=CC1=O)O2
61 383.0509917321 C=[NH+]C(O)=NC1OC2=C(C1=O)C1=C(C=C(O)C3=C1OC(=O)C1=C3C=CC1O)O2
62 385.0666417961 C=[NH+]C(O)=NC1OC2=C(C1=O)C1=C(C=C(O)C3=C1OC(=O)C1=C3CCC1O)O2
63 387.0822918601 C=[NH+]C(O)=NC1OC2=C(C1=O)C1=C(C=C(O)C3=C1OC(=O)C1C(O)CCC31)O2
64 411.0822918601 CC=C=[NH+]C(O)=NC1OC2=C(C1=O)C1=C(C=C(O)C3=C1OC(=O)C1=C3CCC1O)O2
65 413.0979419241 CC=C=[NH+]C(O)=NC1OC2=C(C1=O)C1=C(C=C(O)C3=C1OC(=O)C1C(O)CCC31)O2
66 118.0862550441 CC(C=[NH+]CO)CO
67 114.0549549161 CC(=C=[NH+]CO)C=O
68 112.0393048521 CC(=C=[NH+]C=O)C=O
69 110.0236547881 CC(=C=NC=O)C#[O+]
70 328.0451780801 [NH2+]=C1OC2=C(C1=O)C1=C(C=C(O)C3=C1OC(=O)C1=C3CCC1O)O2
71 330.0608281441 [NH2+]=C1OC2=C(C1=O)C1=C(C=C(O)C3=C1OC(=O)C1C(O)CCC31)O2
72 86.0600402961 CC(C#[NH+])CO
73 84.0443902321 CC(C#[NH+])=CO
74 352.0087925721 O=C=[NH+]C1OC2=C(C1=O)C1=C(C=C(O)C3=C1OC(=O)C1=C3C=CC1=O)O2
75 439.0772064801 CC(=C=[NH+]C(O)=NC1OC2=C(C1=O)C1=C(C=C(O)C3=C1OC(=O)C1=C3CCC1O)O2)C=O
76 441.0928565441 CC=C=NC(=O)N(C=[OH+])C1OC2=C(C1=O)C1=C(C=C(O)C3=C1OC(=O)C1C(O)CCC31)O2 Intermediate Fragment 
77 386.0506573841 O=C[NH+](C=O)C1OC2=C(C1=O)C1=C(C=C(O)C3=C1OC(=O)C1=C3CCC1O)O2
78 441.0928565441 C=NC(=O)N(C([OH2+])=CC)C1OC2=C(C1=O)C1=C(C=C(O)C3=C1OC(=O)C1=C3CCC1O)O2 Intermediate Fragment 
79 441.0928565441 C=C(C)C(=[OH+])N(C(N)=O)C1OC2=C(C1=O)C1=C(C=C(O)C3=C1OC(=O)C1=C3CCC1O)O2 Intermediate Fragment 
80 441.0928565441 CC1=C([OH2+])N(CC(O)=C2C(=O)OC3=C2C2=C(C(O)=C3)C3=C(C(=O)O2)C(O)CC3)C(=O)N=C1 Intermediate Fragment 
81 423.0822918601 CC1=C([OH2+])N(CC(=O)C2=COC3=C2C2=C(C(O)=C3)C3=C(C(=O)O2)C(O)C=C3)C(=O)N=C1
82 273.0393644281 O=C1OC2=C(C3=C1C(O)C=C3)C(O)C=C1OC(=[OH+])C=C12
83 139.0502038841 C=C1C=NC(=O)N(C)C1=[OH+]
84 137.0345538201 C=C1C=NC(=O)N([CH2+])C1=O
85 441.0928565441 CC1=C([OH2+])N(COC2=C(C=O)C3=C(C=C(O)C4=C3OC(=O)C3=C4CCC3O)O2)C(=O)N=C1 Intermediate Fragment 
86 143.0815040121 CC1C=NC(O)N(C)C1=[OH+]
87 289.0706645561 O=C1OC2=C(C(O)=CC3=C2C(C=[OH+])=CO3)C2CCC(O)C12
88 287.0550144921 O=C1OC2=C(C(O)=CC3=C2C(C=[OH+])=CO3)C2=C1C(O)CC2
89 285.0393644281 O=C1OC2=C(C(O)=CC3=C2C(C=[OH+])=CO3)C2=C1C(O)C=C2
90 153.0294684401 C=C1C=NC(=O)N(C=O)C1=[OH+]
91 155.0451185041 CC1C=NC(=O)N(C=O)C1=[OH+]
92 441.0928565441 CC1=C([OH2+])N(C(C=O)OC2=CC3=C(C=C(O)C4=C3OC(=O)C3=C4CCC3O)O2)C(=O)N=C1 Intermediate Fragment 
93 275.0550144921 O=C1OC2=C(C3=C1C(O)CC3)C(O)C=C1OC(=[OH+])C=C12
94 169.0607685681 CC1C=NC(=O)N(CC=O)C1=[OH+]
95 259.0600998721 OC1=CC2=C(C=CO2)C2=C1C1=C(C(=[OH+])O2)C(O)CC1
96 257.0444498081 OC1=CC2=C(C=CO2)C2=C1C1=C(C(=[OH+])O2)C(O)C=C1
97 255.0287997441 O=C1C=CC2=C1C(=[OH+])OC1=C2C(O)=CC2=C1C=CO2
98 185.0556831881 CC1C=NC(=O)N(C(=O)CO)C1=[OH+]
99 441.0928565441 CC1=C([OH2+])N(C(=O)C(=O)C2=COC3=C2C2=C(C(O)=C3)C3CCC(O)C3C(=O)O2)C(=O)N=C1 Intermediate Fragment 
100 183.0400331241 CC1C=NC(=O)N(C(=O)C=O)C1=[OH+]
101 151.0138183761 C=C1C=NC(=O)N(C#[O+])C1=O
102 441.0928565441 CC1=C([OH2+])N(C2OC(O)=C(C3=CC=C(O)C4=C3OC(=O)C3=C4CCC3O)C2=O)C(=O)N=C1 Intermediate Fragment 
103 441.0928565441 CC1=C([OH2+])N(C2OC(OC3=CC4=C(C(O)=C3)C3=C(C(=O)O4)C(O)CC3)=CC2=O)C(=O)N=C1 Intermediate Fragment 
104 441.0928565441 CC1=C([OH2+])N(C2OC=C(C3=C(O)C=C(O)C4=C3OC(=O)C3=C4CCC3O)C2=O)C(=O)N=C1 Intermediate Fragment 
105 231.0287997441 O=C1C=CC2=C1C(=O)OC1=C2C(O)=CC([OH2+])=C1
106 207.0400331241 C=C1C=NC(=O)N(C2OC=CC2=O)C1=[OH+]
107 211.0713332521 CC1C=NC(=O)N(C2OC=CC2O)C1=[OH+]
108 439.0772064801 CC1=C([OH2+])N(C2OC=C(C3=C(O)C=C(O)C4=C3OC(=O)C3=C4C=CC3O)C2=O)C(=O)N=C1
109 441.0928565441 CC1=C([OH2+])N(C2OC3=C(C2=O)C(C2OC(=O)C4=C(C=CC4O)C2=CO)=C(C)O3)C(=O)N=C1 Intermediate Fragment 
110 413.0979419241 CC1=C([OH2+])N(C2OC3=C(C2=O)C(C2=CC4=C(C(=O)O2)C(O)CC4)=C(C)O3)C(=O)N=C1
111 441.0928565441 CC1=C([OH2+])N(C2OC3=C(C=C(C=C(O)C4=COC(=O)C5=C4CCC5O)O3)C2=O)C(=O)N=C1 Intermediate Fragment 
112 441.0928565441 CC1=C([OH2+])N(C2OC3=C(C2=O)C2=C(C=C(O)C(C4CCC(O)C4=C=O)=C2O)O3)C(=O)N=C1 Intermediate Fragment 
113 413.0979419241 CC1=C([OH2+])N(C2OC3=C(C2=O)C2=C(C=C(O)C(C4=CC(O)CC4)=C2O)O3)C(=O)N=C1
114 411.0822918601 CC1=C([OH2+])N(C2OC3=C(C2=O)C2=C(C=C(O)C(C4=CC(O)C=C4)=C2O)O3)C(=O)N=C1
115 409.0666417961 CC1=C([OH2+])N(C2OC3=C(C2=O)C2=C(C=C(O)C(C4=CC(=O)C=C4)=C2O)O3)C(=O)N=C1
116 441.0928565441 CC1=C([OH2+])N(C2OC3=C(C2=O)C2=C(C=C(O)C(C4=CC(O)CC4)=C2OC=O)O3)C(=O)N=C1 Intermediate Fragment 
117 441.0928565441 CC1=C([OH2+])N(C2OC3=C(C2=O)C2=C(C=C(O)C(C4=C(C(=O)O)C(O)CC4)=C2)O3)C(=O)N=C1 Intermediate Fragment 
118 423.0822918601 CC1=C([OH2+])N(C2OC3=C(C2=O)C2=C(C=C(O)C(C4=CCC(O)C4=C=O)=C2)O3)C(=O)N=C1
119 397.1030273041 CC1=C([OH2+])N(C2OC3=C(C2=O)C2=C(C=C(O)C(C4=CC(O)CC4)=C2)O3)C(=O)N=C1
120 395.0873772401 CC1=C([OH2+])N(C2OC3=C(C2=O)C2=C(C=C(O)C(C4=CC(O)C=C4)=C2)O3)C(=O)N=C1
121 393.0717271761 CC1=C([OH2+])N(C2OC3=C(C2=O)C2=C(C=C(O)C(C4=CC(=O)C=C4)=C2)O3)C(=O)N=C1
122 441.0928565441 CCC(O)C1=CC2=C(OC1=O)C1=C(C=C2O)OC2=C1C(=O)C(N1C(=O)N=CC(C)=C1[OH2+])O2 Intermediate Fragment 
123 381.0353416681 [CH2+]C1=C(O)N(C2OC3=C(C2=O)C2=C(C=C(O)C4=C2OC(=O)C=C4)O3)C(=O)N=C1
124 441.0928565441 CC1=C([OH2+])N(C2OC3=C(C2=O)C2=C(C=C(O)C4=C2OC(=O)C=C4CCCO)O3)C(=O)N=C1 Intermediate Fragment 
125 397.0666417961 CC1=CC(=O)OC2=C1C(O)=CC1=C2C2=C(O1)OC(N1C(=O)N=CC(C)=C1[OH2+])C2=O
126 441.0928565441 CCC1=C(CO)C(=O)OC2=C1C(O)=CC1=C2C2=C(O1)OC(N1C(=O)N=CC(C)=C1[OH2+])C2=O Intermediate Fragment 
127 411.0459063521 CC1=C([OH2+])N(C2OC3=C(C2=O)C2=C(C=C(O)C4=C2OC(=O)C(C=O)=C4)O3)C(=O)N=C1
128 413.0615564161 CC1=C([OH2+])N(C2OC3=C(C2=O)C2=C(C=C(O)C4=C2OC(=O)C(CO)=C4)O3)C(=O)N=C1
129 413.0979419241 CCC1CC(=O)OC2=C1C(O)=CC1=C2C2=C(O1)OC(N1C(=O)N=CC(C)=C1[OH2+])C2=O
130 411.0822918601 CCC1=CC(=O)OC2=C1C(O)=CC1=C2C2=C(O1)OC(N1C(=O)N=CC(C)=C1[OH2+])C2=O
131 409.0666417961 C=CC1=CC(=O)OC2=C1C(O)=CC1=C2C2=C(O1)OC(N1C(=O)N=CC(C)=C1[OH2+])C2=O
132 439.0772064801 C=CC1=C(CO)C(=O)OC2=C1C(O)=CC1=C2C2=C(O1)OC(N1C(=O)N=CC(C)=C1[OH2+])C2=O
133 441.0928565441 CC1=C([OH2+])N(C2OC3=C(C2=O)C2=C(C=C(O)C4=C2OC(=O)C(C(C)O)=C4C)O3)C(=O)N=C1 Intermediate Fragment 
134 425.0615564161 CC1=C([OH2+])N(C2OC3=C(C2=O)C2=C(C=C(O)C4=C2OC(=O)C(C=O)=C4C)O3)C(=O)N=C1
135 399.0822918601 CC1=C([OH2+])N(C2OC3=C(C2=O)C2=C(C=C(O)C4=C2OC(=O)CC4C)O3)C(=O)N=C1
136 395.0509917321 [CH2+]C1=CC(=O)OC2=C1C(O)=CC1=C2C2=C(O1)OC(N1C(=O)N=CC(C)=C1O)C2=O
137 439.0772064801 C=C(O)C1=C(C)C2=C(OC1=O)C1=C(C=C2O)OC2=C1C(=O)C(N1C(=O)N=CC(C)=C1[OH2+])O2
138 439.0772064801 CC1=C([OH2+])N(COC2=C(C=O)C3=C(C=C(O)C4=C3OC(=O)C3=C4C=CC3O)O2)C(=O)N=C1 Intermediate Fragment 
139 111.0076703761 O=C1C=COC1=C=[OH+]
140 113.0233204401 OC1C=COC1=C=[OH+]
141 115.0389705041 OC1C=COC1=C[OH2+]
142 87.0440558841 [OH2+]C1C=COC1
143 115.0389705041 C=C=C(O)C(=O)C[OH2+] Intermediate Fragment 
144 115.0389705041 O=C=C=C(O)CC[OH2+] Intermediate Fragment 
145 117.0546205681 OC1C=COC1C[OH2+]
146 89.0597059481 [OH2+]C1CCOC1
147 99.0440558841 [OH2+]C=C1C=CCO1
148 117.0546205681 C=COC(=C[OH2+])CO Intermediate Fragment 
149 91.0389705041 OCC(=[OH+])CO
150 45.0334912001 C=C[OH2+]
151 117.0546205681 C=C=C(O)C(O)C[OH2+] Intermediate Fragment 
152 29.0385765801 C=[CH3+]
153 99.0440558841 C=C=C(O)C=C[OH2+]
154 59.0491412641 CC=C[OH2+]
155 57.0334912001 CC#C[OH2+]
156 61.0284058201 OCC=[OH+]
157 117.0546205681 OC=C=C(O)CC[OH2+] Intermediate Fragment 
158 43.0178411361 C#C[OH2+]
159 87.0440558841 C=C(O)C=C[OH2+]
160 89.0597059481 C=C(O)CC[OH2+]
161 47.0491412641 CC[OH2+]
162 117.0546205681 OC=C=COCC[OH2+] Intermediate Fragment 
163 119.0702706321 OC1CCOC1C[OH2+]
164 101.0597059481 [OH2+]CC1C=CCO1
165 119.0702706321 OCC=C(O)CC[OH2+] Intermediate Fragment 
166 101.0597059481 C=C=C(O)CC[OH2+]
167 323.1125293681 OC1CCC2C1C(O)OC1C3=C(CC(O)C12)OC1=C3C(=[OH+])CO1
168 321.0968793041 OC1=CC2=C(C3=C(OCC3=[OH+])O2)C2OC(O)C3C(O)CCC3C12
169 319.0812292401 OC1=CC2=C(C3=C1C1CCC(O)C1C(O)O3)C1=C(OCC1=[OH+])O2
170 299.0550144921 OC1=CC2=C(C3=C(OCC3)O2)C2=C1C1=C(C(=[OH+])O2)C(O)C=C1
171 317.0655791761 O=C1OC2=C(C(O)=CC(O)=C2C2=COCC2=[OH+])C2=C1C(O)CC2 Intermediate Fragment 
172 315.0499291121 O=CC(=[OH+])C1=COC2=C1C1=C(C(O)=C2)C2=C(C(=O)O1)C(O)CC2 Intermediate Fragment 
173 315.0499291121 C=C(O)C1=C(C)C2=C(OC1=O)C1=C(C=C2O)OC2=C1C(=[OH+])CO2 Intermediate Fragment 
174 239.0662478721 CC1=CN(C2=CC(O)C(=C=[OH+])O2)C(O)NC1=O
175 241.0818979361 CC1=CN(C2=CC(O)C(=C=[OH+])O2)C(O)NC1O
176 243.0975480001 CC1CN(C2=CC(O)C(=C=[OH+])O2)C(O)NC1O
177 243.0975480001 CC1CN(C(O)=C=C(O)C#C[OH2+])C(O)NC1O Intermediate Fragment 
178 169.0607685681 C=C([OH2+])N1C=C(C)C(=O)N=C1O
179 245.1131980641 CC1CN(C2=CC(O)C(=C[OH2+])O2)C(O)NC1O
180 247.1288481281 CC1CN(C2=CC(O)C(C[OH2+])O2)C(O)NC1O
181 539.1296359761 CC1=CN(C2C=C(O)C(=C=[OH+])O2)C(=O)N(C2CC3=C(OC4=C3C3=C(C(O)=C4)C4CCC(O)C4C(O)O3)O2)C1=O
182 539.1296359761 CC1=CN(C2C=C(O)C(=C=[OH+])O2)C(=O)N(C2OC3=C(C2=O)C2=C(C=C(O)C4C2OCC2C(O)CCC24)O3)C1=O
183 539.1296359761 CC1=CN(C2C=C(O)C(=C=[OH+])O2)C(=O)N(C2OC3=C(C2=O)C2=C(C=C(O)C4C2OC(O)C2CCCC24)O3)C1=O
184 539.1296359761 CC1=CN(C2C=CC(=C=[OH+])O2)C(=O)N(C2OC3=C(C2=O)C2=C(C=C(O)C4C2OC(O)C2C(O)CCC42)O3)C1=O
185 225.0869833161 CC1=CN(C2C=CC(=C=[OH+])O2)C(O)NC1O
186 539.1296359761 CC(=CN=C1C=CC(=C=[OH+])O1)C(=O)N(C=O)C1OC2=C(C1=O)C1=C(C=C(O)C3C1OC(O)C1C(O)CCC31)O2 Intermediate Fragment 
187 539.1296359761 CC1=CN(C2C=CC(=C=[OH+])O2)C(=O)N(CC(O)=C2C(=O)OC3=C2C2=C(C(O)=C3)C3CCC(O)C3C(O)O2)C1=O Intermediate Fragment 
188 557.1402006601 C=C(OC(=C=[OH+])CO)N1C=C(C)C(=O)N(C2OC3=C(C2=O)C2=C(C=C(O)C4C2OC(O)C2C(O)CCC42)O3)C1=O Intermediate Fragment 
189 465.0928565441 C#CN1C=C(C)C(=[OH+])N(C2OC3=C(C2=O)C2=C(C=C(O)C4=C2OC(=O)C2C(O)CCC42)O3)C1=O
190 467.1085066081 C#CN1C=C(C)C(=[OH+])N(C2OC3=C(C2=O)C2=C(C=C(O)C4=C2OC(O)C2C(O)CCC42)O3)C1=O
191 467.1085066081 C#CN1C=C(C)C(=[OH+])N(C(C=O)OC2=CC3=C(C=C(O)C4=C3OC(=O)C3C(O)CCC43)O2)C1=O Intermediate Fragment 
192 467.1085066081 C#CN1C=C(C)C(=[OH+])N(C(=O)C(=O)C2=COC3=C2C2=C(C(O)=C3)C3CCC(O)C3C(O)O2)C1=O Intermediate Fragment 
193 469.1241566721 C#CN1C=C(C)C(=[OH+])N(C2OC3=C(C2=O)C2=C(C=C(O)C4C2OC(O)C2C(O)CCC42)O3)C1=O
194 471.1398067361 C#CN1C=C(C)C(=[OH+])N(C2OC3=C(C2=O)C2=C(CC(O)C4C2OC(O)C2C(O)CCC24)O3)C1=O
195 473.1554568001 C#CN1C=C(C)C(=[OH+])N(C2OC3=C(C2=O)C2C(CC(O)C4C5CCC(O)C5C(O)OC24)O3)C1=O
196 75.0440558841 OCC=C[OH2+]
197 483.1034212281 C=C([OH2+])N1C=C(C)C(=O)N(C2OC3=C(C2=O)C2=C(C=C(O)C4=C2OC(=O)C2C(O)CCC42)O3)C1=O
198 483.1034212281 C=C([OH2+])N(C=O)C=C(C)C(=O)N=C1OC2=C(C1=O)C1=C(C=C(O)C3=C1OC(=O)C1C(O)CCC31)O2 Intermediate Fragment 
199 483.1034212281 C=C([OH2+])N1C=C(C)C(=O)N(C(=O)C(=O)C2=COC3=C2C2=C(C(O)=C3)C3CCC(O)C3C(=O)O2)C1=O Intermediate Fragment 
200 485.1190712921 C=C([OH2+])N1C=C(C)C(=O)N(C2OC3=C(C2=O)C2=C(C=C(O)C4=C2OC(O)C2C(O)CCC42)O3)C1=O
201 557.1402006601 C=C(O)C(=C=[OH+])OCN1C=C(C)C(=O)N(C2OC3=C(C2=O)C2=C(C=C(O)C4C2OC(O)C2C(O)CCC42)O3)C1=O Intermediate Fragment 
202 471.1034212281 CC1=CN(C=[OH+])C(=O)N(C2OC3=C(C2=O)C2=C(C=C(O)C4=C2OC(O)C2C(O)CCC42)O3)C1=O
203 469.0877711641 CC1=CN(C=[OH+])C(=O)N(C2OC3=C(C2=O)C2=C(C=C(O)C4=C2OC(=O)C2C(O)CCC42)O3)C1=O
204 557.1402006601 CC1=CN(C=C=C(O)C(=O)C=[OH+])C(=O)N(C2OC3=C(C2=O)C2=C(CC(O)C4C2OC(O)C2C(O)CCC24)O3)C1=O Intermediate Fragment 
205 84.9920203121 O=CC(=O)C#[O+]
206 87.0076703761 O=CC(=[OH+])C=O
207 89.0233204401 O=CC(=[OH+])CO
208 71.0127557561 O=CC#C[OH2+]
209 71.0127557561 CC(=O)C#[O+]
210 73.0284058201 OCC#C[OH2+]
211 73.0284058201 CC(=[OH+])C=O
212 93.0546205681 OCC([OH2+])CO
213 75.0440558841 CC(=[OH+])CO
214 459.1398067361 CC1=CN(C)C(=O)N(C2OC3=C(C2=O)C2=C(C=C(O)C4C2OC(O)C2C(O)CCC42)O3)C1=[OH+]
215 457.1241566721 CC1=CN(C)C(=O)N(C2OC3=C(C2=O)C2=C(C=C(O)C4=C2OC(O)C2C(O)CCC42)O3)C1=[OH+]
216 455.1085066081 CC1=CN(C)C(=O)N(C2OC3=C(C2=O)C2=C(C=C(O)C4=C2OC(=O)C2C(O)CCC42)O3)C1=[OH+]
217 453.0928565441 CC1=CN(C)C(=O)N(C2OC3=C(C2=O)C2=C(C=C(O)C4=C2OC(=O)C2=C4CCC2O)O3)C1=[OH+]
218 139.0502038841 [CH2+]N1C=C(C)C(=O)N=C1O
219 453.0928565441 CC(=CN(C)C=O)C(=[OH+])N=C1OC2=C(C1=O)C1=C(C=C(O)C3=C1OC(=O)C1=C3CCC1O)O2 Intermediate Fragment 
220 453.0928565441 CC1=CN(C)C(=O)N(C(C=O)OC2=CC3=C(C=C(O)C4=C3OC(=O)C3=C4C=CC3O)O2)C1=[OH+] Intermediate Fragment 
221 453.0928565441 CC1=CN(C)C(=O)N(C(=O)C(=O)C2=COC3=C2C2=C(C(O)=C3)C3=C(C(=O)O2)C(O)CC3)C1=[OH+] Intermediate Fragment 
222 451.0772064801 CC1=CN(C)C(=O)N(C2OC3=C(C2=O)C2=C(C=C(O)C4=C2OC(=O)C2=C4C=CC2O)O3)C1=[OH+]
223 539.1296359761 CC1=CN(C=C=C(O)C#C[OH2+])C(=O)N(C2OC3=C(C2=O)C2=C(C=C(O)C4C2OC(O)C2C(O)CCC42)O3)C1=O
224 77.0597059481 OCCC[OH2+]
225 521.1190712921 C#CC(O)=C=CN1C=C(C)C(=[OH+])N(C2OC3=C(C2=O)C2=C(C=C(O)C4=C2OC(O)C2C(O)CCC42)O3)C1=O
226 103.0753560121 CC=C(O)CC[OH2+]
227 227.1026333801 CC1CN(C=C=C(O)C#C[OH2+])C(O)NC1O
228 521.1190712921 CC1=CN(CC#CC#C[OH2+])C(=O)N(C2OC3=C(C2=O)C2=C(C=C(O)C4=C2OC(O)C2C(O)CCC42)O3)C1=O
229 497.1190712921 CC1=CN(CC#CO)C(=O)N(C2OC3=C(C2=O)C2=C(C=C(O)C4=C2OC(O)C2C(O)CCC42)O3)C1=[OH+]
230 495.1034212281 CC1=CN(CC#CO)C(=O)N(C2OC3=C(C2=O)C2=C(C=C(O)C4=C2OC(=O)C2C(O)CCC42)O3)C1=[OH+]
231 539.1296359761 CC(=CN=C=C=C(O)C#C[OH2+])C(=O)N(C=O)C1OC2=C(C1=O)C1=C(C=C(O)C3C1OC(O)C1C(O)CCC31)O2 Intermediate Fragment 
232 539.1296359761 CC1=CN(C=C=C(O)C#C[OH2+])C(=O)N(CC(O)=C2C(=O)OC3=C2C2=C(C(O)=C3)C3CCC(O)C3C(O)O2)C1=O Intermediate Fragment 
233 501.1503714201 CC1=CN(CC#CO)C(=O)N(C2OC3=C(C2=O)C2=C(CC(O)C4C2OC(O)C2C(O)CCC24)O3)C1=[OH+]
234 499.1347213561 CC1=CN(CC#CO)C(=O)N(C2OC3=C(C2=O)C2=C(C=C(O)C4C2OC(O)C2C(O)CCC42)O3)C1=[OH+]
235 481.1241566721 C#CCN1C=C(C)C(=[OH+])N(C2OC3=C(C2=O)C2=C(C=C(O)C4=C2OC(O)C2C(O)CCC42)O3)C1=O
236 183.0764186321 CC1=CN(C=C=CO)C(O)NC1=[OH+]
237 479.1085066081 C#CCN1C=C(C)C(=[OH+])N(C2OC3=C(C2=O)C2=C(C=C(O)C4=C2OC(=O)C2C(O)CCC42)O3)C1=O
238 497.1190712921 CC(=CN=CC#CO)C(=[OH+])N(C=O)C1OC2=C(C1=O)C1=C(C=C(O)C3=C1OC(O)C1C(O)CCC31)O2 Intermediate Fragment 
239 497.1190712921 CC(=CN(C=O)CC#CO)C(=[OH+])N=C1OC2=C(C1=O)C1=C(C=C(O)C3=C1OC(O)C1C(O)CCC31)O2 Intermediate Fragment 
240 469.1241566721 CC(=C[NH+]=CC#CO)C(=O)N=C1OC2=C(C1=O)C1=C(C=C(O)C3C1OC(O)C1C(O)CCC31)O2
241 497.1190712921 CC=CN(CC#CO)C(=O)N(C=[OH+])C1OC2=C(C1=O)C1=C(C=C(O)C3=C1OC(=O)C1C(O)CCC31)O2 Intermediate Fragment 
242 497.1190712921 CC1=CN(CC#CO)C(=O)N(CC(O)=C2C(=O)OC3=C2C2=C(C(O)=C3)C3CCC(O)C3C(=O)O2)C1=[OH+] Intermediate Fragment 
243 497.1190712921 CC1=CN(CC#CO)C(=O)N(C(C=O)OC2=CC3=C(C=C(O)C4=C3OC(=O)C3C(O)CCC43)O2)C1=[OH+] Intermediate Fragment 
244 497.1190712921 CC1=CN(CC#CO)C(=O)N(C(=O)C(=O)C2=COC3=C2C2=C(C(O)=C3)C3CCC(O)C3C(O)O2)C1=[OH+] Intermediate Fragment 
245 497.1190712921 CC1=CN(CC#CO)C(=O)N(C2OC3=C(C2=O)C2=C(C=C(O)C4=C2OC(=O)C(C(C)O)C4C)O3)C1=[OH+] Intermediate Fragment 
246 495.1034212281 CC(=CN=CC#CO)C(=[OH+])N(C=O)C1OC2=C(C1=O)C1=C(C=C(O)C3=C1OC(=O)C1C(O)CCC31)O2 Intermediate Fragment 
247 59.0127557561 O=C=C[OH2+]
248 41.0021910721 [CH+]=C=O
249 63.0440558841 OCC[OH2+]
250 557.1402006601 CC1=CN(C(O)=C=C(O)C#C[OH2+])C(=O)N(C2OC3=C(C2=O)C2=C(CC(O)C4C2OC(O)C2C(O)CCC24)O3)C1=O Intermediate Fragment 
251 489.1503714201 C=C([OH2+])N1C=C(C)C(=O)N(C2OC3=C(C2=O)C2=C(CC(O)C4C2OC(O)C2C(O)CCC24)O3)C1=O
252 487.1347213561 C=C([OH2+])N1C=C(C)C(=O)N(C2OC3=C(C2=O)C2=C(C=C(O)C4C2OC(O)C2C(O)CCC42)O3)C1=O
253 481.0877711641 C=C([OH2+])N1C=C(C)C(=O)N(C2OC3=C(C2=O)C2=C(C=C(O)C4=C2OC(=O)C2=C4CCC2O)O3)C1=O
254 473.1190712921 CC1=CN(C=[OH+])C(=O)N(C2OC3=C(C2=O)C2=C(C=C(O)C4C2OC(O)C2C(O)CCC42)O3)C1=O
255 469.0877711641 CC(=CN(C=O)C=[OH+])C(=O)N=C1OC2=C(C1=O)C1=C(C=C(O)C3=C1OC(=O)C1C(O)CCC31)O2 Intermediate Fragment 
256 469.0877711641 CC1=CN(C=[OH+])C(=O)N(CC(O)=C2C(=O)OC3=C2C2=C(C(O)=C3)C3=C(C(=O)O2)C(O)CC3)C1=O Intermediate Fragment 
257 469.0877711641 CC1=CN(C=[OH+])C(=O)N(C(C=O)OC2=CC3=C(C=C(O)C4=C3OC(=O)C3=C4CCC3O)O2)C1=O Intermediate Fragment 
258 469.0877711641 CC1=CN(C=[OH+])C(=O)N(C(=O)C(=O)C2=COC3=C2C2=C(C(O)=C3)C3CCC(O)C3C(=O)O2)C1=O Intermediate Fragment 
259 467.0721211001 CC1=CN(C=[OH+])C(=O)N(C2OC3=C(C2=O)C2=C(C=C(O)C4=C2OC(=O)C2=C4CCC2O)O3)C1=O
260 71.0491412641 C=CC(=C)[OH2+]
261 71.0491412641 C#CCC[OH2+]
262 91.0753560121 CC(O)CC[OH2+]
263 73.0647913281 C=C([OH2+])CC
264 515.1296359761 CC1=CN(C(=[OH+])C#CO)C(=O)N(C2OC3=C(C2=O)C2=C(CC(O)C4C2OC(O)C2C(O)CCC24)O3)C1=O
265 497.1190712921 C#CC(=[OH+])N1C=C(C)C(=O)N(C2OC3=C(C2=O)C2=C(C=C(O)C4C2OC(O)C2C(O)CCC42)O3)C1=O
266 513.1139859121 CC1=CN(C(=[OH+])C#CO)C(=O)N(C2OC3=C(C2=O)C2=C(C=C(O)C4C2OC(O)C2C(O)CCC42)O3)C1=O
267 495.1034212281 C#CC(=[OH+])N1C=C(C)C(=O)N(C2OC3=C(C2=O)C2=C(C=C(O)C4=C2OC(O)C2C(O)CCC42)O3)C1=O
268 513.1139859121 CC1=CN(C(=[OH+])C#CO)C(=O)N(C(C=O)OC2=CC3=C(C=C(O)C4=C3OC(O)C3C(O)CCC43)O2)C1=O Intermediate Fragment 
269 511.0983358481 CC1=CN(C(=[OH+])C#CO)C(=O)N(C2OC3=C(C2=O)C2=C(C=C(O)C4=C2OC(O)C2C(O)CCC42)O3)C1=O
270 557.1402006601 CC1=CN(C(=C=CO)OC#C[OH2+])C(=O)N(C2OC3=C(C2=O)C2=C(CC(O)C4C2OC(O)C2C(O)CCC24)O3)C1=O Intermediate Fragment 
271 527.1296359761 C=C([OH+]C#CO)N1C=C(C)C(=O)N(C2OC3=C(C2=O)C2=C(C=C(O)C4C2OC(O)C2C(O)CCC42)O3)C1=O
272 557.1402006601 CC=C(O)N(C(=O)N(C)C1C=C(O)C(=C=[OH+])O1)C1OC2=C(C1=O)C1=C(C=C(O)C3=C1OC(O)C1C(O)CCC31)O2 Intermediate Fragment 
273 503.1296359761 C[NH+](C(O)=NC1OC2=C(C1=O)C1=C(C=C(O)C3C1OC(O)C1C(O)CCC31)O2)C1C=C(O)C(=C=O)O1
274 557.1402006601 CC=CN(C(=O)N(C=O)C1OC2=C(C1=O)C1=C(C=C(O)C3C1OC(O)C1C(O)CCC31)O2)C1C=C(O)C(=C=[OH+])O1 Intermediate Fragment 
275 529.1452860401 CC#C[NH+](C(O)=NC1OC2=C(C1=O)C1=C(CC(O)C3C1OC(O)C1C(O)CCC13)O2)C1C=C(O)C(=C=O)O1
276 172.0968197281 CCC[NH2+]C1C=C(O)C(=CO)O1
277 56.0494756121 CCC#[NH+]
278 172.0968197281 CCC[NH2+]C(O)=C=C(O)C=CO Intermediate Fragment 
279 557.1402006601 CC(C=O)=CN(C(O)=NC1OC2=C(C1=O)C1=C(C=C(O)C3C1OC(O)C1C(O)CCC31)O2)C1C=C(O)C(=C=[OH+])O1 Intermediate Fragment 
280 489.1139859121 O=C=C1OC(=[NH+]C(O)=NC2OC3=C(C2=O)C2=C(CC(O)C4C2OC(O)C2C(O)CCC24)O3)C=C1O
281 527.1296359761 CC#C[NH+](C(O)=NC1OC2=C(C1=O)C1=C(C=C(O)C3C1OC(O)C1C(O)CCC31)O2)C1C=C(O)C(=C=O)O1
282 230.1022990321 CC(CO)C[NH+](CO)C1C=C(O)C(=C=O)O1
283 228.0866489681 CC(=C[NH+](CO)C1C=C(O)C(=C=O)O1)CO
284 226.0709989041 CC(C=O)=C[NH+](CO)C1C=C(O)C(=C=O)O1
285 200.0917343481 CC(CO)C[NH2+]C1C=C(O)C(=C=O)O1
286 557.1402006601 CC(=CN(C=O)C1C=C(O)C(=C=[OH+])O1)C(=O)N=C1OC2=C(C1=O)C1=C(CC(O)C3C1OC(O)C1C(O)CCC13)O2 Intermediate Fragment 
287 404.1339930841 C=C(C)C(=O)[NH+]=C1OC2=C(C1=O)C1=C(CC(O)C3C1OC(O)C1C(O)CCC13)O2
288 402.1183430201 C=C(C)C(=O)[NH+]=C1OC2=C(C1=O)C1=C(C=C(O)C3C1OC(O)C1C(O)CCC31)O2
289 400.1026929561 C=C(C)C(=O)[NH+]=C1OC2=C(C1=O)C1=C(C=C(O)C3=C1OC(O)C1C(O)CCC31)O2
290 382.0557427641 CC=C(O)[NH+]=C1OC2=C(C1=O)C1=C(C=C(O)C3=C1OC(=O)C1=C3C=CC1O)O2
291 196.0604342201 CC#C[NH+](CO)C1C=C(O)C(=C=O)O1
292 198.0760842841 CC=C[NH+](CO)C1C=C(O)C(=C=O)O1
293 200.0917343481 CCC[NH+](CO)C1C=C(O)C(=C=O)O1
294 529.1452860401 CC(=C[NH+]=C1C=C(O)C(=C=O)O1)C(=O)N=C1OC2=C(C1=O)C1C(CC(O)C3C4CCC(O)C4C(O)OC13)O2
295 511.1347213561 C=C1OC(=[NH+]C=C(C)C(=O)N=C2OC3=C(C2=O)C2=C(C=C(O)C4C2OC(O)C2C(O)CCC42)O3)C=C1O
296 419.1448921161 CC(C#[NH+])=C(O)N=C1OC2=C(C1=O)C1C(CC(O)C3C4CCC(O)C4C(O)OC13)O2
297 198.0760842841 CC(CO)C[NH+]=C1C=C(O)C(=C=O)O1
298 202.1073844121 CC(CO)C[NH2+]C1C=C(O)C(=CO)O1
299 511.1347213561 CC(=C[NH+]=C1C=CC(=C=O)O1)C(=O)N=C1OC2=C(C1=O)C1=C(CC(O)C3C1OC(O)C1C(O)CCC13)O2
300 529.1452860401 C=C([NH+]=C=C(C)C(=O)N=C1OC2=C(C1=O)C1=C(CC(O)C3C1OC(O)C1C(O)CCC13)O2)OC(=C=O)CO Intermediate Fragment 
301 439.1135919881 C#C[NH+]=C=C(C)C(=O)N=C1OC2=C(C1=O)C1=C(C=C(O)C3C1OC(O)C1C(O)CCC31)O2
302 455.1085066081 C=C(O)[NH+]=C=C(C)C(=O)N=C1OC2=C(C1=O)C1=C(C=C(O)C3=C1OC(O)C1C(O)CCC31)O2
303 529.1452860401 C=C(O)C(=C=O)OC=[NH+]C=C(C)C(=O)N=C1OC2=C(C1=O)C1=C(CC(O)C3C1OC(O)C1C(O)CCC13)O2 Intermediate Fragment 
304 443.1085066081 CC(=C[NH+]=C=O)C(=O)N=C1OC2=C(C1=O)C1=C(C=C(O)C3C1OC(O)C1C(O)CCC31)O2
305 529.1452860401 CC(=C[NH+]=C=C=C(O)C(=O)C=O)C(=O)N=C1OC2=C(C1=O)C1C(CC(O)C3C4CCC(O)C4C(O)OC13)O2 Intermediate Fragment 
306 529.1452860401 CC(=C=[NH+]C(O)=C=C(O)C#CO)C(=O)N=C1OC2=C(C1=O)C1C(CC(O)C3C4CCC(O)C4C(O)OC13)O2 Intermediate Fragment 
307 485.1190712921 CC(=C=[NH+]C(=O)C#CO)C(=O)N=C1OC2=C(C1=O)C1=C(CC(O)C3C1OC(O)C1C(O)CCC13)O2
308 529.1452860401 CC(=C=[NH+]C(=C=CO)OC#CO)C(=O)N=C1OC2=C(C1=O)C1C(CC(O)C3C4CCC(O)C4C(O)OC13)O2 Intermediate Fragment 
309 529.1452860401 CC(=C[NH+]=C1C=C(O)C(=C=O)O1)C(=O)N=COC1=C(C=O)C2=C(CC(O)C3C2OC(O)C2C(O)CCC23)O1 Intermediate Fragment 
310 527.1296359761 CC(=C[NH+]=C1C=C(O)C(=C=O)O1)C(=O)N=C1OC2=C(C1=O)C1=C(CC(O)C3C1OC(O)C1C(O)CCC13)O2
311 525.1139859121 CC(=C[NH+]=C1C=C(O)C(=C=O)O1)C(=O)N=C1OC2=C(C1=O)C1=C(C=C(O)C3C1OC(O)C1C(O)CCC31)O2
312 557.1402006601 CC(=CN=C1C=C(O)C(=C=[OH+])O1)C(=O)N(C=O)C1OC2=C(C1=O)C1=C(CC(O)C3C1OC(O)C1C(O)CCC13)O2 Intermediate Fragment 
313 432.1289077041 C=C(C)C(=O)[NH+](C=O)C1OC2=C(C1=O)C1=C(C=C(O)C3C1OC(O)C1C(O)CCC31)O2
314 430.1132576401 C=C(C)C(=O)[NH+](C=O)C1OC2=C(C1=O)C1=C(C=C(O)C3=C1OC(O)C1C(O)CCC31)O2
315 428.0976075761 C=C(C)C(=O)[NH+](C=O)C1OC2=C(C1=O)C1=C(C=C(O)C3=C1OC(=O)C1C(O)CCC31)O2
316 112.0393048521 C=C(C)C(=O)[NH+]=C=O
317 426.0819575121 C=C(C)C(=O)[NH+](C=O)C1OC2=C(C1=O)C1=C(C=C(O)C3=C1OC(=O)C1=C3CCC1O)O2
318 144.0655196001 C[NH2+]C1C=C(O)C(=CO)O1
319 388.0663074481 O=C[NH+](C=O)C1OC2=C(C1=O)C1=C(C=C(O)C3=C1OC(=O)C1C(O)CCC31)O2
320 168.0655196001 CCC[NH+]=C1C=C(O)C(=C=O)O1
321 170.0811696641 CCC[NH2+]C1C=C(O)C(=C=O)O1
322 174.1124697921 CCC[NH2+]C1C=C(O)C(CO)O1
323 202.1073844121 CC(CO)C[NH2+]C(O)=C=C(O)C=CO Intermediate Fragment 
324 557.1402006601 C=C(C)C(=O)N(C(=O)N=C1C=C(O)C(=C=[OH+])O1)C1OC2=C(C1=O)C1=C(CC(O)C3C1OC(O)C1C(O)CCC13)O2 Intermediate Fragment 
325 557.1402006601 CC1=CN(C2C=C(O)C(=C=[OH+])O2)C(=O)N(CC(O)=C2C(=O)OC3=C2C2OC(O)C4C(O)CCC4C2C(O)=C3)C1=O Intermediate Fragment 
326 539.1296359761 CC1=CN(C2C=C(O)C(=C=[OH+])O2)C(=O)N(CC(=O)C2=COC3=C2C2=C(C(O)=C3)C3CCC(O)C3C(O)O2)C1=O
327 425.0979419241 CC1=C([OH2+])N(CC(=O)C2=COC3=C2C2=C(C(O)=C3)C3=C(C(=O)O2)C(O)CC3)C(=O)N=C1
328 283.0924626201 CC1=CN(C2C=C(O)C(=C=[OH+])O2)C(O)N(CCO)C1=O
329 257.1131980641 CC1CN(C2C=C(O)C(=C=[OH+])O2)C(O)N(C)C1O
330 257.1131980641 CC1CN(C(O)=C=C(O)C#C[OH2+])C(O)N(C)C1O Intermediate Fragment 
331 255.0975480001 CC1=CN(C2C=C(O)C(=C=[OH+])O2)C(O)N(C)C1O
332 255.0975480001 CC1=CN(C=C=C(O)C(=O)C=[OH+])C(O)N(C)C1O Intermediate Fragment 
333 255.0975480001 CC1=CN(C(O)=C=C(O)C#C[OH2+])C(O)N(C)C1O Intermediate Fragment 
334 253.0818979361 CC1=CN(C2C=C(O)C(=C=[OH+])O2)C(O)N(C)C1=O
335 253.0818979361 CC1=CN(C=C=C(O)C(=O)C=[OH+])C(O)N(C)C1=O Intermediate Fragment 
336 251.0662478721 CC1=CN(C2C=C(O)C(=C=[OH+])O2)C(=O)N(C)C1=O
337 303.0499291121 O=C=C1C(=[OH+])OC2=C1C1=C(C(O)=C2)C2CCC(O)C2C(=O)O1
338 557.1402006601 CC1=CN(C2C=C(O)C(=C=[OH+])O2)C(=O)N(COC2=C(C=O)C3=C(C=C(O)C4C3OC(O)C3C(O)CCC43)O2)C1=O Intermediate Fragment 
339 557.1402006601 CC1=CN(C2C=C(O)C(=C=[OH+])O2)C(=O)N(C(C=O)OC2=CC3=C(C=C(O)C4C3OC(O)C3C(O)CCC43)O2)C1=O Intermediate Fragment 
340 279.0863146201 OC1C=C2OC(=[OH+])C=C2C2=C1C1CCC(O)C1C(O)O2
341 277.0706645561 O=C1OC2=C(C(O)C=C3OC(=[OH+])C=C32)C2CCC(O)C12
342 257.0444498081 OC1=CC=C2C1=COC1C3=CC(=[OH+])OC3=CC(O)=C21
343 275.0550144921 C=C1C(OC=[OH+])=CC(O)=C2C3=C(C(=O)OC12)C(O)C=C3 Intermediate Fragment 
344 245.0444498081 C=C1C(=[OH+])C=C(O)C2=C1OC(=O)C1=C2C=CC1O
345 275.0550144921 O=C1OC2C(=CC(O)=[OH+])C=CC(O)=C2C2=C1C(O)C=C2 Intermediate Fragment 
346 257.0444498081 O=C1OC2C(=C=C=[OH+])C=CC(O)=C2C2=C1C(O)C=C2
347 275.0550144921 O=C1C=C(O)C2=C(OC(=O)C3C(O)CCC23)C1=C=C=[OH+] Intermediate Fragment 
348 243.0287997441 C=C1C(=[OH+])C=C(O)C2=C1OC(=O)C1=C2C=CC1=O
349 273.0393644281 O=C1C=C(O)C2=C(OC(=O)C3=C2CCC3O)C1=C=C=[OH+]
350 275.0550144921 O=C1OC=C(C(O)=C=C2C=CC(=[OH+])O2)C2=C1C(O)CC2 Intermediate Fragment 
351 275.0550144921 O=C=C1C(O)CCC1C1=C(O)C=C2OC(=[OH+])C=C2C1=O Intermediate Fragment 
352 247.0600998721 O=C1C2=CC(=[OH+])OC2=CC(O)=C1C1=CC(O)CC1
353 275.0550144921 O=C(O)C1=C(C2=C(O)C=C3OC(=[OH+])C=C3C2)C=CC1O Intermediate Fragment 
354 257.0444498081 O=C=C1C(O)=CC=C1C1=C(O)C=C2OC(=[OH+])C=C2C1
355 231.0651852521 OC1C=CC(C2=CC3=CC(=[OH+])OC3=CC2O)=C1
356 229.0495351881 O=C1C=CC(C2=CC3=CC(=[OH+])OC3=CC2O)=C1
357 275.0550144921 C=CC(O)C1=CC2=C(O)C=C3OC(=[OH+])C=C3C2OC1=O Intermediate Fragment 
358 275.0550144921 O=C1C=C(C=CCO)C2=C(O)C=C3OC(=[OH+])C=C3C2O1 Intermediate Fragment 
359 275.0550144921 C=CC1=C(CO)C(=O)OC2C3=CC(=[OH+])OC3=CC(O)=C12 Intermediate Fragment 
360 245.0444498081 C=CC1=CC(=O)OC2C3=CC(=[OH+])OC3=CC(O)=C12
361 275.0550144921 C=C(O)C1=C(C)C2=C(O)C=C3OC(=[OH+])C=C3C2OC1=O Intermediate Fragment 
362 279.0611624921 CC1=CN(C2C=C(O)C(=C=[OH+])O2)C(=O)N(CC=O)C1=O
363 281.0768125561 CC1=CN(C2C=C(O)C(=C=[OH+])O2)C(=O)N(CCO)C1=O
364 285.1081126841 CC1=CN(C2C=C(O)C(=C=[OH+])O2)C(O)N(CCO)C1O
365 285.1081126841 CC1=CN(C=C=C(O)C(=O)C=[OH+])C(O)N(CCO)C1O Intermediate Fragment 
366 285.1081126841 CC1=CN(C(O)=C=C(O)C#C[OH2+])C(O)N(CCO)C1O Intermediate Fragment 
367 285.1081126841 CC(=CN(CO)C1C=C(O)C(=C=[OH+])O1)C(=O)NCCO Intermediate Fragment 
368 257.1131980641 CC(C[NH+]=C1C=C(O)C(=C=O)O1)C(O)NCCO
369 287.1237627481 CC1CN(C2C=C(O)C(=C=[OH+])O2)C(O)N(CCO)C1O
370 287.1237627481 CC1CN(C(O)=C=C(O)C#C[OH2+])C(O)N(CCO)C1O Intermediate Fragment 
371 259.0600998721 C=CC1=C(CO)C(=[OH+])OC2=C1C(O)=CC1=C2C=CO1 Intermediate Fragment 
372 295.0560771121 CC1=CN(C2C=C(O)C(=C=[OH+])O2)C(=O)N(C(=O)CO)C1=O
373 297.0717271761 CC1=CN(C2C=C(O)C(=C=[OH+])O2)C(=O)N(C(O)CO)C1=O
374 301.1030273041 CC1=CN(C2C=C(O)C(=C=[OH+])O2)C(O)N(C(O)CO)C1O
375 303.1186773681 CC1CN(C2C=C(O)C(=C=[OH+])O2)C(O)N(C(O)CO)C1O
376 303.1186773681 CC1CN(C(O)=C=C(O)C#C[OH2+])C(O)N(C(O)CO)C1O Intermediate Fragment 
377 529.1452860401 CC1=CN(C2C=C(O)C(=C=[OH+])O2)C(=O)N(COC2=CC3=C(C=C(O)C4C3OC(O)C3C(O)CCC43)O2)C1=O
378 527.1296359761 CC1=CN(C2C=C(O)C(=C=[OH+])O2)C(=O)N(COC2=CC3=C(C=C(O)C4=C3OC(O)C3C(O)CCC43)O2)C1=O
379 411.0822918601 CC1=C([OH2+])N(COC2=CC3=C(C=C(O)C4=C3OC(=O)C3=C4C=CC3O)O2)C(=O)N=C1
380 525.1139859121 CC1=CN(C2C=C(O)C(=C=[OH+])O2)C(=O)N(COC2=CC3=C(C=C(O)C4=C3OC(=O)C3C(O)CCC43)O2)C1=O
381 557.1402006601 CC1=CN(C2C=C(O)C(=C=[OH+])O2)C(=O)N(C(=O)C(=O)C2=COC3=C2C2OC(O)C4C(O)CCC4C2C(O)C3)C1=O Intermediate Fragment 
382 273.1081126841 CC1CN(C2C=C(O)C(=C=[OH+])O2)C(O)N(CO)C1O
383 273.1081126841 CC1CN(C(O)=C=C(O)C#C[OH2+])C(O)N(CO)C1O Intermediate Fragment 
384 271.0924626201 CC1=CN(C2C=C(O)C(=C=[OH+])O2)C(O)N(CO)C1O
385 269.0768125561 CC1=CN(C2C=C(O)C(=C=[OH+])O2)C(O)N(CO)C1=O
386 271.0600998721 CC1=COC2=C1C1=C(C(O)=C2)C2=C(C(=[OH+])O1)C(O)C=C2
387 289.0706645561 C=C(C=[OH+])C1=C(O)C=C(O)C2=C1OC(=O)C1=C2CCC1O Intermediate Fragment 
388 287.0550144921 C=C(C=[OH+])C1=C(O)C=C(O)C2=C1OC(=O)C1=C2C=CC1O
389 289.0706645561 O=C(O)C1=C(C2=CC3=C(C=C2O)OC=C3C=[OH+])CCC1O Intermediate Fragment 
390 289.0706645561 CC1=C(C(C)O)C(=O)OC2=C1C(O)=CC1=C2C(C=[OH+])=CO1 Intermediate Fragment 
391 557.1402006601 CC1=CN(C2C=C(O)C(=C=[OH+])O2)C(=O)N(C2OC(O)=C(C3=CC=C(O)C4C3OC(O)C3C(O)CCC43)C2=O)C1=O Intermediate Fragment 
392 557.1402006601 CC1=CN(C2C=C(O)C(=C=[OH+])O2)C(=O)N(C2OC(OC3=CC4OC(O)C5C(O)CCC5C4C(O)=C3)=CC2=O)C1=O Intermediate Fragment 
393 327.1186773681 CC1=CN(C2C=C(O)C(=C=[OH+])O2)C(O)N(C2OCCC2O)C1O
394 557.1402006601 CC1=CN(C2C=C(O)C(=C=[OH+])O2)C(=O)N(C2OC=C(C3=C(O)C=C(O)C4C3OC(O)C3C(O)CCC43)C2=O)C1=O Intermediate Fragment 
395 557.1402006601 CC1=CN(C2C=C(O)C(=C=[OH+])O2)C(=O)N(C2OC3=C(C2=O)C(C2OC(O)C4C(O)CCC4C2=CO)=C(C)O3)C1=O Intermediate Fragment 
396 529.1452860401 CC1=CN(C2C=C(O)C(=C=[OH+])O2)C(=O)N(C2OC3=C(C2=O)C(C2CC4CCC(O)C4C(O)O2)=C(C)O3)C1=O
397 411.0822918601 CC1=C([OH2+])N(C2OC3=C(C2=O)C(C2=CC4=C(C(=O)O2)C(O)C=C4)=C(C)O3)C(=O)N=C1
398 557.1402006601 CC1=CN(C2C=C(O)C(=C=[OH+])O2)C(=O)N(C2OC3=C(C2=O)C(C2CC4CCC(O)C4C(O)O2)=C(C=CO)O3)C1=O Intermediate Fragment 
399 557.1402006601 CC1=CN(C2C=C(O)C(=C=[OH+])O2)C(=O)N(C2OC3=C(C=C(C=C(O)C4COC(O)C5C(O)CCC45)O3)C2=O)C1=O Intermediate Fragment 
400 557.1402006601 C=C(O)C1C(C2=COC3=C2C(=O)C(N2C(=O)C(C)=CN(C4C=C(O)C(=C=[OH+])O4)C2=O)O3)OC(O)C2C(O)CCC12 Intermediate Fragment 
401 557.1402006601 CC1=CN(C2C=C(O)C(=C=[OH+])O2)C(=O)N(C2OC3=C(C2=O)C2=C(C=C(O)C(C4CCC(O)C4CO)C2O)O3)C1=O Intermediate Fragment 
402 529.1452860401 CC1=CN(C2C=C(O)C(=C=[OH+])O2)C(=O)N(C2OC3=C(C2=O)C2=C(CC(O)C(C4CCC(O)C4)C2O)O3)C1=O
403 527.1296359761 CC1=CN(C2C=C(O)C(=C=[OH+])O2)C(=O)N(C2OC3=C(C2=O)C2=C(C=C(O)C(C4CCC(O)C4)C2O)O3)C1=O
404 557.1402006601 CC1=CN(C2C=C(O)C(=C=[OH+])O2)C(=O)N(C2OC3=C(C2=O)C2=C(C=C(O)C(C4CCC(O)C4)C2OCO)O3)C1=O Intermediate Fragment 
405 511.1347213561 CC1=CN(C2C=C(O)C(=C=[OH+])O2)C(=O)N(C2OC3=C(C2=O)C2=C(C=C(O)C(C4CCC(O)C4)C2)O3)C1=O
406 513.1503714201 CC1=CN(C2C=C(O)C(=C=[OH+])O2)C(=O)N(C2OC3=C(C2=O)C2=C(CC(O)C(C4CCC(O)C4)C2)O3)C1=O
407 557.1402006601 CC1=CN(C2C=C(O)C(=C=[OH+])O2)C(=O)N(C2OC3=C(C2=O)C2=C(C=C(O)CC2OC(O)C2CCCC2O)O3)C1=O Intermediate Fragment 
408 429.0928565441 CC1=CN(C2C=C(O)C(=C=[OH+])O2)C(=O)N(C2OC3=C(C2=O)C2=C(CC(O)CC2)O3)C1=O
409 557.1402006601 CC1=CN(C2C=C(O)C(=C=[OH+])O2)C(=O)N(C2OC3=C(C2=O)C2=C(C=C(O)C(C4CCC(O)C4C(O)O)C2)O3)C1=O Intermediate Fragment 
410 509.1190712921 CC1=CN(C2C=C(O)C(=C=[OH+])O2)C(=O)N(C2OC3=C(C2=O)C2=C(C=C(O)C(C4CCC(O)C4)=C2)O3)C1=O
411 433.1241566721 CC1=CN(C2C=C(O)C(=C=[OH+])O2)C(=O)N(C2OC3=C(C2O)C2CCC(O)CC2O3)C1=O
412 557.1402006601 CCC(O)C1CC2C(O)=CC3=C(C4=C(O3)OC(N3C(=O)C(C)=CN(C5C=C(O)C(=C=[OH+])O5)C3=O)C4=O)C2OC1O Intermediate Fragment 
413 499.0983358481 CC1=CN(C2C=C(O)C(=C=[OH+])O2)C(=O)N(C2OC3=C(C2=O)C2=C(C=C(O)C4CCC(O)OC24)O3)C1=O
414 497.0826857841 CC1=CN(C2C=C(O)C(=C=[OH+])O2)C(=O)N(C2OC3=C(C2=O)C2=C(C=C(O)C4=C2OC(O)CC4)O3)C1=O
415 385.0666417961 CC1C=NC(=O)N(C2OC3=C(C2=O)C2=C(C=C(O)C4=C2OC(=O)CC4)O3)C1=[OH+]
416 497.0826857841 CC1=CN(C=C=C(O)C(=O)C=[OH+])C(=O)N(C2OC3=C(C2=O)C2=C(C=C(O)C4=C2OC(O)CC4)O3)C1=O Intermediate Fragment 
417 557.1402006601 CC1=CN(C2C=C(O)C(=C=[OH+])O2)C(=O)N(C2OC3=C(C2=O)C2=C(C=C(O)C4C(CCCO)CC(O)OC24)O3)C1=O Intermediate Fragment 
418 511.0983358481 CC1=CN(C2C=C(O)C(=C=[OH+])O2)C(=O)N(C2OC3=C(C2=O)C2=C(C=C(O)C4=C2OC(O)CC4C)O3)C1=O
419 557.1402006601 CCC1C(CO)C(O)OC2C3=C(C=C(O)C21)OC1=C3C(=O)C(N2C(=O)C(C)=CN(C3C=C(O)C(=C=[OH+])O3)C2=O)O1 Intermediate Fragment 
420 525.1139859121 CCC1CC(O)OC2=C1C(O)=CC1=C2C2=C(O1)OC(N1C(=O)C(C)=CN(C3C=C(O)C(=C=[OH+])O3)C1=O)C2=O
421 557.1402006601 CC1=CN(C2C=C(O)C(=C=[OH+])O2)C(=O)N(C2OC3=C(C2=O)C2=C(C=C(O)C4C2OC(O)C(C(C)O)C4C)O3)C1=O Intermediate Fragment 
422 555.1245505961 CC1=CN(C2C=C(O)C(=C=[OH+])O2)C(=O)N(C2OC3=C(C2=O)C2=C(C=C(O)C4C2OC(O)C2C(O)CCC42)O3)C1=O
