#In-silico ESI-MS/MS [M+H]+ Spectra
#PREDICTED BY CFM-ID 4.0.8
#SMILES=[C@H]1(C[C@@H](O[C@@H]1CO)n1c(c(c(=O)[nH]c1=O)C)Br)O
#InChiKey=SJSCOJVDZAECPR-FSDSQADBSA-N
energy0
204.96072 20.70 5 46 69 58 56 65 38 (11.601 1.481 0.35559 0.30807 0.24463 0.14915 0.020075)
321.00806 100.00 0 141 140 116 170 164 182 175 108 169 167 165 (66.386 0.75255 0.5978 0.33526 0.13019 0.10376 0.037547 0.02485 0.022045 0.016129 0.0032745 0.0015389)
energy1
43.01784 6.71 84 (1.6502)
45.03349 7.40 83 (1.8203)
57.03349 6.56 81 (1.614)
73.02841 7.33 92 (1.8037)
75.04406 4.18 91 (1.0287)
87.04406 11.66 77 103 (2.4404 0.42886)
99.04406 45.67 9 97 88 (8.0781 2.0107 1.146)
101.05971 4.89 10 (1.2021)
117.05462 7.37 86 101 106 95 89 94 (0.75356 0.45407 0.35055 0.1829 0.053111 0.019916)
161.95490 8.88 47 44 53 (1.7318 0.28118 0.17266)
187.93417 6.59 54 70 (1.4104 0.20972)
204.96072 100.00 5 46 58 56 65 69 38 (19.22 3.2167 0.60266 0.56149 0.47502 0.37337 0.14989)
216.96072 12.25 117 122 118 (2.889 0.079989 0.044956)
230.93998 7.09 132 133 (1.5351 0.20831)
232.95563 41.29 134 135 (9.6727 0.48558)
246.97128 7.49 113 114 (1.8178 0.024522)
276.98185 8.58 18 152 153 (2.0374 0.03825 0.034452)
302.99750 14.90 3 20 148 16 13 14 15 21 19 (3.1486 0.15567 0.097438 0.090998 0.078923 0.038228 0.023749 0.020557 0.010613)
321.00806 19.78 0 141 108 140 175 164 182 165 170 116 167 169 (2.5142 1.9975 0.15824 0.095724 0.028569 0.023563 0.013697 0.010948 0.0096908 0.0091528 0.0018428 0.0016308)
energy2
43.01784 11.56 84 (1.2735)
45.03349 24.86 83 (2.7376)
71.04914 24.66 130 131 (1.7377 0.97819)
73.02841 33.15 92 (3.6513)
75.04406 83.36 91 (9.1815)
87.04406 12.51 103 77 (1.2923 0.085618)
99.04406 21.33 9 88 97 (1.181 1.0534 0.11487)
118.94909 14.99 33 (1.6509)
125.03455 63.43 37 (6.9866)
133.95999 16.02 42 (1.7639)
161.95490 13.25 47 44 53 (0.80893 0.38323 0.26704)
186.95015 13.28 36 35 (0.73884 0.72408)
202.94507 61.23 6 71 55 57 (4.13 1.7424 0.44301 0.42815)
204.96072 100.00 5 58 46 38 69 65 56 (5.3063 2.0605 1.1687 0.77294 0.67028 0.52873 0.50669)
206.97637 39.29 4 32 29 31 27 28 30 (1.4013 0.74656 0.60594 0.52366 0.43637 0.33294 0.2802)
216.96072 44.52 118 117 122 (3.8871 0.58003 0.43637)
228.96072 25.92 109 (2.8553)
230.97637 80.96 111 110 (6.172 2.7454)
232.95563 31.54 135 134 (2.4356 1.0387)
236.98693 11.31 138 (1.2454)

0 321.0080600681 Cc1c(Br)n(C2CC(O)C(C[OH2+])O2)c(=O)[nH]c1=O
1 288.9818453201 CC1=C(Br)N(C2C=C(O)CO2)C(O)=NC1=[OH+]
2 290.9974953841 CC1=C(Br)N(C2C=C(O)CO2)C(O)NC1=[OH+]
3 302.9974953841 C=C1OC(N2C(Br)=C(C)C(=[OH+])NC2O)C=C1O
4 206.9763660161 CC1C(=[OH+])NC(O)N=C1Br
5 204.9607159521 CC1C(=[OH+])N=C(O)N=C1Br
6 202.9450658881 C=C1C(=[OH+])N=C(O)N=C1Br
7 200.9294158241 [CH+]=C1C(=O)N=C(O)N=C1Br
8 97.0284058201 C=C1OC=CC1=[OH+]
9 99.0440558841 C=C1OC=CC1[OH2+]
10 101.0597059481 CC1OC=CC1[OH2+]
11 223.0713332521 C=C1OC(N2C=C(C)C(=[OH+])N=C2O)C=C1O
12 284.9869307001 C=C1C=CC(N2C(O)=NC(=[OH+])C(C)=C2Br)O1
13 302.9974953841 C=C(CO)OC(=C)N1C(O)=NC(=[OH+])C(C)=C1Br Intermediate Fragment 
14 302.9974953841 CC(=O)C(O)=C=CN1C(Br)=C(C)C(=[OH+])NC1O Intermediate Fragment 
15 302.9974953841 C#CC(O)=C=C(O)N1C(Br)=C(C)C([OH2+])NC1O Intermediate Fragment 
16 302.9974953841 C#COC(=C=CO)N1C(Br)=C(C)C([OH2+])NC1O Intermediate Fragment 
17 260.9869307001 CC1=C(Br)N(CC#CO)C(O)NC1=[OH+]
18 276.9818453201 CC1=C(Br)N(C(=[OH+])C#CO)C(O)NC1O
19 302.9974953841 C=C1OC(N(C=O)C(Br)=C(C)C(N)=[OH+])C=C1O Intermediate Fragment 
20 302.9974953841 C=C1OC(=NC(Br)=C(C)C(=[OH+])NCO)C=C1O Intermediate Fragment 
21 302.9974953841 C=C1OC(=NC(O)NC(=[OH+])C(C)=CBr)C=C1O Intermediate Fragment 
22 211.0076661441 CC1C([OH2+])NC(O)NC1Br
23 208.9920160801 CC1C(Br)=NC(O)NC1[OH2+]
24 188.9658013321 CC1=CN=C([OH2+])N=C1Br
25 188.9658013321 CC1=C([OH2+])N=CN=C1Br
26 127.0502038841 CC1=C([OH2+])N=C(O)N=C1
27 206.9763660161 CC(C(=N)Br)=C([OH2+])N=CO Intermediate Fragment 
28 206.9763660161 CC(C(Br)=NC=O)=C(N)[OH2+] Intermediate Fragment 
29 206.9763660161 CC(=C=[OH+])C(Br)=NC(N)O Intermediate Fragment 
30 206.9763660161 CCC(Br)=NC(O)N=C=[OH+] Intermediate Fragment 
31 206.9763660161 CC=C([OH2+])N=C(O)N=CBr Intermediate Fragment 
32 206.9763660161 CC(=CBr)C(=[OH+])N=C(N)O Intermediate Fragment 
33 118.9490886481 CC#C[BrH+]
34 189.9498169201 CC(=CBr)C(=O)[NH+]=C=O
35 186.9501512681 [CH2+]C1=CN=C(O)N=C1Br
36 186.9501512681 [CH2+]C1=C(O)N=CN=C1Br
37 125.0345538201 [CH2+]C1=C(O)N=C(O)N=C1
38 204.9607159521 CC(C(=N)Br)=C([OH2+])N=C=O Intermediate Fragment 
39 74.0236547881 O=C=[NH+]CO
40 72.0080047241 O=C=[NH+]C=O
41 131.9443376161 C#CC(=[NH2+])Br
42 133.9599876801 C=CC(=[NH2+])Br
43 159.9392522361 [CH2+]C(=C=O)C(=N)Br
44 161.9549023001 CC(=C=O)C(=[NH2+])Br
45 176.9658013321 C=C(C(=[NH2+])Br)C(N)=O
46 204.9607159521 CC(C(Br)=NC#[O+])=C(N)O Intermediate Fragment 
47 161.9549023001 CC(=[C+]Br)C(N)=O
48 72.0443902321 C=CC([NH3+])=O
49 70.0287401681 C#CC([NH3+])=O
50 133.9236021721 O=C[N+]#CBr
51 135.9392522361 O=C[NH+]=CBr
52 159.9392522361 C#CC(Br)=[NH+]C=O
53 161.9549023001 C=CC(Br)=[NH+]C=O
54 187.9341668561 CC(=C=O)C(Br)=NC#[O+]
55 202.9450658881 C=C(C(N)=O)C(Br)=NC#[O+]
56 204.9607159521 CC(=C=[OH+])C(Br)=NC(=N)O Intermediate Fragment 
57 202.9450658881 [CH2+]C(=C=O)C(Br)=NC(=N)O
58 204.9607159521 CCC(Br)=NC(=O)N=C=[OH+] Intermediate Fragment 
59 116.9334385841 [CH2+]C#CBr
60 87.0189037561 [NH3+]C(=O)N=C=O
61 176.9658013321 C=CC(Br)=[NH+]C(=N)O
62 44.0130901041 [NH2+]=C=O
63 46.0287401681 [NH3+]C=O
64 69.9923546601 O=C=[N+]=C=O
65 204.9607159521 C=C=C([OH2+])N=C(O)N=CBr Intermediate Fragment 
66 55.0178411361 C=C=C=[OH+]
67 98.0236547881 C=C=C(O)[NH+]=C=O
68 100.0393048521 CC=C(O)[NH+]=C=O
69 204.9607159521 [CH2+]C(=CBr)C(=O)N=C(N)O Intermediate Fragment 
70 187.9341668561 CC(=[C+]Br)C(=O)N=C=O
71 202.9450658881 C=CC(Br)=NC(=O)N=C=[OH+] Intermediate Fragment 
72 111.0076703761 O=C1C=COC1=C=[OH+]
73 113.0233204401 OC1C=COC1=C=[OH+]
74 85.0284058201 [OH+]=C1C=COC1
75 113.0233204401 C=C=C(O)C(=O)C=[OH+] Intermediate Fragment 
76 115.0389705041 OC1C=COC1=C[OH2+]
77 87.0440558841 [OH2+]C1C=COC1
78 97.0284058201 [OH+]=C=C1C=CCO1
79 115.0389705041 C=C=C(O)C(=O)C[OH2+] Intermediate Fragment 
80 97.0284058201 C=C=C(O)C#C[OH2+]
81 57.0334912001 C=C=C[OH2+]
82 115.0389705041 O=C=C=C(O)CC[OH2+] Intermediate Fragment 
83 45.0334912001 C=C[OH2+]
84 43.0178411361 C#C[OH2+]
85 115.0389705041 OC=C=COC=C[OH2+] Intermediate Fragment 
86 117.0546205681 OC1C=COC1C[OH2+]
87 89.0597059481 [OH2+]C1CCOC1
88 99.0440558841 [OH2+]C=C1C=CCO1
89 117.0546205681 C=COC(=C[OH2+])CO Intermediate Fragment 
90 91.0389705041 OCC(=[OH+])CO
91 75.0440558841 OCC=C[OH2+]
92 73.0284058201 OCC#C[OH2+]
93 89.0597059481 C=C[OH+]CCO
94 117.0546205681 C=C(O)C(=C[OH2+])OC Intermediate Fragment 
95 117.0546205681 C=C=C(O)C(O)C[OH2+] Intermediate Fragment 
96 29.0385765801 C=[CH3+]
97 99.0440558841 C=C=C(O)C=C[OH2+]
98 59.0491412641 CC=C[OH2+]
99 59.0127557561 OC=C=[OH+]
100 61.0284058201 OCC=[OH+]
101 117.0546205681 OC=C=C(O)CC[OH2+] Intermediate Fragment 
102 47.0491412641 CC[OH2+]
103 87.0440558841 C=C(O)C=C[OH2+]
104 89.0597059481 C=C(O)CC[OH2+]
105 71.0127557561 OC#CC=[OH+]
106 117.0546205681 OC=C=COCC[OH2+] Intermediate Fragment 
107 241.0818979361 CC1=CN(C2C=C(O)C(=C=[OH+])O2)C(O)NC1O
108 321.0080600681 C=C(OC(=C=[OH+])CO)N1C(Br)=C(C)C(O)NC1O Intermediate Fragment 
109 228.9607159521 C#CN1C(O)=NC(=[OH+])C(C)=C1Br
110 230.9763660161 C#CN1C(Br)=C(C)C(=[OH+])NC1O
111 230.9763660161 C#CN(C(Br)=CC)C(O)N=C=[OH+] Intermediate Fragment 
112 232.9920160801 C#CN1C(Br)=C(C)C([OH2+])NC1O
113 246.9712806361 C=C([OH2+])N1C(O)=NC(=O)C(C)=C1Br
114 246.9712806361 C=C([OH2+])N(C(=O)N=C=O)C(Br)=CC Intermediate Fragment 
115 248.9869307001 C=C([OH2+])N1C(Br)=C(C)C(=O)NC1O
116 321.0080600681 C=C(O)C(=C=[OH+])OCN1C(Br)=C(C)C(O)NC1O Intermediate Fragment 
117 216.9607159521 [CH2+]N1C(O)=NC(=O)C(C)=C1Br
118 216.9607159521 C=C=C(Br)N(C)C(=O)N=C=[OH+] Intermediate Fragment 
119 188.9658013321 C=C=C(Br)[N+](=C)C(=N)O
120 173.9549023001 C=C=C(Br)[N+](=C)C=O
121 145.9599876801 C=C=C(Br)[NH+]=C
122 216.9607159521 [CH+]=NC(O)=NC(=O)C(C)=CBr Intermediate Fragment 
123 218.9763660161 CC1=C(Br)N(C)C(O)=NC1=[OH+]
124 218.9763660161 CC=C(Br)N(C)C(=O)N=C=[OH+] Intermediate Fragment 
125 218.9763660161 C=NC(O)=NC(=[OH+])C(C)=CBr Intermediate Fragment 
126 220.9920160801 CC1=C(Br)N(C)C(O)NC1=[OH+]
127 223.0076661441 CC1=C(Br)N(C)C(O)NC1[OH2+]
128 91.0753560121 CC(O)CC[OH2+]
129 73.0647913281 C=C([OH2+])CC
130 71.0491412641 C=CC(=C)[OH2+]
131 71.0491412641 C#CCC[OH2+]
132 230.9399805081 CC1=C(Br)N(C#[O+])C(O)=NC1=O
133 230.9399805081 CC(C(=O)N=C=O)=C(Br)N=C=[OH+] Intermediate Fragment 
134 232.9556305721 CC1=C(Br)N(C=[OH+])C(O)=NC1=O
135 232.9556305721 CC(=CBr)C(=O)N=C(O)N=C=[OH+] Intermediate Fragment 
136 234.9712806361 CC1=C(Br)N(C=[OH+])C(O)NC1=O
137 234.9712806361 CC(=CBr)C(=O)NC(O)N=C=[OH+] Intermediate Fragment 
138 236.9869307001 CC1=C(Br)N(C=[OH+])C(O)NC1O
139 278.9974953841 CC1=C(Br)N(C[OH+]C#CO)C(O)NC1O
140 321.0080600681 CC1C(O)NC(O)N(C=C=C(O)C(=O)C=[OH+])C1Br Intermediate Fragment 
141 321.0080600681 CC1C(O)NC(O)N(C(O)=C=C(O)C#C[OH2+])C1Br Intermediate Fragment 
142 253.0182308281 C=C([OH2+])N1C(O)NC(O)C(C)C1Br
143 251.0025807641 C=C([OH2+])N1C(Br)=C(C)C(O)NC1O
144 244.9556305721 [CH+]=C(O)N1C(O)=NC(=O)C(C)=C1Br
145 226.9450658881 [C+]#CN1C(O)=NC(=O)C(C)=C1Br
146 83.0127557561 [CH+]=C(O)C#CO
147 85.0284058201 C=C(O)C#C[OH2+]
148 302.9974953841 CC1=C(Br)N(C=C=C(O)C#C[OH2+])C(O)NC1O
149 278.9974953841 CC1C(O)NC(O)N(C(=[OH+])C#CO)C1Br
150 258.9712806361 CC1=C(Br)N(CC#CO)C(O)=NC1=[OH+]
151 258.9712806361 C#CC(=[OH+])N1C(Br)=C(C)C(=O)NC1O
152 276.9818453201 CC(C(Br)=NC(=[OH+])C#CO)=C(O)NCO Intermediate Fragment 
153 276.9818453201 CC(=CBr)C(=O)NC(O)NC(=[OH+])C#CO Intermediate Fragment 
154 131.0451185041 N=C(O)[NH2+]C(=O)C=CO
155 129.0294684401 N=C(O)[NH2+]C(=O)C=C=O
156 191.9654669841 CC(=CBr)C(=O)[NH+]=CO
157 274.9661952561 CC1=C(Br)N(C(=[OH+])C#CO)C(O)NC1=O
158 256.9556305721 CC1=C(Br)N([CH+]C#CO)C(O)=NC1=O
159 256.9556305721 C#CC(=[OH+])N1C(O)=NC(=O)C(C)=C1Br
160 274.9661952561 CC(C(Br)=NC(=[OH+])C#CO)=C(O)N=CO Intermediate Fragment 
161 203.9654669841 CCC(Br)=[NH+]C(=O)C#CO
162 231.9603816041 CC(=CO)C(Br)=[NH+]C(=O)C#CO
163 318.9924100041 CC1=C(Br)N(C([OH2+])=C=C(O)C#CO)C(O)NC1O
164 321.0080600681 CC1C(O)NC(O)N(C(=C=CO)OC#C[OH2+])C1Br Intermediate Fragment 
165 321.0080600681 CC=C(O)NC(O)N(CBr)C1C=C(O)C(=C=[OH+])O1 Intermediate Fragment 
166 249.9709462881 O=C=C1OC([NH+](CO)CBr)C=C1O
167 321.0080600681 CC=C(Br)N(C(O)NCO)C1C=C(O)C(=C=[OH+])O1 Intermediate Fragment 
168 250.0073317961 CCC(Br)[NH2+]C1C=C(O)C(=CO)O1
169 321.0080600681 CC(CO)=C(Br)N(C(N)O)C1C=C(O)C(=C=[OH+])O1 Intermediate Fragment 
170 321.0080600681 CC(=C(Br)N(CO)C1C=C(O)C(=C=[OH+])O1)C(N)O Intermediate Fragment 
171 163.9705523641 CC(=CBr)C([NH3+])=O
172 158.0447841561 O=C=C1OC([NH2+]CO)C=C1O
173 275.9865963521 CC=C(Br)[NH+](CO)C1C=C(O)C(=C=O)O1
174 293.0131454481 CC(C(N)O)C(Br)[NH2+]C1C=C(O)C(=C=O)O1
175 321.0080600681 CC(C(Br)N=C1C=C(O)C(=C=[OH+])O1)C(O)NCO Intermediate Fragment 
176 195.9967671121 CC(=CBr)C(O)[NH2+]CO
177 193.9811170481 CC(=CBr)C(=O)[NH2+]CO
178 245.9760316681 CCC(Br)[NH+]=C1C=C(O)C(=C=O)O1
179 247.9916817321 CCC(Br)[NH2+]C1C=C(O)C(=C=O)O1
180 275.9865963521 CC(CO)C(Br)[NH+]=C1C=C(O)C(=C=O)O1
181 290.9974953841 CC(C(N)O)C(Br)[NH+]=C1C=C(O)C(=C=O)O1
182 321.0080600681 CC(CBr)C(O)NC(O)N=C1C=C(O)C(=C=[OH+])O1 Intermediate Fragment 
183 132.0655196001 [NH3+]C1C=C(O)C(CO)O1
