#In-silico ESI-MS/MS [M+H]+ Spectra
#PREDICTED BY CFM-ID 4.0.8
#SMILES=n1cnc2c(c1Nc1cc3-c4c(C(=O)c5c3c(c1N)ccc5)cccc4)ncn2[C@@H]1O[C@H](CO)[C@@H](C1)O
#InChiKey=ZQAMOJCVFPXOFF-NJDAHSKKSA-N
energy0
379.13019 100.00 22 60 95 51 27 86 34 54 75 68 89 77 84 57 69 92 48 71 45 83 74 72 82 58 53 (62.307 0.27013 0.09945 0.099389 0.063543 0.056635 0.051994 0.048969 0.034968 0.034141 0.025015 0.022111 0.019097 0.014404 0.013476 0.011745 0.010864 0.010169 0.0062494 0.0050212 0.0045565 0.0034395 0.0026095 0.00055413 0.00052625)
495.17753 45.51 0 160 152 134 118 133 106 114 109 124 111 112 127 128 147 116 129 125 126 132 110 117 113 (28.078 0.42005 0.1176 0.074388 0.034468 0.0080497 0.0057132 0.0055936 0.00537 0.0038967 0.0032729 0.00306 0.002041 0.001857 0.0013765 0.0013056 0.0011341 0.00053592 0.00046768 0.00045965 0.00017311 5.7911e-05 5.5858e-05)
energy1
362.10364 33.92 10 91 28 47 87 (21.515 0.3762 0.22009 0.1701 0.10302)
379.13019 100.00 22 92 60 48 95 51 86 74 27 34 89 84 68 45 69 57 77 54 75 58 83 82 71 72 53 (62.994 0.46481 0.41235 0.26018 0.24519 0.21064 0.21058 0.20192 0.1838 0.14662 0.14553 0.082102 0.081898 0.067984 0.061367 0.059948 0.042358 0.037959 0.018643 0.014035 0.01262 0.011828 0.011159 0.0099004 0.0047753)
energy2
45.03349 6.20 155 (1.4175)
57.03349 15.18 149 (3.4702)
71.04914 6.86 175 176 (1.086 0.48149)
134.04612 17.49 25 (3.9989)
136.06177 10.55 98 (2.4127)
246.09134 15.50 4 5 (2.5775 0.9652)
261.10224 9.70 1 (2.2175)
286.09749 6.38 37 (1.4595)
298.09749 9.29 38 (2.1243)
337.10839 5.99 88 30 (0.93639 0.43353)
349.11962 5.65 65 (1.2921)
351.13527 25.29 66 (5.7819)
352.11929 44.33 93 29 55 46 90 (7.1479 0.97606 0.75229 0.74739 0.51225)
361.11962 10.39 26 (2.376)
362.10364 48.24 10 28 91 87 47 (3.9139 2.5069 2.2068 1.3137 1.0867)
363.13527 5.81 7 (1.328)
377.11454 11.19 52 21 44 50 94 67 33 (0.77107 0.60374 0.41475 0.29481 0.27565 0.12487 0.073306)
379.13019 100.00 22 92 60 34 69 51 48 27 95 45 72 57 54 77 89 86 53 58 84 82 71 75 83 68 74 (4.979 4.8417 2.1021 1.4872 1.4595 1.2952 1.1775 1.1711 0.8178 0.58942 0.33478 0.33418 0.30373 0.29013 0.27267 0.24815 0.23478 0.22852 0.14621 0.12971 0.12682 0.10032 0.067564 0.066411 0.058205)

0 495.1775296361 Nc1c([NH2+]c2ncnc3c2ncn3C2CC(O)C(CO)O2)cc2c3c(cccc13)C(=O)c1ccccc1-2
1 261.1022394561 N=C1C(=[NH2+])C=C2C3=C(C=CC=C3)C(=O)C3CC=CC1=C23
2 237.0982166961 OC1CC(N2C=NC3=CN=CN=C32)OC1C[OH2+]
3 248.1069904881 [NH2+]=C1C=CC2=C3CCC=CC3=C(O)C3=CC=CC1=C32
4 246.0913404241 [NH2+]=C1C=CC2=C3C=CC=CC3=C(O)C3=CC=CC1=C32
5 246.0913404241 N=C1C=CC(=C2C=CC=CC2)C2=C1C=CC=C2C#[O+] Intermediate Fragment 
6 477.1669649521 N=C1C(=[NH+]C2=C3N=CN(C4CC(O)C(=CO)O4)C3=NC=N2)C=C2C3=C(C=CC=C3)C=C3CC=CC1=C32
7 363.1352709001 N=C1C2=C3C(=CC4=C(C=CC=C4)C3=CC1[NH+]=C1N=CN=C3N=CN=C31)CC=C2
8 365.1509209641 N=C1C2=C3C(=CC4=C(C=CC=C4)C3=CC1[NH+]=C1N=CN=C3NCN=C31)CC=C2
9 478.1509805401 O=C1C2=C(C=CC=C2)C2=CC(=[NH+]C3=C4N=CN(C5CC(O)C(=CO)O5)C4=NC=N3)C=C3C=CCC1=C32
10 362.1036364241 O=C1C2=C(C=CC=C2)C2=CC(=[N+]=C3N=CN=C4N=CN=C43)C=C3C=CCC1=C32
11 364.1192864881 O=C1C2=C(C=CC=C2)C2=CC([NH+]=C3N=CN=C4N=CN=C43)C=C3C=CCC1=C32
12 119.0702706321 OC1CCOC1C[OH2+]
13 119.0702706321 O=CCC(O)CC[OH2+] Intermediate Fragment 
14 117.0546205681 OC1CCOC1=C[OH2+]
15 99.0440558841 C=C1OCC=C1[OH2+]
16 117.0546205681 CCC(O)C(=O)C=[OH+] Intermediate Fragment 
17 99.0440558841 CC=C(O)C#C[OH2+]
18 117.0546205681 O=CCC(O)C=C[OH2+] Intermediate Fragment 
19 115.0389705041 OC1CCOC1=C=[OH+]
20 111.0076703761 O=C1C=COC1=C=[OH+]
21 377.1145354561 N=C1C2=CC=CC3=C2C(=CC1=[NH+]C1=C2N=CNC2=NC=N1)C1=C(C=CC=C1)C3=O
22 379.1301855201 N=C1C2=CC=CC3=C2C(=CC1=[NH+]C1=C2NCNC2=NC=N1)C1=C(C=CC=C1)C3=O
23 259.0865893921 N=C1C(=[NH2+])C=C2C3=C(C=CC=C3)C(=O)C3=CC=CC1=C32
24 121.0508725801 C1=NC2=NC=[NH+]CC2=N1
25 134.0461215481 [NH2+]=C1N=CN=C2N=CN=C12
26 361.1196208361 N=C1C(=[N+]=C2N=CN=C3N=CN=C32)C=C2C3=C(C=CC=C3)C=C3CC=CC1=C32
27 379.1301855201 N=C=NC1=C(C#[N+]C2=CC3=C4C=CC=CC4=C(O)C4=C3C(=C2N)C=CC4)N=CN1 Intermediate Fragment 
28 362.1036364241 C#[N+]C1=NC=NC1=C=NC1=CC2=C3C=CC=CC3=C(O)C3=C2C(=CC=C3)C1=N
29 352.1192864881 N=C1C2=CC=CC3=C2C(=CC1N=C=C1N=CNC1=[NH2+])C1=C(C=CC=C1)C3=O
30 337.1083874561 N=C1C2=CC=CC3=C2C(=CC1[NH+]=C=C1C=NC=N1)C1=C(C=CC=C1)C3=O
31 335.0927373921 N=C1C2=CC=CC3=C2C(=CC1=[N+]=C=C1C=NC=N1)C1=C(C=CC=C1)C3=O
32 271.0865893921 C#[N+]C1=CC2=C3C=CC=CC3=C(O)C3=CC=CC(=C32)C1=N
33 377.1145354561 N=C1C(N=C=C2N=CNC2=NC#[NH+])=CC2=C3C=CC=CC3=C(O)C3=C2C1=CC=C3
34 379.1301855201 NC1=C2C=CCC3=C2C(=C2C=CC=CC2=C3O)C=C1[N+]#CN=C=NC1=CN=CN1 Intermediate Fragment 
35 94.0399735481 C#[N+]C1=CN=CN1
36 284.0818383601 N=C=[N+]=C1C=C2C3=C(C=CC=C3)C(=O)C3=CC=CC(=C32)C1=N
37 286.0974884241 N=C1C2=C3C(=CC=C2)C(=O)C2=C(C=CC=C2)C3=CC1N=C=[NH2+]
38 298.0974884241 C#[N+]C=NC1=CC2=C3C=CC=CC3=C(O)C3=CC=CC(=C32)C1=N
39 309.0770873281 N#CN=C=[N+]=C1C=C2C3=C(C=CC=C3)C(=O)C3=CC=CC(=C32)C1=N
40 311.0927373921 N#C[NH+]=C=NC1C=C2C3=C(C=CC=C3)C(=O)C3=CC=CC(=C32)C1=N
41 109.0508725801 [NH+]#CN=C1C=NCN1
42 107.0352225161 [NH+]#CN=C1C=NC=N1
43 273.1022394561 C=[NH+]C1=CC2=C3C=CC=CC3=C(O)C3=CC=CC(=C32)C1=N
44 377.1145354561 N=C1C([N+]#CN=C=NC2=CN=CN2)=CC2=C3C=CC=CC3=C(O)C3=C2C1=CC=C3
45 379.1301855201 N=C=NC(=[NH+]C1=CC2=C3C=CC=CC3=C(O)C3=C2C(=CC=C3)C1=N)C1=CNC=N1 Intermediate Fragment 
46 352.1192864881 N=C1C2=CC=CC3=C2C(=CC1=[N+]=C(N)C1=CNC=N1)C1=C(C=CC=C1)C3=O
47 362.1036364241 C#[N+]C(N=C1C=C2C3=C(C=CC=C3)C(=O)C3=C2C(=CC=C3)C1=N)=C1C=NC=N1
48 379.1301855201 C=NC([NH+]=C1C=C2C3=C(C=CC=C3)C(=O)C3=C2C(=CC=C3)C1=N)=C1N=CNC1=N Intermediate Fragment 
49 350.1036364241 N=C1NC=NC1=C=[N+]=C1C=C2C3=C(C=CC=C3)C(=O)C3=C2C(=CC=C3)C1=N
50 377.1145354561 C#[N+]C(N=C1C=C2C3=C(C=CC=C3)C(=O)C3=C2C(=CC=C3)C1=N)=C1N=CNC1=N
51 379.1301855201 C=NC1=C(C(N)=[N+]=C2C=C3C4=C(C=CC=C4)C(=O)C4=C3C(=CC=C4)C2=N)N=CN1 Intermediate Fragment 
52 377.1145354561 C#[N+]C1=C(C(=N)N=C2C=C3C4=C(C=CC=C4)C(=O)C4=C3C(=CC=C4)C2=N)N=CN1
53 379.1301855201 C=C([NH+]=C1N=CN=C2N=CN=C21)C(=N)C1=CC=CC2=C1C=C1C=CC=CC1=C2O Intermediate Fragment 
54 379.1301855201 N#CC(C=C1C2=C(C=CC=C2)C(=O)C2=C1C=CC=C2)=[NH+]C1=C2NCNC2=NC=N1 Intermediate Fragment 
55 352.1192864881 O=C1C2=C(C=CC=C2)C(=C=C[NH+]=C2N=CN=C3NCN=C32)C2=C1C=CC=C2
56 350.1036364241 O=C1C2=C(C=CC=C2)C(=C=C[NH+]=C2N=CN=C3N=CN=C32)C2=C1C=CC=C2
57 379.1301855201 N=C=C1C=CCC2=C1C(=C=C=[NH+]C1=C3NCNC3=NC=N1)C1=C(C=CC=C1)C2=O Intermediate Fragment 
58 379.1301855201 C=C1C2=C(C=CC=C2)C(=O)C2=C1C(=C(N)C#[N+]C1=C3N=CNC3=NC=N1)C=CC2 Intermediate Fragment 
59 234.0913404241 C=C1C2=C(C=CC=C2)C(=O)C2CC=CC(C#[NH+])=C12
60 379.1301855201 NC1=C2C=CCC=C2C(C2=C(C#[O+])C=CC=C2)=CC1=NC1=C2N=CNC2=NC=N1 Intermediate Fragment 
61 107.0491412641 [OH+]=CC1=CC=CC=C1
62 105.0334912001 [O+]#CC1=CC=CC=C1
63 273.0883207081 N=C1C2=CC=CC=C2C=CC1=[N+]=C1N=CN=C2N=CN=C21
64 275.1039707721 N=C1C2=CC=CC=C2C=CC1[NH+]=C1N=CN=C2N=CN=C21
65 349.1196208361 N=C1C2=CC=CC=C2C(C2=CC=CC=C2)=CC1=[N+]=C1N=CN=C2N=CN=C21
66 351.1352709001 N=C1C2=CC=CC=C2C(C2=CC=CC=C2)=CC1[NH+]=C1N=CN=C2N=CN=C21
67 377.1145354561 N=C1C2=CC=CC=C2C(C2=C(C#[O+])C=CC=C2)=CC1=NC1=C2N=CNC2=NC=N1
68 379.1301855201 N=C1C2=CC=CC(C(=O)C3=CC=CC=C3)=C2C=CC1=[NH+]C1=C2N=CNC2=NC=N1 Intermediate Fragment 
69 379.1301855201 N=C1C(=[NH+]C2=C3N=CNC3=NC=N2)C=C(C2=CC=CC=C2)C2=C1C=CCC2=C=O Intermediate Fragment 
70 301.0832353281 N=C1C(N=C2N=CN=C3N=CN=C32)=CCC2=C(C#[O+])C=CC=C12
71 379.1301855201 C=CC1=C2C(=C)C(=N)C(=[NH+]C3=C4N=CNC4=NC=N3)C=C2C2=C(C=CC=C2)C1=O Intermediate Fragment 
72 379.1301855201 C=C=C1C(=N)C(=[NH+]C2=C3N=CNC3=NC=N2)C=C2C3=C(C=CC=C3)C(=O)C(C)=C12 Intermediate Fragment 
73 353.1145354561 C=C1C(=O)C2=C(C=CC=C2)C2=C1C=C(N)C([NH+]=C1N=CN=C3N=CN=C31)=C2
74 379.1301855201 C=C=CC1=C(N)C(=[NH+]C2=C3N=CNC3=NC=N2)C=C2C1=CC(=O)C1=C2C=CC=C1 Intermediate Fragment 
75 379.1301855201 C=C=CC1=C2C=C(N)C(=[NH+]C3=C4N=CNC4=NC=N3)C=C2C2=C(C=CC=C2)C1=O Intermediate Fragment 
76 339.0988853921 NC1=CC2=CC(=O)C3=C(C=CC=C3)C2=CC1=[N+]=C1N=CN=C2N=CN=C21
77 379.1301855201 C=C=CC1=C(C)C(=O)C2=C3C(=CC=C2)C(=N)C(=[NH+]C2=C4N=CNC4=NC=N2)C=C13 Intermediate Fragment 
78 353.1145354561 C=C1C(=O)C2=C3C(=CC=C2)C(=N)C([NH+]=C2N=CN=C4N=CN=C42)=CC3=C1C
79 351.0988853921 [CH+]=C1C(=O)C2=C3C(=CC=C2)C(=N)C(N=C2N=CN=C4N=CN=C42)=CC3=C1C
80 339.0988853921 C=C1C=C2C=C([NH+]=C3N=CN=C4N=CN=C43)C(=N)C3=CC=CC(=C23)C1=O
81 337.0832353281 [CH+]=C1C=C2C=C(N=C3N=CN=C4N=CN=C43)C(=N)C3=CC=CC(=C23)C1=O
82 379.1301855201 C=CC1=C(C=C)C2=CC(=[NH+]C3=C4N=CNC4=NC=N3)C(=N)C3=CC=CC(=C32)C1=O Intermediate Fragment 
83 379.1301855201 C=C=C=CC1=CC2=CC(=[NH+]C3=C4N=CNC4=NC=N3)C(N)=C3C=CCC(=C23)C1=O Intermediate Fragment 
84 379.1301855201 C=C=C=CC1=CC(=O)C2=C3C1=CC(=[NH+]C1=C4N=CNC4=NC=N1)C(N)=C3C=CC2 Intermediate Fragment 
85 353.1145354561 C#CC1=CC(=O)C2=C3C(=CC=C2)C(=N)C(=[NH+]C2=C4NCNC4=NC=N2)C=C13
86 379.1301855201 N=C=NC1=NC=NC([NH+]=C2C=C3C4=C(C=CC=C4)C(=O)C4=C3C(=C2N)C=CC4)=C1 Intermediate Fragment 
87 362.1036364241 C#[N+]C1=NC=NC(N=C2C=C3C4=C(C=CC=C4)C(=O)C4=C3C(=CC=C4)C2=N)=C1
88 337.1083874561 N=C1C2=CC=CC3=C2C(=CC1=[NH+]C1=CC=NC=N1)C1=C(C=CC=C1)C3=O
89 379.1301855201 N=C=NC1=C([NH+]=C2C=C3C4=C(C=CC=C4)C(=O)C4=C3C(=C2N)C=CC4)N=CN=C1 Intermediate Fragment 
90 352.1192864881 N=C1C=NC=NC1=[NH+]C1C=C2C3=C(C=CC=C3)C(=O)C3=C2C(=CC=C3)C1=N
91 362.1036364241 C#[N+]C1=C(N=C2C=C3C4=C(C=CC=C4)C(=O)C4=C3C(=CC=C4)C2=N)N=CN=C1
92 379.1301855201 C=NC1=C([NH+]=C2C=C3C4=C(C=CC=C4)C(=O)C4=C3C(=CC=C4)C2=N)N=CN=C1N Intermediate Fragment 
93 352.1192864881 N=C1C2=CC=CC3=C2C(=CC1=[NH+]C1=CC(N)=NC=N1)C1=C(C=CC=C1)C3=O
94 377.1145354561 C#[N+]C1=C(N=C2C=C3C4=C(C=CC=C4)C(=O)C4=C3C(=CC=C4)C2=N)N=CN=C1N
95 379.1301855201 C=NC1=NC=NC([NH+]=C2C=C3C4=C(C=CC=C4)C(=O)C4=C3C(=CC=C4)C2=N)=C1N Intermediate Fragment 
96 350.1036364241 N=C1C=NC=NC1=[N+]=C1C=C2C3=C(C=CC=C3)C(=O)C3=C2C(=CC=C3)C1=N
97 381.1458355841 N=C1C2=CC=CC3=C2C(=CC1=[NH+]C1=C2NCNC2=NC=N1)C1=C(C=CCC1)C3=O
98 136.0617716121 [NH2+]=C1N=CN=C2NCN=C12
99 383.1614856481 N=C1C2=CC=CC3=C2C(=CC1=[NH+]C1=C2NCNC2=NC=N1)C1=C(CCCC1)C3=O
100 385.1771357121 N=C1C2=CCCC3=C2C(=CC1=[NH+]C1=C2NCNC2=NC=N1)C1=C(CCCC1)C3=O
101 463.1513148881 NC1=C2C=CCC3=C2C(=CC1=[NH+]C1=C2N=CN(C4CC(O)=CO4)C2=NC=N1)C1=C(C=CC=C1)C3=O
102 465.1669649521 NC1=C2C=CCC3=C2C(=CC1=[NH+]C1=C2N=CN(C4CC(O)CO4)C2=NC=N1)C1=C(C=CC=C1)C3=O
103 467.1826150161 NC1=C2C=CCC3=C2C(=CC1=[NH+]C1=C2NCN(C4CC(O)CO4)C2=NC=N1)C1=C(C=CC=C1)C3=O
104 477.1669649521 C=C1OC(N2C=NC3=C([NH+]=C4C=C5C6=C(C=CC=C6)C(=O)C6=C5C(=C4N)C=CC6)N=CN=C32)CC1O
105 477.1669649521 NC1=C2C=CCC3=C2C(=CC1=[NH+]C1=C2N=CN(C4CCC(=CO)O4)C2=NC=N1)C1=C(C=CC=C1)C3=O
106 495.1775296361 N=C=NC1=C(C=[NH+]C2=CC3=C4C=CC=CC4=C(O)C4=C3C(=C2N)C=CC4)N=CN1C1CC(O)C(=CO)O1 Intermediate Fragment 
107 478.1509805401 C=[NH+]C1=C(C=NC2=CC3=C4C=CC=CC4=C(O)C4=C3C(=C2N)C=CC4)N=CN1C1C=C(O)C(=C=O)O1
108 468.1666306041 NC1=C2C=CCC3=C2C(=C2C=CC=CC2=C3O)C=C1N=C=C1N=CN(C2CC(O)C(=CO)O2)C1=[NH2+]
109 495.1775296361 NC1=C2C=CCC3=C2C(=C2C=CC=CC2=C3O)C=C1[NH+]=CN=C=NC1=CN=CN1C1CC(O)C(=CO)O1 Intermediate Fragment 
110 495.1775296361 N=C=NC(=[NH+]C1=CC2=C3C=CC=CC3=C(O)C3=C2C(=C1N)C=CC3)C1=CN(C2CC(O)C(=CO)O2)C=N1 Intermediate Fragment 
111 495.1775296361 C=NC([NH+]=C1C=C2C3=C(C=CC=C3)C(=O)C3=C2C(=C1N)C=CC3)=C1N=CN(C2CC(O)C(=CO)O2)C1=N Intermediate Fragment 
112 495.1775296361 C=NC1=C(C(N)=[NH+]C2=CC3=C4C=CC=CC4=C(O)C4=C3C(=C2N)C=CC4)N=CN1C1CC(O)C(=C=O)O1 Intermediate Fragment 
113 495.1775296361 CC(=[NH+]C1=C2N=CN(C3CC(O)C(=C=O)O3)C2=NC=N1)C(N)=C1C=CCC2=C1C=C1C=CC=CC1=C2O Intermediate Fragment 
114 495.1775296361 N#CC(C=C1C2=C(C=CC=C2)C(=O)C2=C1C=CC=C2)=[NH+]C1=C2NCN(C3CC(O)C(CO)O3)C2=NC=N1 Intermediate Fragment 
115 468.1666306041 O=C1C2=C(C=CC=C2)C(=C=C=[NH+]C2=C3NCN(C4CC(O)C(CO)O4)C3=NC=N2)C2=C1C=CC=C2
116 495.1775296361 N=C=C1C=CCC2=C1C(=C=C=[NH+]C1=C3NCN(C4CC(O)C(CO)O4)C3=NC=N1)C1=C(C=CC=C1)C2=O Intermediate Fragment 
117 495.1775296361 C=C1C2=C(C=CC=C2)C(=O)C2=C1C(=C(N)C=[NH+]C1=C3N=CN(C4CC(O)C(=CO)O4)C3=NC=N1)C=CC2 Intermediate Fragment 
118 495.1775296361 NC1=C2C=CCC=C2C(C2=C(C=O)C=CC=C2)=CC1=[NH+]C1=C2N=CN(C3CC(O)C(=CO)O3)C2=NC=N1 Intermediate Fragment 
119 387.1200147601 NC1=C2C=CCC=C2C=CC1=[NH+]C1=C2N=CN(C3CC(=O)C(=C=O)O3)C2=NC=N1
120 463.1513148881 NC1=C2C=CCC=C2C(C2=CC=CC=C2)=CC1=[NH+]C1=C2N=CN(C3C=C(O)C(=C=O)O3)C2=NC=N1
121 465.1669649521 NC1=C2C=CCC=C2C(C2=CC=CC=C2)=CC1=[NH+]C1=C2N=CN(C3CC(O)C(=C=O)O3)C2=NC=N1
122 467.1826150161 NC1=C2C=CCC=C2C(C2=CC=CC=C2)=CC1=[NH+]C1=C2N=CN(C3CC(O)C(=CO)O3)C2=NC=N1
123 467.1826150161 NC1=C2C=CCC=C2C(C2=CC=CC=C2)=CC1=[NH+]C1=C2N=CN(C(=O)CC(O)C=CO)C2=NC=N1 Intermediate Fragment 
124 495.1775296361 N=C1C(=[NH+]C2=C3N=CN(C4CC(O)C(CO)O4)C3=NC=N2)C=C(C2=CC=CC=C2)C2=C1C=CCC2=C=O Intermediate Fragment 
125 495.1775296361 C=CC1=C2C(=CC(=[NH+]C3=C4N=CN(C5CC(O)C(=CO)O5)C4=NC=N3)C(N)=C2C)C2=C(C=CC=C2)C1=O Intermediate Fragment 
126 495.1775296361 C=CC1=C(N)C(=[NH+]C2=C3N=CN(C4CC(O)C(=CO)O4)C3=NC=N2)C=C2C3=C(C=CC=C3)C(=O)C(C)=C21 Intermediate Fragment 
127 495.1775296361 C=C=CC1=C(C)C(=O)C2=C3C1=CC(=[NH+]C1=C4N=CN(C5CC(O)C(=CO)O5)C4=NC=N1)C(N)=C3C=CC2 Intermediate Fragment 
128 495.1775296361 C=C=C=CC1=CC(=O)C2=C3C1=CC(=[NH+]C1=C4N=CN(C5CC(O)C(CO)O5)C4=NC=N1)C(N)=C3C=CC2 Intermediate Fragment 
129 495.1775296361 N=CN(C1=NC=NC([NH+]=C2C=C3C4=C(C=CC=C4)C(=O)C4=C3C(=C2N)C=CC4)=C1)C1CC(O)C(=CO)O1 Intermediate Fragment 
130 478.1509805401 CN(C1=NC=NC([NH+]=C2C=C3C4=C(C=CC=C4)C(=O)C4=C3C(=C2N)C=CC4)=C1)C1C=C(O)C(=C=O)O1
131 339.1240375201 N=C1C2=CC=CC3=C2C(=CC1=[NH+]C1=CC=NC=N1)C1=C(C=CCC1)C3=O
132 495.1775296361 NC1=C2C=CCC3=C2C(=CC1=[NH+]C1=C(N=C=NC2CC(O)C(CO)O2)C=NC=N1)C1=C(C=CC=C1)C3=O Intermediate Fragment 
133 495.1775296361 C=NC1=C([NH+]=C2C=C3C4=C(C=CC=C4)C(=O)C4=C3C(=C2N)C=CC4)N=CN=C1N=C1CC(O)C(CO)O1 Intermediate Fragment 
134 495.1775296361 NC1=C2C=CCC3=C2C(=CC1=[NH+]C1=C2N=CN(CCC(O)C(=O)CO)C2=NC=N1)C1=C(C=CC=C1)C3=O Intermediate Fragment 
135 477.1669649521 NC1=C2C=CCC3=C2C(=CC1=[NH+]C1=C2N=CN(CCC(O)C#CO)C2=NC=N1)C1=C(C=CC=C1)C3=O
136 459.1564002681 C#CC(O)=CCN1C=NC2=C([NH+]=C3C=C4C5=C(C=CC=C5)C(=O)C5=C4C(=C3N)C=CC5)N=CN=C21
137 435.1564002681 NC1=C2C=CCC3=C2C(=CC1=[NH+]C1=C2N=CN(CC=CO)C2=NC=N1)C1=C(C=CC=C1)C3=O
138 433.1407502041 NC1=C2C=CCC3=C2C(=CC1=[NH+]C1=C2N=CN(CC#CO)C2=NC=N1)C1=C(C=CC=C1)C3=O
139 439.1877003961 NC1=C2C=CCC3=C2C(=CC1=[NH+]C1=C2NCN(CCCO)C2=NC=N1)C1=C(C=CC=C1)C3=O
140 437.1720503321 NC1=C2C=CCC3=C2C(=CC1=[NH+]C1=C2N=CN(CCCO)C2=NC=N1)C1=C(C=CC=C1)C3=O
141 419.1614856481 C=CCN1C=NC2=C([NH+]=C3C=C4C5=C(C=CC=C5)C(=O)C5=C4C(=C3N)C=CC5)N=CN=C21
142 405.1458355841 C=CN1C=NC2=C([NH+]=C3C=C4C5=C(C=CC=C5)C(=O)C5=C4C(=C3N)C=CC5)N=CN=C21
143 391.1301855201 CN1C=NC2=C([NH+]=C3C=C4C5=C(C=CC=C5)C(=O)C5=C4C(=CC=C5)C3=N)N=CN=C21
144 407.1614856481 CCN1C=NC2=C([NH+]=C3C=C4C5=C(C=CC=C5)C(=O)C5=C4C(=C3N)C=CC5)N=CN=C21
145 403.1301855201 C#CN1C=NC2=C([NH+]=C3C=C4C5=C(C=CC=C5)C(=O)C5=C4C(=C3N)C=CC5)N=CN=C21
146 91.0389705041 OCC(=[OH+])CO
147 495.1775296361 CC(OC(=CO)CO)N1C=NC2=C([NH+]=C3C=C4C5=C(C=CC=C5)C(=O)C5=C4C(=C3N)C=CC5)N=CN=C21 Intermediate Fragment 
148 75.0440558841 OCC=C[OH2+]
149 57.0334912001 C#CC[OH2+]
150 421.1407502041 CC(=O)N1C=NC2=C([NH+]=C3C=C4C5=C(C=CC=C5)C(=O)C5=C4C(=C3N)C=CC5)N=CN=C21
151 423.1564002681 CC(O)N1C=NC2=C([NH+]=C3C=C4C5=C(C=CC=C5)C(=O)C5=C4C(=C3N)C=CC5)N=CN=C21
152 495.1775296361 NC1=C2C=CCC3=C2C(=CC1=[NH+]C1=C2N=CN(C(CCO)OC=CO)C2=NC=N1)C1=C(C=CC=C1)C3=O Intermediate Fragment 
153 47.0491412641 CC[OH2+]
154 29.0385765801 C=[CH3+]
155 45.0334912001 C=C[OH2+]
156 449.1356648241 NC1=C2C=CCC3=C2C(=CC1=[NH+]C1=C2N=CN(C(=O)C=CO)C2=NC=N1)C1=C(C=CC=C1)C3=O
157 451.1513148881 NC1=C2C=CCC3=C2C(=CC1=[NH+]C1=C2N=CN(C(=O)CCO)C2=NC=N1)C1=C(C=CC=C1)C3=O
158 453.1669649521 NC1=C2C=CCC3=C2C(=CC1=[NH+]C1=C2N=CN(C(O)CCO)C2=NC=N1)C1=C(C=CC=C1)C3=O
159 451.1513148881 NC1=C2C=CCC3=C2C(=CC1=[NH+]C1=C2N=CN(COC=CO)C2=NC=N1)C1=C(C=CC=C1)C3=O
160 495.1775296361 NC1=C2C=CCC3=C2C(=CC1=[NH+]C1=C2N=CN(C(=O)CC(O)CCO)C2=NC=N1)C1=C(C=CC=C1)C3=O Intermediate Fragment 
161 427.1877003961 CC(O)N1CNC2=C([NH+]=C3C=C4C5=C(C=CCC5)C(=O)C5=C4C(=C3N)C=CC5)N=CN=C21
162 409.1771357121 CCN1CNC2=C([NH+]=C3C=C4C5=C(C=CC=C5)C(=O)C5=C4C(=C3N)C=CC5)N=CN=C21
163 425.1720503321 CC(O)N1CNC2=C([NH+]=C3C=C4C5=C(C=CC=C5)C(=O)C5=C4C(=C3N)C=CC5)N=CN=C21
164 419.1251001401 [CH2+]C(=O)N1C=NC2=C(N=C3C=C4C5=C(C=CC=C5)C(=O)C5=C4C(=C3N)C=CC5)N=CN=C21
165 73.0284058201 OCC#C[OH2+]
166 43.0178411361 C#C[OH2+]
167 55.0178411361 C#CC=[OH+]
168 411.1564002681 NC1=C2C=CCC3=C2C(=CC1=[NH+]C1=C2NCN(CO)C2=NC=N1)C1=C(C=CC=C1)C3=O
169 409.1407502041 NC1=C2C=CCC3=C2C(=CC1=[NH+]C1=C2N=CN(CO)C2=NC=N1)C1=C(C=CC=C1)C3=O
170 407.1251001401 NC1=C2C=CCC3=C2C(=CC1=[NH+]C1=C2N=CN(C=O)C2=NC=N1)C1=C(C=CC=C1)C3=O
171 389.1145354561 [CH2+]N1C=NC2=C(N=C3C=C4C5=C(C=CC=C5)C(=O)C5=C4C(=CC=C5)C3=N)N=CN=C21
172 405.1094500761 NC1=C2C=CCC3=C2C(=CC1=NC1=C2N=CN(C#[O+])C2=NC=N1)C1=C(C=CC=C1)C3=O
173 87.0440558841 CC(O)C#C[OH2+]
174 89.0597059481 CC(O)C=C[OH2+]
175 71.0491412641 C#CC(C)[OH2+]
176 71.0491412641 CCC#C[OH2+]
177 91.0753560121 CC(O)CC[OH2+]
178 73.0647913281 C=CC(C)[OH2+]
179 73.0647913281 CCC=C[OH2+]
