#In-silico ESI-MS/MS [M+H]+ Spectra
#PREDICTED BY CFM-ID 4.0.8
#SMILES=n1cnc2c(c1NCCCC)ncn2[C@H]1C[C@H]([C@H](O1)CO)O
#InChiKey=IGBAYXQTXJRJBV-GMTAPVOTSA-N
energy0
192.12437 100.00 49 95 67 97 108 101 88 61 92 104 (68.235 0.66726 0.21615 0.091685 0.067151 0.054228 0.047698 0.046003 0.03388 0.0065089)
308.17172 24.64 0 197 127 135 198 179 152 131 134 120 132 133 130 (16.946 0.052831 0.042999 0.02049 0.016453 0.014166 0.010786 0.0059549 0.0040051 0.0030177 0.00060987 0.00049162 0.00041361)
energy1
134.04612 15.41 11 (8.3368)
136.06177 31.05 12 (16.804)
164.09307 3.15 36 (1.7039)
192.12437 100.00 49 67 92 101 95 104 97 108 61 88 (50.353 1.0835 0.69912 0.64181 0.42104 0.2586 0.19996 0.16838 0.15183 0.13613)
energy2
41.03858 4.54 9 (1.2791)
45.03349 2.96 45 (0.83591)
57.06988 6.13 8 (1.7281)
61.02841 3.59 155 (1.0122)
73.02841 3.84 157 156 (0.9316 0.15036)
94.03997 4.83 71 (1.3632)
99.09167 4.74 74 (1.3374)
107.03522 4.34 84 (1.2245)
111.09167 2.65 77 (0.74734)
121.05087 7.73 2 149 (1.5755 0.60437)
134.04612 18.77 11 (5.2943)
136.06177 100.00 12 (28.202)
138.07742 5.92 54 (1.6684)
140.09307 6.30 55 (1.7774)
148.06177 10.66 32 145 (1.6991 1.3061)
150.07742 9.04 30 (2.5508)
152.09307 3.47 58 (0.97842)
162.07742 5.84 19 59 (1.0139 0.63317)
163.09782 3.20 106 94 96 110 (0.80087 0.037787 0.034011 0.028604)
164.05669 2.70 183 (0.76139)
164.09307 3.87 36 (1.0919)
165.11347 4.31 107 63 89 102 (0.65151 0.30394 0.20016 0.060611)
175.09782 4.21 103 109 90 62 (0.39024 0.28972 0.26956 0.2368)
176.09307 8.94 40 (2.5202)
192.08799 3.21 21 (0.90567)
192.12437 37.66 67 49 104 95 92 88 61 108 97 101 (3.3303 2.5637 1.7411 0.75274 0.63214 0.53415 0.41854 0.29557 0.18512 0.16803)
196.15567 3.07 114 (0.86678)
198.17132 2.64 115 (0.74313)
234.09855 5.61 22 15 16 (1.0969 0.27507 0.20967)

0 308.1717159841 CCCC[NH2+]c1ncnc2c1ncn2C1CC(O)C(CO)O1
1 235.0825666321 OC1C=C(N2C=NC3=CN=CN=C32)OC1C[OH2+]
2 121.0508725801 C1=NC2=NC=[NH+]CC2=N1
3 237.0982166961 OC1CC(N2C=NC3=CN=CN=C32)OC1C[OH2+]
4 237.0982166961 OC(C=CN1C=NC2=CN=CN=C21)C(O)C[OH2+] Intermediate Fragment 
5 239.1138667601 OC1CC(N2CNC3=CN=CN=C32)OC1C[OH2+]
6 241.1295168241 OC1CC(N2CNC3CN=CN=C32)OC1C[OH2+]
7 59.0855267721 CCC[CH4+]
8 57.0698767081 CCC=[CH3+]
9 41.0385765801 [CH2+]#CC
10 250.0934656641 [NH3+]C1=C2N=CN(C3=CC(O)C(CO)O3)C2=NC=N1
11 134.0461215481 [NH2+]=C1N=CN=C2N=CN=C12
12 136.0617716121 [NH2+]=C1N=CN=C2NCN=C12
13 252.1091157281 [NH3+]C1=C2N=CN(C3CC(O)C(CO)O3)C2=NC=N1
14 117.0546205681 OC1C=COC1C[OH2+]
15 234.0985510441 CC1OC(N2C=NC3=C([NH3+])N=CN=C32)=CC1O
16 234.0985510441 [NH3+]C1=C2N=CN(C3=CCC(CO)O3)C2=NC=N1
17 252.1091157281 [NH3+]C1=C2N=CN(C=CC(O)C(O)CO)C2=NC=N1 Intermediate Fragment 
18 91.0389705041 OC=C([OH2+])CO
19 162.0774216761 C=CN1C=NC2=C([NH3+])N=CN=C21
20 190.0723362961 [NH3+]C1=C2N=CN(C#CCO)C2=NC=N1
21 192.0879863601 [NH3+]C1=C2N=CN(C=CCO)C2=NC=N1
22 234.0985510441 [NH3+]C1=C2N=CN(C#CC(O)CCO)C2=NC=N1
23 252.1091157281 [NH3+]C1=C2N=CN(C(O)=CC(O)CCO)C2=NC=N1 Intermediate Fragment 
24 252.1091157281 [NH3+]C1=C2N=CN(C(=CCO)OCCO)C2=NC=N1 Intermediate Fragment 
25 208.0829009801 [NH3+]C1=C2N=CN(C(O)=CCO)C2=NC=N1
26 254.1247657921 [NH3+]C1=C2NCN(C3CC(O)C(CO)O3)C2=NC=N1
27 256.1404158561 [NH3+]C1N=CN=C2C1NCN2C1CC(O)C(CO)O1
28 258.1560659201 [NH3+]C1N=CNC2C1NCN2C1CC(O)C(CO)O1
29 264.1091157281 C=[NH+]C1=C2N=CN(C3CC(O)C(CO)O3)C2=NC=N1
30 150.0774216761 C=[NH+]C1=C2NCNC2=NC=N1
31 266.1247657921 C=[NH+]C1=C2NCN(C3CC(O)C(CO)O3)C2=NC=N1
32 148.0617716121 C=[NH+]C1=C2N=CNC2=NC=N1
33 266.1247657921 C=[NH+]C1=C2N=CN(CCC(O)C(O)CO)C2=NC=N1 Intermediate Fragment 
34 268.1404158561 C[NH2+]C1=C2NCN(C3CC(O)C(CO)O3)C2=NC=N1
35 278.1247657921 C=C=[NH+]C1=C2NCN(C3CC(O)C(CO)O3)C2=NC=N1
36 164.0930717401 CC=[NH+]C1=C2NCNC2=NC=N1
37 280.1404158561 CC=[NH+]C1=C2NCN(C3CC(O)C(CO)O3)C2=NC=N1
38 282.1560659201 CC[NH2+]C1=C2NCN(C3CC(O)C(CO)O3)C2=NC=N1
39 292.1404158561 CC=C=[NH+]C1=C2NCN(C3CC(O)C(CO)O3)C2=NC=N1
40 176.0930717401 CC=C=[NH+]C1=C2NCNC2=NC=N1
41 178.1087218041 CCC=[NH+]C1=C2NCNC2=NC=N1
42 119.0702706321 OC1CCOC1C[OH2+]
43 99.0440558841 CC1=C([OH2+])C=CO1
44 117.0546205681 C=COC(=CO)C[OH2+] Intermediate Fragment 
45 45.0334912001 C=C[OH2+]
46 117.0546205681 OC=C=C(O)CC[OH2+] Intermediate Fragment 
47 115.0389705041 OC1=C(C[OH2+])OC=C1
48 190.1087218041 CCC=C=[NH+]C1=C2NCNC2=NC=N1
49 192.1243718681 CCCC=[NH+]C1=C2NCNC2=NC=N1
50 72.0807757401 CCCC=[NH2+]
51 123.0665226441 C1=[NH+]CC2=NCNC2=N1
52 125.0821727081 C1=[NH+]CC2NCNC2=N1
53 127.0978227721 C1=[NH+]CC2NCNC2N1
54 138.0774216761 [NH2+]=C1N=CN=C2NCNC12
55 140.0930717401 [NH3+]C1N=CN=C2NCNC21
56 142.1087218041 [NH3+]C1N=CNC2NCNC12
57 45.0698767081 CC[CH4+]
58 152.0930717401 C[NH2+]C1=C2NCNC2=NC=N1
59 162.0774216761 C=C=[NH+]C1=C2NCNC2=NC=N1
60 166.1087218041 CC[NH2+]C1=C2NCNC2=NC=N1
61 192.1243718681 CCC=C[NH+]=CC1=C(N=C=N)NCN1 Intermediate Fragment 
62 175.0978227721 C=CC#CN=CC1=C([NH+]=C)NCN1
63 165.1134728361 CCC=CN=C=C1NCNC1=[NH2+]
64 150.1025738041 CCC#C[NH+]=CC1=CNCN1
65 148.0869237401 C=CC#C[NH+]=CC1=CNCN1
66 84.0807757401 C=[NH+]C=CCC
67 192.1243718681 CCC=C[NH+]=CN=C=NC1=CNCN1 Intermediate Fragment 
68 100.0869237401 C=[NH+]C1CNCN1
69 98.0712736761 C=[NH+]C1=CNCN1
70 96.0556236121 C=[NH+]C1=CN=CN1
71 94.0399735481 C#[N+]C1=CN=CN1
72 95.0603746441 C=CC#CN=C[NH3+]
73 97.0760247081 CCC#CN=C[NH3+]
74 99.0916747721 CCC=CN=C[NH3+]
75 82.0399735481 [NH2+]=C1C=NC=N1
76 109.0760247081 C=[NH+]C=NC#CCC
77 111.0916747721 C=[NH+]C=NC=CCC
78 120.0556236121 C=CC#CN=C[NH+]=C=N
79 122.0712736761 CCC#CN=C[NH+]=C=N
80 124.0869237401 CCC=CN=C[NH+]=C=N
81 113.0821727081 [NH+]#CNC1CNCN1
82 111.0665226441 [NH+]#CN=C1CNCN1
83 109.0508725801 [NH+]#CN=C1C=NCN1
84 107.0352225161 [NH+]#CN=C1C=NC=N1
85 82.0651256761 C=[NH+]C#CCC
86 86.0964258041 C=[NH+]CCCC
87 190.1087218041 CCC#CN=C[NH+]=C=NC1=CNCN1
88 192.1243718681 CCC=C[NH+]=C(N=C=N)C1=CNCN1 Intermediate Fragment 
89 165.1134728361 CCC#CN=C([NH3+])C1=CNCN1
90 175.0978227721 C=CC#CN=C([NH+]=C)C1=CNCN1
91 146.0712736761 C#CC#C[NH+]=CC1=CNCN1
92 192.1243718681 C=NC([NH+]=C=CCC)=C1NCNC1=N Intermediate Fragment 
93 107.0603746441 C=CC#CN=C[NH+]=C
94 163.0978227721 CCC#CN=C=C1NCNC1=[NH2+]
95 192.1243718681 C=NC1=C(C(N)=[NH+]C#CCC)NCN1 Intermediate Fragment 
96 163.0978227721 C=CC#CN=C([NH3+])C1=CNCN1
97 192.1243718681 CCC=C=[NH+]C1=CC(NCN)=NC=N1 Intermediate Fragment 
98 150.1025738041 CCCC=[NH+]C1=CC=NC=N1
99 148.0869237401 CCC=C=[NH+]C1=CC=NC=N1
100 146.0712736761 CC=C=C=[NH+]C1=CC=NC=N1
101 192.1243718681 CCC=C=[NH+]C1=C(NCN)C=NC=N1 Intermediate Fragment 
102 165.1134728361 CCCC=[NH+]C1=C(N)C=NC=N1
103 175.0978227721 CC=C=C=[NH+]C1=C(NC)C=NC=N1
104 192.1243718681 CCC=C=[NH+]C1=C(NC)C(N)=NC=N1 Intermediate Fragment 
105 161.0821727081 CC=C=C=[NH+]C1=CC(N)=NC=N1
106 163.0978227721 CCC=C=[NH+]C1=CC(N)=NC=N1
107 165.1134728361 CCCC=[NH+]C1=CC(N)=NC=N1
108 192.1243718681 CCC=C=[NH+]C1=C(N)C(NC)=NC=N1 Intermediate Fragment 
109 175.0978227721 CC=C=C=[NH+]C1=CC(NC)=NC=N1
110 163.0978227721 CCC=C=[NH+]C1=C(N)C=NC=N1
111 161.0821727081 CC=C=C=[NH+]C1=C(N)C=NC=N1
112 194.1400219321 CCCC[NH2+]C1=C2NCNC2=NC=N1
113 194.1400219321 CCCC[NH+]=CN=C=NC1=CNCN1 Intermediate Fragment 
114 196.1556719961 CCCC[NH2+]C1N=CN=C2NCNC21
115 198.1713220601 CCCC[NH2+]C1N=CNC2NCNC21
116 276.1455012361 CCC=C=[NH+]C1=C2NCN(C3CC(O)CO3)C2=NC=N1
117 278.1611513001 CCCC=[NH+]C1=C2NCN(C3CC(O)CO3)C2=NC=N1
118 290.1611513001 CCC=C=[NH+]C1=C2NCN(C3CC(O)C(C)O3)C2=NC=N1
119 290.1611513001 CCC=C=[NH+]C1=C2NCN(C3CCC(CO)O3)C2=NC=N1
120 308.1717159841 CCC=C[NH+]=CC1=C(N=C=N)N(C2CC(O)C(CO)O2)CN1 Intermediate Fragment 
121 291.1451668881 C=CC#CN=CC1=C([NH+]=C)N(C2CC(O)C(CO)O2)CN1
122 281.1608169521 CCC=CN=C=C1NCN(C2CC(O)C(CO)O2)C1=[NH2+]
123 266.1499179201 CCC#C[NH+]=CC1=CN(C2CC(O)C(CO)O2)CN1
124 88.1120758681 CCCC[NH2+]C
125 223.0825666321 [NH+]#CN=C1C=NCN1C1=CC(O)C(CO)O1
126 225.0982166961 [NH+]#CN=C1C=NCN1C1CC(O)C(CO)O1
127 308.1717159841 CCC=C[NH+]=CN=C=NC1=CNCN1C1CC(O)C(CO)O1 Intermediate Fragment 
128 210.0873176641 C=[NH+]C1=CN=CN1C1=CC(O)C(CO)O1
129 208.0716676001 C=[NH+]C1=CN=CN1C1=CC(O)=C(CO)O1
130 308.1717159841 CCC=C[NH+]=C(N=C=N)C1=CN(C2CC(O)C(CO)O2)CN1 Intermediate Fragment 
131 308.1717159841 C=NC1=C(C(N)=[NH+]C#CCC)NCN1C1CC(O)C(CO)O1 Intermediate Fragment 
132 308.1717159841 CCC=C=[NH+]C1=CC(N(CN)C2CC(O)C(CO)O2)=NC=N1 Intermediate Fragment 
133 308.1717159841 CCC=C=[NH+]C1=C(NCNC2CC(O)C(CO)O2)C=NC=N1 Intermediate Fragment 
134 308.1717159841 CCC=C=[NH+]C1=C(NC)C(NC2CC(O)C(CO)O2)=NC=N1 Intermediate Fragment 
135 308.1717159841 CCC=C=[NH+]C1=C2NCN(COC(CO)C(C)O)C2=NC=N1 Intermediate Fragment 
136 222.1349365521 CCCC=[NH+]C1=C2NCN(CO)C2=NC=N1
137 220.1192864881 CCC=C=[NH+]C1=C2NCN(CO)C2=NC=N1
138 87.0440558841 C=C(O)C=C[OH2+]
139 43.0178411361 C#C[OH2+]
140 69.0334912001 C#CC=C[OH2+]
141 89.0597059481 C=C(O)CC[OH2+]
142 210.1713220601 CCCC[NH2+]C1N=CN=C2C1NCN2C
143 208.1556719961 CCCC[NH2+]C1=C2NCN(C)C2=NC=N1
144 206.1400219321 CCCC=[NH+]C1=C2NCN(C)C2=NC=N1
145 148.0617716121 [CH2+]N1C=NC2=C(N)N=CN=C21
146 206.1400219321 CCC=C[NH+]=CN=C=NC1=CNCN1C Intermediate Fragment 
147 204.1243718681 CCC=C=[NH+]C1=C2NCN(C)C2=NC=N1
148 204.1243718681 CCC#C[NH+]=CN=C=NC1=CNCN1C Intermediate Fragment 
149 121.0508725801 [CH2+]N1CN=CC1=NC#N
150 202.1087218041 CC=C=C=[NH+]C1=C2NCN(C)C2=NC=N1
151 202.1087218041 C=CC#C[NH+]=CN=C=NC1=CNCN1C Intermediate Fragment 
152 308.1717159841 CCC=C=[NH+]C1=C2NCN(CCC(O)C(O)CO)C2=NC=N1 Intermediate Fragment 
153 105.0546205681 C=C(O)C([OH2+])CO
154 93.0546205681 OCC([OH2+])CO
155 61.0284058201 OCC=[OH+]
156 73.0284058201 OC#CC[OH2+]
157 73.0284058201 CC([OH2+])=C=O
158 89.0233204401 O=CC([OH2+])=CO
159 87.0076703761 O=C=C([OH2+])C=O
160 216.1243718681 CC=C=C=[NH+]C1=C2NCN(CC)C2=NC=N1
161 218.1400219321 CCC=C=[NH+]C1=C2NCN(CC)C2=NC=N1
162 220.1556719961 CCCC=[NH+]C1=C2NCN(CC)C2=NC=N1
163 222.1713220601 CCCC[NH2+]C1=C2NCN(CC)C2=NC=N1
164 224.1869721241 CCCC[NH2+]C1N=CN=C2C1NCN2CC
165 63.0440558841 OCC[OH2+]
166 246.1349365521 CC=C=C=[NH+]C1=C2NCN(CCCO)C2=NC=N1
167 248.1505866161 CCC=C=[NH+]C1=C2NCN(CCCO)C2=NC=N1
168 250.1662366801 CCCC=[NH+]C1=C2NCN(CCCO)C2=NC=N1
169 232.1556719961 CCC=C=[NH+]C1=C2NCN(CCC)C2=NC=N1
170 252.1818867441 CCCC[NH2+]C1=C2NCN(CCCO)C2=NC=N1
171 290.1611513001 CC=C=C=[NH+]C1=C2NCN(CCC(O)CCO)C2=NC=N1
172 236.1142011081 [NH3+]C1=C2N=CN(C=CC(O)CCO)C2=NC=N1
173 101.0597059481 C#CC(O)CC[OH2+]
174 75.0440558841 OC=CC[OH2+]
175 244.1192864881 C=C=C=C=[NH+]C1=C2NCN(CCCO)C2=NC=N1
176 272.1505866161 C=C=C=C=[NH+]C1=C2NCN(CCC(O)CC)C2=NC=N1
177 272.1505866161 C=C=C=C=[NH+]C1=C2NCN(CCCCCO)C2=NC=N1
178 290.1611513001 C=CC#C[NH+]=CC1=C(N=C=N)N(CCC(O)CCO)CN1 Intermediate Fragment 
179 308.1717159841 CCC=C=[NH+]C1=C2NCN(C(O)CC(O)CCO)C2=NC=N1 Intermediate Fragment 
180 91.0753560121 CC(O)CC[OH2+]
181 73.0647913281 C=C([OH2+])CC
182 218.1036364241 CC=C=C=[NH+]C1=C2NCN(CO)C2=NC=N1
183 164.0566862321 [NH3+]C1=C2N=CN(C=O)C2=NC=N1
184 224.1505866161 CCCC[NH2+]C1=C2NCN(CO)C2=NC=N1
185 77.0597059481 OCCC[OH2+]
186 59.0491412641 CC=C[OH2+]
187 57.0334912001 CC#C[OH2+]
188 55.0178411361 [CH2+]C#CO
189 232.1192864881 CC=C=C=[NH+]C1=C2NCN(C(C)O)C2=NC=N1
190 234.1349365521 CCC=C=[NH+]C1=C2NCN(C(C)O)C2=NC=N1
191 236.1505866161 CCCC=[NH+]C1=C2NCN(C(C)O)C2=NC=N1
192 238.1662366801 CCCC[NH2+]C1=C2NCN(C(C)O)C2=NC=N1
193 240.1818867441 CCCC[NH2+]C1N=CN=C2C1NCN2C(C)O
194 262.1298511721 CC=C=C=[NH+]C1=C2NCN(C(O)CCO)C2=NC=N1
195 264.1455012361 CCC=C=[NH+]C1=C2NCN(C(O)CCO)C2=NC=N1
196 266.1611513001 CCCC=[NH+]C1=C2NCN(C(O)CCO)C2=NC=N1
197 308.1717159841 CCC=C=[NH+]C1=C2NCN(C(CCO)OCCO)C2=NC=N1 Intermediate Fragment 
198 308.1717159841 CCC=C=[NH+]C1=C2NCN(C(C)OC(CO)CO)C2=NC=N1 Intermediate Fragment 
