#In-silico ESI-MS/MS [M+H]+ Spectra
#PREDICTED BY CFM-ID 4.0.8
#SMILES=n1c[n+](c2c(c1N)ncn2[C@@H]1O[C@H](CO)[C@@H](C1)O)C
#InChiKey=YUURLDZVDFJHRP-BWZBUEFSSA-O
energy0
148.06177 20.46 21 30 29 27 22 34 35 (7.8295 1.0441 0.14219 0.11259 0.099058 0.039776 0.01483)
150.07742 100.00 36 51 44 49 39 58 53 59 56 (44.356 0.44093 0.15484 0.14865 0.095253 0.083633 0.052409 0.034348 0.0057306)
152.09307 62.90 60 66 69 68 79 76 70 63 71 74 (25.435 0.99656 0.83311 0.53415 0.23683 0.19575 0.11436 0.080829 0.075062 0.035692)
energy1
123.06652 10.44 43 40 54 57 50 (3.2306 1.6136 0.71064 0.41372 0.25637)
133.05087 9.93 37 (5.9211)
150.07742 100.00 36 44 51 39 58 53 49 56 59 (54.221 1.6078 1.2464 0.95591 0.62191 0.39299 0.33374 0.21563 0.022836)
152.09307 19.86 60 66 71 76 69 63 74 68 70 79 (9.2818 0.8147 0.50385 0.27202 0.26942 0.24368 0.19914 0.15398 0.087004 0.015511)
energy2
94.03997 22.30 25 33 (4.359 1.4712)
96.05562 49.08 28 24 (8.7806 4.0487)
98.07127 9.83 45 41 (2.1819 0.38695)
108.05562 16.25 55 (4.2486)
121.05087 16.94 23 31 26 (2.8509 1.4757 0.10034)
123.06652 100.00 40 57 54 43 50 (11.845 7.789 3.8864 2.0312 0.58694)
125.08217 20.43 65 77 75 129 (2.4282 1.2802 1.2781 0.3541)
136.06177 38.09 62 80 (9.7788 0.1768)
150.07742 16.26 36 44 39 51 59 58 53 56 49 (1.1614 0.68721 0.57222 0.47783 0.43555 0.29751 0.25932 0.21773 0.14205)
152.09307 11.06 60 79 63 69 76 66 74 71 68 70 (0.81866 0.55049 0.33599 0.26903 0.25659 0.21717 0.16828 0.16078 0.082876 0.03068)
212.10297 5.81 111 119 137 (1.0597 0.37741 0.082896)

0 266.1247657921 C[N+]1=C2C(=C(N)N=C1)N=CN2C1CC(O)C(CO)O1
1 249.0982166961 CN1C=NCC2=C1N(C1CC(O)C(=C=[OH+])O1)C=N2
2 117.0546205681 OC1CCOC1=C[OH2+]
3 89.0597059481 [OH2+]C1CCOC1
4 99.0440558841 C=C1OCC=C1[OH2+]
5 99.0440558841 [OH+]=C=C1CCCO1
6 117.0546205681 CCC(O)C(=O)C=[OH+] Intermediate Fragment 
7 99.0440558841 CC=C(O)C#C[OH2+]
8 59.0491412641 CC=C[OH2+]
9 57.0334912001 CC#C[OH2+]
10 61.0284058201 OCC=[OH+]
11 117.0546205681 O=CCC(O)C=C[OH2+] Intermediate Fragment 
12 89.0597059481 CC(O)C=C[OH2+]
13 117.0546205681 OCCCOC#C[OH2+] Intermediate Fragment 
14 117.0546205681 CCOC(=C=[OH+])CO Intermediate Fragment 
15 115.0389705041 OC1CCOC1=C=[OH+]
16 87.0440558841 [OH2+]C1=COCC1
17 115.0389705041 CC=C(O)C(=O)C=[OH+] Intermediate Fragment 
18 115.0389705041 O=CCC(O)C#C[OH2+] Intermediate Fragment 
19 113.0233204401 O=C1CCOC1=C=[OH+]
20 111.0076703761 O=C1C=COC1=C=[OH+]
21 148.0617716121 [CH2+]N1C=NC(=N)C2=C1NC=N2
22 148.0617716121 [CH2+]N(C=N)C1=C(C#N)N=CN1 Intermediate Fragment 
23 121.0508725801 C=[NH+]C1=C(C#N)N=CN1
24 96.0556236121 [NH+]#CC1=CNCN1
25 94.0399735481 [NH+]#CC1=CNC=N1
26 121.0508725801 C=[N+](C#N)C1=CN=CN1
27 148.0617716121 [CH2+]N(C=NC#N)C1=CN=CN1 Intermediate Fragment 
28 96.0556236121 C=[NH+]C1=CN=CN1
29 148.0617716121 [CH2+]N=C=NC(=N)C1=CNC=N1 Intermediate Fragment 
30 148.0617716121 C=NC(=N)C1=NC=NC1=N[CH2+] Intermediate Fragment 
31 121.0508725801 C#[N+]C(=N)C1=CNC=N1
32 55.0290745161 C=[NH+]C#N
33 94.0399735481 C#[N+]C1=CN=CN1
34 148.0617716121 [CH2+]N1C=NC(=N)C=C1N=C=N Intermediate Fragment 
35 148.0617716121 [CH2+]N1C=NC(=N)C(N=C=N)=C1 Intermediate Fragment 
36 150.0774216761 CN1C=NC(=[NH2+])C2=C1NC=N2
37 133.0508725801 [CH2+]N1C=NC=C2N=CN=C21
38 134.0461215481 [NH2+]=C1N=CN=C2N=CN=C12
39 150.0774216761 CN(C=N)C1=C(C#[NH+])N=CN1 Intermediate Fragment 
40 123.0665226441 C[NH+]=C1NCN=C1C#N
41 98.0712736761 [NH2+]=CC1=CNCN1
42 57.0447245801 CNC#[NH+]
43 123.0665226441 CN(C#[NH+])C1=CN=CN1
44 150.0774216761 CN(C=NC#[NH+])C1=CN=CN1 Intermediate Fragment 
45 98.0712736761 C[NH2+]C1=CN=CN1
46 71.0603746441 C1=C[NH2+]CN1
47 69.0447245801 C1=C[NH+]=CN1
48 82.0399735481 CN=C=[NH+]C#N
49 150.0774216761 CN=C=NC(=[NH2+])C1=CNC=N1 Intermediate Fragment 
50 123.0665226441 C=[NH+]C(=N)C1=CNC=N1
51 150.0774216761 C=NC(N)=C1N=CNC1=N[CH2+] Intermediate Fragment 
52 119.0352225161 C=[N+]=C1N=CN=C1C#N
53 150.0774216761 CN1C=NC(=[NH2+])C=C1N=C=N Intermediate Fragment 
54 123.0665226441 [CH2+]N1C=NC(=N)C=C1N
55 108.0556236121 [CH2+]N1C=CC(=N)N=C1
56 150.0774216761 CN1C=NC(=[NH2+])C(N=C=N)=C1 Intermediate Fragment 
57 123.0665226441 [CH2+]N1C=NC(=N)C(N)=C1
58 150.0774216761 C=NC1=C(N)N([CH2+])C=NC1=N Intermediate Fragment 
59 150.0774216761 C=NC1=C(N)C(=N)N=CN1[CH2+] Intermediate Fragment 
60 152.0930717401 CN1C=NC(=[NH2+])C2=C1NCN2
61 135.0665226441 [CH2+]N1C=NCC2=C1NC=N2
62 136.0617716121 [NH3+]C1=C2N=CNC2=NC=N1
63 152.0930717401 CN(C=N)C1=C(C#[NH+])NCN1 Intermediate Fragment 
64 135.0665226441 C=[N+](C)C1=C(C#N)N=CN1
65 125.0821727081 C[NH+]=C1NCNC1=C=N
66 152.0930717401 CN(C=NC#[NH+])C1=CNCN1 Intermediate Fragment 
67 110.0712736761 C=[N+](C)C1=CN=CN1
68 152.0930717401 CN=C=NC(=[NH2+])C1=CNCN1 Intermediate Fragment 
69 152.0930717401 C=NC([NH3+])=C1N=CNC1=NC Intermediate Fragment 
70 152.0930717401 [CH2+]N(C)C1=C(C(=N)N)N=CN1 Intermediate Fragment 
71 152.0930717401 CN1C=NC(=[NH2+])C=C1NC=N Intermediate Fragment 
72 135.0665226441 C#[N+]C1=CC(=N)N=CN1C
73 110.0712736761 CN1C=CC(=[NH2+])N=C1
74 152.0930717401 CN1C=NC(=[NH2+])C(N=CN)=C1 Intermediate Fragment 
75 125.0821727081 CN1C=NC(=[NH2+])C(N)=C1
76 152.0930717401 C=NC1=C(N)N(C)C=NC1=[NH2+] Intermediate Fragment 
77 125.0821727081 CN1C=NC(=[NH2+])C=C1N
78 135.0665226441 C#[N+]C1=CN(C)C=NC1=N
79 152.0930717401 C=NC1=C(N)C(=[NH2+])N=CN1C Intermediate Fragment 
80 136.0617716121 [CH2+]N1C=NC(=N)C(=N)C1=N
81 154.1087218041 CN1C=NC([NH3+])C2=C1NCN2
82 154.1087218041 CN(C=N)C1=C(C=[NH2+])NCN1 Intermediate Fragment 
83 137.0821727081 C[NH+](C)C1=C(C#N)N=CN1
84 154.1087218041 CN(C=NC=[NH2+])C1=CNCN1 Intermediate Fragment 
85 154.1087218041 CN=C=NC([NH3+])C1=CNCN1 Intermediate Fragment 
86 154.1087218041 C=NC([NH3+])=C1NCNC1=NC Intermediate Fragment 
87 154.1087218041 CN1C=NC(=[NH2+])C=C1NCN Intermediate Fragment 
88 137.0821727081 C=NC1=CC(=[NH2+])N=CN1C
89 154.1087218041 CN1C=NC(=[NH2+])C(NCN)=C1 Intermediate Fragment 
90 154.1087218041 CNC1=C(N)N(C)C=NC1=[NH2+] Intermediate Fragment 
91 138.0774216761 [CH2+]N1C=NC(=N)C(N)=C1N
92 154.1087218041 CNC1=C(N)C(=[NH2+])N=CN1C Intermediate Fragment 
93 156.1243718681 CN1C=NC([NH3+])C2NCNC21
94 156.1243718681 CN(C=N)C1=C(C[NH3+])NCN1 Intermediate Fragment 
95 129.1134728361 C[NH+]=C1NCNC1CN
96 156.1243718681 CN=C=NC([NH3+])C1CNCN1 Intermediate Fragment 
97 156.1243718681 CN1C=NC([NH3+])C=C1NCN Intermediate Fragment 
98 234.0985510441 CN1C=NC(=[NH2+])C2=C1N(C1CC(O)=CO1)C=N2
99 236.1142011081 CN1C=NC(=[NH2+])C2=C1N(C1CC(O)CO1)C=N2
100 236.1142011081 CN(C=N)C1=C(C#[NH+])N=CN1C1CC(O)CO1 Intermediate Fragment 
101 209.1033020761 C[NH+]=C1C(=C=N)N=CN1C1CC(O)CO1
102 238.1298511721 CN1C=NC(=[NH2+])C2=C1N(C1CC(O)CO1)CN2
103 248.1142011081 C=C1OC(N2C=NC3=C2N(C)C=NC3=[NH2+])CC1O
104 248.1142011081 C=C1OC(N2C=NC(C#[NH+])=C2N(C)C=N)CC1O Intermediate Fragment 
105 248.1142011081 C#COC(CCO)N1C=NC2=C1N(C)C=NC2=[NH2+] Intermediate Fragment 
106 248.1142011081 CN1C=NC(=[NH2+])C2=C1N(C1CCC(=CO)O1)C=N2
107 248.1142011081 CN(C=N)C1=C(C#[NH+])N=CN1C1CCC(=CO)O1 Intermediate Fragment 
108 266.1247657921 CN(C=N)C1=C(C#[NH+])N=CN1C1CC(O)C(CO)O1 Intermediate Fragment 
109 249.0982166961 C[NH+](C)C1=C(C#N)N=CN1C1CC(O)C(=C=O)O1
110 239.1138667601 C[NH+]=C1C(=C=N)N=CN1C1CC(O)C(CO)O1
111 212.1029677281 C[NH+]=C1C=NCN1C1CC(O)C(=CO)O1
112 127.0978227721 C[NH+]=C1NCNC1=CN
113 221.1033020761 C=C1OC(N2C=NC(=C=N)C2=[NH+]C)CC1O
114 239.1138667601 C[NH+]=C1C(=C=N)N=CN1CCC(O)C(=O)CO Intermediate Fragment 
115 237.0982166961 C[NH+]=C1C(=C=N)N=CN1C1CC(O)C(=CO)O1
116 235.0825666321 C[NH+]=C1C(=C=N)N=CN1C1CC(O)C(=C=O)O1
117 214.1186177921 [NH2+]=CC1=CN(C2CC(O)C(CO)O2)CN1
118 183.0764186321 OC1CC(N2C=CN=C2)OC1=C[OH2+]
119 212.1029677281 [NH+]#CC1=CN(C2CC(O)C(CO)O2)CN1
120 210.0873176641 [NH+]#CC1=CN(C2CC(O)C(CO)O2)C=N1
121 210.0873176641 [NH+]#CC1=CN(CCC(O)C(=O)CO)C=N1 Intermediate Fragment 
122 208.0716676001 [NH+]#CC1=CN(C2CC(O)C(=CO)O2)C=N1
123 206.0560175361 [NH+]#CC1=CN(C2CC(O)C(=C=O)O2)C=N1
124 59.0603746441 CNC=[NH2+]
125 42.0338255481 C=[N+]=C
126 43.0290745161 [NH+]#CN
127 235.0825666321 CN(C#[NH+])C1=CN=CN1C1CC(O)C(=C=O)O1
128 237.0982166961 CN(C#[NH+])C1=CN=CN1C1CC(O)C(=CO)O1
129 125.0821727081 CN(C#[NH+])C1=CNCN1
130 239.1138667601 CN(C#[NH+])C1=CN=CN1C1CC(O)C(CO)O1
131 222.0873176641 C[NH+](C)C1=CN=CN1C1C=C(O)C(=C=O)O1
132 210.0873176641 C[NH+]=C1C=NCN1C1CC(O)C(=C=O)O1
133 181.0607685681 OC1CC(N2C=CN=C2)OC1=C=[OH+]
134 129.1134728361 CN(C=[NH2+])C1CNCN1
135 239.1138667601 CN(C#[NH+])C(=C=N)N(C)C1CC(O)C(=CO)O1 Intermediate Fragment 
136 239.1138667601 CN=C=C(N=C1CC(O)C(CO)O1)N(C)C#[NH+] Intermediate Fragment 
137 212.1029677281 C=C(N=C1CC(O)C(CO)O1)N(C)C#[NH+]
138 239.1138667601 CN(C#[NH+])C=C=NC=NC1CC(O)C(CO)O1 Intermediate Fragment 
139 239.1138667601 CN(C#[NH+])C1=CN=CN1CCC(O)C(=O)CO Intermediate Fragment 
140 221.1033020761 CN(C#[NH+])C1=CN=CN1CCC(O)C#CO
141 239.1138667601 CC(OC(=CO)CO)N1C=NC=C1N(C)C#[NH+] Intermediate Fragment 
142 239.1138667601 CN(C#[NH+])C1=CN=CN1C(CCO)OC=CO Intermediate Fragment 
143 239.1138667601 CN(C#[NH+])C1=CN=CN1C(=O)CC(O)CCO Intermediate Fragment 
144 195.0876520121 CN(C#[NH+])C1=CN=CN1C(=O)CCO
145 193.0720019481 CN(C#[NH+])C1=CN=CN1C(=O)C=CO
146 167.0927373921 CC(O)N1C=NC=C1N(C)C#[NH+]
147 165.0770873281 CC(=O)N1C=NC=C1N(C)C#[NH+]
148 75.0440558841 OCC=C[OH2+]
149 266.1247657921 CN(C=NC#[NH+])C1=CN=CN1C1CC(O)C(CO)O1 Intermediate Fragment 
150 214.1186177921 C[NH+]=C1C=NCN1C1CC(O)C(CO)O1
151 266.1247657921 CN=C=NC(=[NH2+])C1=CN(C2CC(O)C(CO)O2)C=N1 Intermediate Fragment 
152 266.1247657921 C=NC([NH3+])=C1N=CN(C2CC(O)C(=CO)O2)C1=NC Intermediate Fragment 
153 266.1247657921 CN1C=NC(=[NH2+])C=C1N(C=N)C1CC(O)C(=CO)O1 Intermediate Fragment 
154 266.1247657921 CN1C=NC(=[NH2+])C(N=C=NC2CC(O)C(CO)O2)=C1 Intermediate Fragment 
155 266.1247657921 C=NC1=C(N=C2CC(O)C(CO)O2)N(C)C=NC1=[NH2+] Intermediate Fragment 
156 266.1247657921 CN1C=NC(=[NH2+])C2=C1N(CCC(O)C(=O)CO)C=N2 Intermediate Fragment 
157 248.1142011081 CN1C=NC(=[NH2+])C2=C1N(CCC(O)C#CO)C=N2
158 230.1036364241 C#CC(O)=CCN1C=NC2=C1N(C)C=NC2=[NH2+]
159 176.0930717401 C=CN1C=NC2=C1N(C)C=NC2=[NH2+]
160 230.1036364241 CN1C=NC(=[NH2+])C2=C1N(CC=CC#CO)C=N2
161 208.1192864881 CN1C=NC(=[NH2+])C2=C1N(CCCO)C=N2
162 206.1036364241 CN1C=NC(=[NH2+])C2=C1N(CC=CO)C=N2
163 204.0879863601 CN1C=NC(=[NH2+])C2=C1N(CC#CO)C=N2
164 178.1087218041 CCN1C=NC2=C1N(C)C=NC2=[NH2+]
165 174.0774216761 C#CN1C=NC2=C1N(C)C=NC2=[NH2+]
166 168.1243718681 CN1C=NC([NH3+])C2=C1N(C)CN2
167 164.0930717401 CN1C=NC(=[NH2+])C2=C1N(C)C=N2
168 266.1247657921 CC(OC(=CO)CO)N1C=NC2=C1N(C)C=NC2=[NH2+] Intermediate Fragment 
169 194.1036364241 CC(O)N1C=NC2=C1N(C)C=NC2=[NH2+]
170 266.1247657921 CN1C=NC(=[NH2+])C2=C1N(C(CCO)OC=CO)C=N2 Intermediate Fragment 
171 210.1349365521 CN1C=NC(=[NH2+])C2=C1N(CCCO)CN2
172 47.0491412641 CC[OH2+]
173 222.0985510441 CN1C=NC(=[NH2+])C2=C1N(C(=O)CCO)C=N2
174 224.1142011081 CN1C=NC(=[NH2+])C2=C1N(C(O)CCO)C=N2
175 266.1247657921 CN1C=NC(=[NH2+])C2=C1N(C(=O)CC(O)CCO)C=N2 Intermediate Fragment 
176 198.1349365521 CC(O)N1CNC2=C1N(C)C=NC2[NH3+]
177 196.1192864881 CC(O)N1CNC2=C1N(C)C=NC2=[NH2+]
178 73.0284058201 OCC#C[OH2+]
179 264.1091157281 CN1C=NC(=[NH2+])C2=C1N(C1CC(O)C(=CO)O1)C=N2
