#In-silico ESI-MS/MS [M+H]+ Spectra
#PREDICTED BY CFM-ID 4.0.8
#SMILES=n12cnc3c(c1nc(=O)cc2)ncn3[C@H]1C[C@H]([C@H](O1)CO)O
#InChiKey=NLRGBKNKPSWPAF-NQMVMOMDSA-N
energy0
188.05669 100.00 10 11 25 26 17 22 (81.088 0.12118 0.056705 0.005548 0.0044989 0.0041151)
energy1
188.05669 100.00 10 11 22 25 26 17 (94.722 0.64617 0.24045 0.16073 0.050189 0.034542)
energy2
43.01784 3.91 107 (1.6485)
45.03349 7.96 106 (3.3598)
55.01784 3.55 149 (1.4979)
57.03349 7.67 148 (3.2372)
71.04914 2.73 140 141 (0.73576 0.41418)
73.02841 3.32 85 83 (1.3031 0.096245)
94.03997 4.36 30 (1.8396)
148.05054 2.77 65 113 66 (0.55968 0.48578 0.12204)
160.06177 3.64 13 (1.5345)
188.05669 100.00 10 11 25 17 26 22 (29.879 5.3339 2.551 1.8978 1.307 1.2151)
190.07234 11.95 27 29 28 (3.0599 1.5741 0.40699)
192.08799 4.46 31 32 (1.332 0.54753)
200.05669 9.32 72 (3.9308)
212.05669 4.93 89 91 92 90 (1.3232 0.31377 0.24213 0.20144)
214.07234 7.74 93 97 99 94 95 96 (1.6688 0.40293 0.34595 0.33588 0.33203 0.17902)
216.08799 2.46 101 115 102 (0.64887 0.24038 0.14797)
218.06725 2.70 71 (1.138)
244.08290 3.77 109 116 112 118 120 114 111 (0.62552 0.24883 0.20504 0.18366 0.11595 0.11055 0.10163)
268.08290 3.23 133 132 (0.88852 0.47271)

0 304.1040303481 OCC1OC(n2cnc3c2ncn2ccc(=[OH+])nc32)CC1O
1 286.0934656641 OC1=C(C[OH2+])OC(N2C=NC3=C2N=CN2CC=CN=C32)=C1
2 172.0617716121 C1=C[NH+]2C=NC3=NC=NC3=C2N=C1
3 117.0546205681 OC1C=COC1C[OH2+]
4 99.0440558841 CC1=C([OH2+])C=CO1
5 117.0546205681 C=COC(=CO)C[OH2+] Intermediate Fragment 
6 117.0546205681 OC=C=C(O)CC[OH2+] Intermediate Fragment 
7 115.0389705041 OC1=C(C[OH2+])OC=C1
8 87.0440558841 [OH2+]C1C=COC1
9 111.0076703761 [O+]#CC1=C(O)C=CO1
10 188.0566862321 [OH+]=C1C=CN2C=NC3=C(N=CN3)C2=N1
11 188.0566862321 N=C1C2=C(N=CN1C=C=C=[OH+])NC=N2 Intermediate Fragment 
12 171.0301371361 O=C=C=[C+]N1C=NC2=NC=NC2=C1
13 160.0617716121 C#CN1C=NC2=C(N=CN2)C1=[NH2+]
14 158.0461215481 [C+]#CN1C=NC2=C(N=CN2)C1=N
15 134.0461215481 [NH2+]=C1N=CN=C2N=CN=C12
16 186.0410361681 N=C1C2=C(N=CN1[C+]=C=C=O)NC=N2
17 188.0566862321 C=CN1C=NC2=C(N=CN2)C1=NC#[O+] Intermediate Fragment 
18 143.0352225161 [C+]#CN1C=NC2=NC=NC2=C1
19 145.0508725801 [CH2+]#CN1C=NC2=NC=NC2=C1
20 162.0410361681 O=C[NH+]=C1N=CN=C2N=CN=C21
21 186.0410361681 C#CN1C=NC2=C(N=CN2)C1=[N+]=C=O
22 188.0566862321 C=CC(=[OH+])N=C1N=CN=C2N=CN=C21 Intermediate Fragment 
23 136.0617716121 [NH2+]=C1N=CN=C2NCN=C12
24 160.0253861041 O=C=[N+]=C1N=CN=C2N=CN=C21
25 188.0566862321 N=C=NC1=CC2=NC(=[OH+])C=CN2C=N1 Intermediate Fragment 
26 188.0566862321 N=C=NC1=CN=CN2C=CC(=[OH+])N=C12 Intermediate Fragment 
27 190.0723362961 [OH+]=C1C=CN2C=NC3=C(NCN3)C2=N1
28 190.0723362961 [OH+]=C1C=CN(C=NC2=CN=CN2)C=N1 Intermediate Fragment 
29 190.0723362961 C=NC1=C(C2=NC(=[OH+])C=CN2)N=CN1 Intermediate Fragment 
30 94.0399735481 C#[N+]C1=CN=CN1
31 192.0879863601 [OH+]=C1CCN2C=NC3=C(NCN3)C2=N1
32 192.0879863601 C=NC1=C(C2=NC(=[OH+])C=CN2)NCN1 Intermediate Fragment 
33 194.1036364241 [OH2+]C1CCN2C=NC3=C(NCN3)C2=N1
34 194.1036364241 C=NC1=C(C2=NC(=[OH+])CCN2)NCN1 Intermediate Fragment 
35 101.0709393281 [OH2+]C1CCNC=N1
36 272.0778156001 OC1C=C(N2C=NC3=C2N=CN2C=CC(=[OH+])N=C32)OC1
37 254.0672509161 [OH+]=C1C=CN2C=NC3=C(N=CN3C3=CC=CO3)C2=N1
38 274.0934656641 OC1COC(N2C=NC3=C2N=CN2C=CC(=[OH+])N=C32)C1
39 276.1091157281 OC1COC(N2CNC3=C2N=CN2C=CC(=[OH+])N=C32)C1
40 286.0934656641 CC1OC(N2C=NC3=C2N=CN2C=CC(=[OH+])N=C32)=CC1O
41 286.0934656641 CC(O)C(O)=C=CN1C=NC2=C1N=CN1C=CC(=[OH+])N=C21 Intermediate Fragment 
42 286.0934656641 CCC(O)=C=C(O)N1C=NC2=C1N=CN1C=CC(=[OH+])N=C21 Intermediate Fragment 
43 286.0934656641 OCC1CC=C(N2C=NC3=C2N=CN2C=CC(=[OH+])N=C32)O1
44 286.0934656641 OCCC=C=C(O)N1C=NC2=C1N=CN1C=CC(=[OH+])N=C21 Intermediate Fragment 
45 304.1040303481 N=CN1C=CC(=[OH+])N=C1C1=CN(C2=CC(O)C(CO)O2)C=N1 Intermediate Fragment 
46 277.0931313161 OCC1OC(N2C=NC(C3=NC(=[OH+])C=CN3)=C2)=CC1O
47 304.1040303481 OCC1OC(N2C=NC=C2N=CN2C=CC(=[OH+])N=C2)=CC1O Intermediate Fragment 
48 208.0716676001 C=[NH+]C1=CN=CN1C1=CC(O)=C(CO)O1
49 304.1040303481 C=NC1=C(C2=NC(=[OH+])C=CN2)N=CN1C1=CC(O)C(CO)O1 Intermediate Fragment 
50 304.1040303481 N=C1C2=C(N=CN1C=C=C=[OH+])N(C1CC(O)C(CO)O1)C=N2 Intermediate Fragment 
51 276.1091157281 C#CN1C=NC2=C(N=CN2C2CC(O)C(CO)O2)C1=[NH2+]
52 276.1091157281 C#CN1C=NC2=C(N=CN2C=CC(O)C(O)CO)C1=[NH2+] Intermediate Fragment 
53 276.1091157281 C#CN1C=NC2=C(N=CN2C(O)=CC(O)CCO)C1=[NH2+] Intermediate Fragment 
54 252.1091157281 [NH3+]C1=C2N=CN(C3CC(O)C(CO)O3)C2=NC=N1
55 304.1040303481 C=CN1C=NC2=C(N=CN2C2=CC(O)C(CO)O2)C1=NC=[OH+] Intermediate Fragment 
56 304.1040303481 CC(=[OH+])N=C1C2=C(N=CN1C)N(C1=CC(O)=C(CO)O1)C=N2 Intermediate Fragment 
57 304.1040303481 N=C([OH2+])C=CN1C=NC2=C(C1)N=CN2C1=CC(O)=C(CO)O1 Intermediate Fragment 
58 287.0774812521 OCC1=C(O)C=C(N2C=NC3=C2N=CN(C=C=C=[OH+])C3)O1
59 173.0457872001 [OH+]=C=C=CN1C=NC2=NC=NC2=C1
60 175.0614372641 [OH+]=C=C=CN1C=NC2NC=NC2=C1
61 261.0982166961 C#CN1C=NC2=C(C1)N=CN2C1=CC(O)C(C[OH2+])O1
62 70.0287401681 C#CC(=[NH2+])O
63 304.1040303481 N=CN(C1=CC2=NC(=[OH+])C=CN2C=N1)C1=CC(O)C(CO)O1 Intermediate Fragment 
64 287.0774812521 C[NH+](C1=CC2=NC(=O)C=CN2C=N1)C1=CC(O)=C(C=O)O1
65 148.0505382321 [OH+]=C1C=CN2C=NC=CC2=N1
66 148.0505382321 N=C1C=CN=CN1C=C=C=[OH+] Intermediate Fragment 
67 304.1040303481 OCC1OC(N=C=NC2=CN=CN3C=CC(=[OH+])N=C23)CC1O Intermediate Fragment 
68 304.1040303481 C=NC1=C(N=C2CC(O)C(CO)O2)N=CN2C=CC(=[OH+])N=C12 Intermediate Fragment 
69 173.0457872001 C#[N+]C1=CN=CN2C=CC(=O)N=C12
70 304.1040303481 C=C(O)C(CO)OCN1C=NC2=C1N=CN1C=CC(=[OH+])N=C21 Intermediate Fragment 
71 218.0672509161 OCN1C=NC2=C1N=CN1C=CC(=[OH+])N=C21
72 200.0566862321 [CH2+]N1C=NC2=C1N=CN1C=CC(=O)N=C21
73 304.1040303481 OCC(O)C(O)C=CN1C=NC2=C1N=CN1C=CC(=[OH+])N=C21 Intermediate Fragment 
74 202.0723362961 CN1C=NC2=C1N=CN1C=CC(=[OH+])N=C21
75 202.0723362961 [CH2+]N(C=N)C1=CC2=NC(=O)C=CN2C=N1 Intermediate Fragment 
76 204.0879863601 CN1CNC2=C1N=CN1C=CC(=[OH+])N=C21
77 206.1036364241 CN1CNC2=C1N=CN1CCC(=[OH+])N=C21
78 93.0546205681 OCC([OH2+])CO
79 75.0440558841 OC=CC[OH2+]
80 75.0440558841 CC([OH2+])=CO
81 91.0389705041 OC=C([OH2+])CO
82 61.0284058201 OCC=[OH+]
83 73.0284058201 OC#CC[OH2+]
84 59.0127557561 OC#C[OH2+]
85 73.0284058201 CC([OH2+])=C=O
86 89.0233204401 O=CC([OH2+])=CO
87 87.0076703761 O=C=C([OH2+])C=O
88 84.9920203121 O=C=C(O)C#[O+]
89 212.0566862321 C#CN1C=NC2=C1N=CN1C=CC(=[OH+])N=C21
90 212.0566862321 [C+]#CN1C=NC(C2=NC(=O)C=CN2)=C1N=C Intermediate Fragment 
91 212.0566862321 [C+]#CN(C=N)C1=CC2=NC(=O)C=CN2C=N1 Intermediate Fragment 
92 212.0566862321 [CH+]=C=NC1=C(N=C)C2=NC(=O)C=CN2C=N1 Intermediate Fragment 
93 214.0723362961 C=CN1C=NC2=C1N=CN1C=CC(=[OH+])N=C21
94 214.0723362961 C#CN1C=NC=C1N=CN1C=CC(=[OH+])N=C1 Intermediate Fragment 
95 214.0723362961 C#CN1C=NC(C2=NC(=[OH+])C=CN2)=C1N=C Intermediate Fragment 
96 214.0723362961 C=CN1C=NC2=C1N=CN(C=C=C=[OH+])C2=N Intermediate Fragment 
97 214.0723362961 [C+]#CN1C=NC2=C1N=CN(C=CC(=N)O)C2 Intermediate Fragment 
98 197.0457872001 C#CN1C=NC2=C1N=CN([C+]=C=C=O)C2
99 214.0723362961 C#CN(C=N)C1=CC2=NC(=[OH+])C=CN2C=N1 Intermediate Fragment 
100 187.0614372641 C=C=[NH+]C1=CC2=NC(=O)C=CN2C=N1
101 216.0879863601 CCN1C=NC2=C1N=CN1C=CC(=[OH+])N=C21
102 216.0879863601 C=CN(C=N)C1=CC2=NC(=[OH+])C=CN2C=N1 Intermediate Fragment 
103 218.1036364241 CCN1CNC2=C1N=CN1C=CC(=[OH+])N=C21
104 220.1192864881 CCN1CNC2=C1N=CN1CCC(=[OH+])N=C21
105 63.0440558841 OCC[OH2+]
106 45.0334912001 C=C[OH2+]
107 43.0178411361 C=C=[OH+]
108 242.0672509161 OCC#CN1C=NC2=C1N=CN1C=CC(=[OH+])N=C21
109 244.0829009801 OCC=CN1C=NC2=C1N=CN1C=CC(=[OH+])N=C21
110 226.0723362961 CC#CN1C=NC2=C1N=CN1C=CC(=[OH+])N=C21
111 244.0829009801 OCC#CN1C=NC=C1N=CN1C=CC(=[OH+])N=C1 Intermediate Fragment 
112 244.0829009801 C=NC1=C(C2=NC(=[OH+])C=CN2)N=CN1C#CCO Intermediate Fragment 
113 148.0505382321 C=[NH+]C1=CN=CN1C#CC=O
114 244.0829009801 N=C1C2=C(N=CN1C=C=C=[OH+])N(C=CCO)C=N2 Intermediate Fragment 
115 216.0879863601 C#CN1C=NC2=C(N=CN2C=CCO)C1=[NH2+]
116 244.0829009801 N=C([OH2+])C=CN1C=NC2=C(C1)N=CN2C#CC=O Intermediate Fragment 
117 227.0563518841 O=CC#CN1C=NC2=C1N=CN(C=C=C=[OH+])C2
118 244.0829009801 N=CN(C#CCO)C1=CC2=NC(=[OH+])C=CN2C=N1 Intermediate Fragment 
119 217.0720019481 O=C1C=CN2C=NC([NH+]=C=CCO)=CC2=N1
120 244.0829009801 OCC=CN=C=NC1=CN=CN2C=CC(=[OH+])N=C12 Intermediate Fragment 
121 246.0985510441 OCCCN1C=NC2=C1N=CN1C=CC(=[OH+])N=C21
122 228.0879863601 CC=CN1C=NC2=C1N=CN1C=CC(=[OH+])N=C21
123 246.0985510441 N=C([OH2+])C=CN1C=NC2=C(C1)N=CN2C#CCO Intermediate Fragment 
124 248.1142011081 OCCCN1CNC2=C1N=CN1C=CC(=[OH+])N=C21
125 286.0934656641 OCCC(O)C#CN1C=NC2=C1N=CN1C=CC(=[OH+])N=C21
126 99.0440558841 C#CC(O)=CC[OH2+]
127 210.0410361681 [C+]#CN1C=NC2=C1N=CN1C=CC(=O)N=C21
128 240.0516008521 O=CC#CN1C=NC2=C1N=CN1C=CC(=[OH+])N=C21
129 254.0672509161 C=C(O)C#CN1C=NC2=C1N=CN1C=CC(=[OH+])N=C21
130 256.0829009801 CC(O)C#CN1C=NC2=C1N=CN1C=CC(=[OH+])N=C21
131 258.0985510441 CC(O)C=CN1C=NC2=C1N=CN1C=CC(=[OH+])N=C21
132 268.0829009801 CC=C(O)C#CN1C=NC2=C1N=CN1C=CC(=[OH+])N=C21
133 268.0829009801 OCC=CC#CN1C=NC2=C1N=CN1C=CC(=[OH+])N=C21
134 286.0934656641 N=C([OH2+])C=CN1C=NC2=C(C1)N=CN2C#CC(O)=C=CO Intermediate Fragment 
135 302.0883802841 OCC(O)C(O)C#CN1C=NC2=C1N=CN1C=CC(=[OH+])N=C21
136 304.1040303481 OCCC(O)C=C(O)N1C=NC2=C1N=CN1C=CC(=[OH+])N=C21 Intermediate Fragment 
137 91.0753560121 CC(O)CC[OH2+]
138 73.0647913281 C=C([OH2+])CC
139 89.0597059481 C=C(O)CC[OH2+]
140 71.0491412641 C=CC(=C)[OH2+]
141 71.0491412641 C#CCC[OH2+]
142 87.0440558841 C=C(O)C=C[OH2+]
143 214.0359507881 O=C1C=CN2C=NC3=C(N=CN3C#[O+])C2=N1
144 216.0516008521 O=CN1C=NC2=C1N=CN1C=CC(=[OH+])N=C21
145 216.0516008521 C=NC1=C(C2=NC(=O)C=CN2)N=CN1C#[O+] Intermediate Fragment 
146 216.0516008521 C=NC1=C(N=C=O)N=CN2C=CC(=[OH+])N=C12 Intermediate Fragment 
147 220.0829009801 OCN1CNC2=C1N=CN1C=CC(=[OH+])N=C21
148 57.0334912001 CC#C[OH2+]
149 55.0178411361 [CH2+]C#CO
150 71.0127557561 OC#CC=[OH+]
151 68.9971056921 [O+]#CC#CO
152 228.0516008521 [CH+]=C(O)N1C=NC2=C1N=CN1C=CC(=O)N=C21
153 230.0672509161 C=C(O)N1C=NC2=C1N=CN1C=CC(=[OH+])N=C21
154 232.0829009801 CC(O)N1C=NC2=C1N=CN1C=CC(=[OH+])N=C21
155 234.0985510441 CC(O)N1CNC2=C1N=CN1C=CC(=[OH+])N=C21
156 236.1142011081 CC(O)N1CNC2=C1N=CN1CCC(=[OH+])N=C21
157 236.1142011081 C=NC1=C(C2=NC(=[OH+])C=CN2)NCN1C(C)O Intermediate Fragment 
158 47.0491412641 CC[OH2+]
159 29.0385765801 C=[CH3+]
160 258.0621655361 OC=C=C(O)N1C=NC2=C1N=CN1C=CC(=[OH+])N=C21
161 260.0778156001 OCC=C(O)N1C=NC2=C1N=CN1C=CC(=[OH+])N=C21
162 262.0934656641 OCCC(O)N1C=NC2=C1N=CN1C=CC(=[OH+])N=C21
163 302.0883802841 OCCC(O)=C=C(O)N1C=NC2=C1N=CN1C=CC(=[OH+])N=C21
164 304.1040303481 OCC=C(OCCO)N1C=NC2=C1N=CN1C=CC(=[OH+])N=C21 Intermediate Fragment 
165 258.0621655361 OC#COCN1C=NC2=C1N=CN1C=CC(=[OH+])N=C21
166 260.0778156001 OC=COCN1C=NC2=C1N=CN1C=CC(=[OH+])N=C21
167 262.0934656641 OCCOCN1C=NC2=C1N=CN1C=CC(=[OH+])N=C21
168 274.0934656641 C=C(OCCO)N1C=NC2=C1N=CN1C=CC(=[OH+])N=C21
169 276.1091157281 CC(OCCO)N1C=NC2=C1N=CN1C=CC(=[OH+])N=C21
170 304.1040303481 C=C(OC(CO)CO)N1C=NC2=C1N=CN1C=CC(=[OH+])N=C21 Intermediate Fragment 
