#In-silico ESI-MS/MS [M+H]+ Spectra
#PREDICTED BY CFM-ID 4.0.8
#SMILES=N=C(Nc1c(ncn1C1OC(CO)C(C1)O)[N+](=O)[O-])N
#InChiKey=AWQFNQTYYWRJMA-UHFFFAOYSA-N
energy0
124.06177 14.76 54 (7.4186)
154.03595 12.26 53 (6.158)
171.06250 100.00 52 67 66 64 56 (50.176 0.030696 0.016128 0.014264 0.011114)
287.10984 35.66 0 204 202 183 101 175 197 171 169 170 (17.633 0.14049 0.073482 0.06471 0.0050841 0.0016877 0.00027397 0.00016695 8.8067e-05 5.6941e-05)
energy1
124.06177 9.05 54 (3.5326)
127.02505 51.31 5 (20.032)
129.04070 100.00 6 65 (38.99 0.053221)
154.03595 12.56 53 (4.9044)
171.06250 21.75 52 56 67 64 66 (8.2922 0.12185 0.049548 0.024199 0.0049596)
227.07748 15.08 9 10 (4.4654 1.4223)
energy2
43.02907 74.41 29 (7.7974)
45.03349 7.23 36 (0.7571)
45.04472 13.68 23 (1.4332)
55.02907 19.93 148 (2.0886)
75.04406 15.19 198 (1.5922)
99.04406 7.72 40 41 43 (0.56922 0.12963 0.11049)
99.06652 24.40 58 (2.5566)
100.01415 41.41 62 (4.3396)
101.05971 8.73 32 33 35 (0.46269 0.44584 0.0059038)
102.02980 11.61 63 (1.2164)
124.06177 100.00 54 (10.479)
126.05495 7.19 179 (0.75294)
126.07742 14.55 90 (1.5251)
127.02505 64.98 5 (6.8092)
129.04070 45.19 6 65 (4.7199 0.015665)
130.02472 8.82 166 (0.92421)
140.03422 19.52 124 (2.0455)
142.04987 16.11 125 (1.6883)
144.05160 7.96 68 (0.8346)
144.06552 8.86 181 180 113 (0.41733 0.39324 0.11792)
154.03595 15.75 53 (1.6505)
156.05160 18.93 2 173 (1.7693 0.21448)
171.05127 7.29 16 (0.76422)
171.06250 77.30 56 52 67 64 66 (3.304 2.8679 1.2153 0.53328 0.17954)
181.07200 10.34 142 (1.0837)
185.06692 10.34 187 (1.0839)
197.07815 17.73 191 (1.8575)
200.06658 43.32 163 81 (2.9495 1.5895)
227.07748 17.36 9 10 (1.0275 0.79177)
285.09419 15.89 168 227 226 (1.4903 0.13648 0.038679)

0 287.1098440001 NC(=[NH2+])Nc1c([N+](=O)[O-])ncn1C1CC(O)C(CO)O1
1 270.0832949041 NC=[NH+]C1=C(N(O)O)N=CN1C1CC(O)C(=C=O)O1
2 156.0516008521 N=C[NH+]=C1N=CN=C1N(O)O
3 245.0880459361 [NH2+]=C1C(N(O)O)=NCN1C1CC(O)C(=CO)O1
4 117.0546205681 OC1CCOC1=C[OH2+]
5 127.0250517561 N=C1N=CN=C1[N+](=O)O
6 129.0407018201 [NH2+]=C1N=CN=C1N(O)O
7 135.0876520121 [NH3+]C1NCNC1N(O)O
8 213.0618311881 [NH2+]=C1C(N(O)O)=NCN1C1=CC(O)=CO1
9 227.0774812521 C=C1OC(N2CN=C(N(O)O)C2=[NH2+])C=C1O
10 227.0774812521 [NH2+]=C1C(N(O)O)=NCN1C1CCC(=C=O)O1
11 196.0716676001 [NH2+]=C1C=NCN1C1CC(O)C(=C=O)O1
12 245.0880459361 [NH+]#CN(CN=CN(O)O)C1CC(O)C(=CO)O1 Intermediate Fragment 
13 245.0880459361 [NH+]#CC(=NC=NC1CC(O)C(CO)O1)N(O)O Intermediate Fragment 
14 245.0880459361 [NH2+]=C1C(N(O)O)=NCN1CCC(O)C(=O)C=O Intermediate Fragment 
15 245.0880459361 CC(OC(=C=O)CO)N1CN=C(N(O)O)C1=[NH2+] Intermediate Fragment 
16 171.0512665041 CC(=O)N1CN=C([N+](=O)O)C1=N
17 245.0880459361 [NH2+]=C1C(N(O)O)=NCN1C(=O)CC(O)C=CO Intermediate Fragment 
18 201.0618311881 [NH2+]=C1C(N(O)O)=NCN1C(=O)C=CO
19 199.0461811241 [NH2+]=C1C(N(O)O)=NCN1C(=O)C#CO
20 175.0825666321 CC(O)N1CN=C(N(O)O)C1=[NH2+]
21 243.0723958721 [NH2+]=C1C(N(O)O)=NCN1C(=O)CC(O)C#CO
22 241.0567458081 [NH2+]=C1C(N(O)O)=NCN1C1C=C(O)C(=C=O)O1
23 45.0447245801 NC=[NH2+]
24 228.0614968401 O=C=C1OC(N2C=NC([NH+](O)O)=C2)CC1O
25 114.0298027881 O=[N+](O)C1=CNC=N1
26 228.0614968401 O=CC(=O)C(O)=CCN1C=NC([NH+](O)O)=C1 Intermediate Fragment 
27 226.0458467761 O=C=C1OC(N2C=NC([NH+](O)O)=C2)C=C1O
28 60.0556236121 NC(N)=[NH2+]
29 43.0290745161 [NH+]#CN
30 62.0712736761 NC(N)[NH3+]
31 119.0702706321 OC1CCOC1C[OH2+]
32 101.0597059481 C=C1OCCC1[OH2+]
33 101.0597059481 [OH2+]C=C1CCCO1
34 119.0702706321 O=CCC(O)CC[OH2+] Intermediate Fragment 
35 101.0597059481 CCC(O)C#C[OH2+]
36 45.0334912001 C=C[OH2+]
37 87.0440558841 CC(O)C#C[OH2+]
38 89.0597059481 CC(O)C=C[OH2+]
39 117.0546205681 OC=CC(O)CC=[OH+]
40 99.0440558841 C=C1OCC=C1[OH2+]
41 99.0440558841 [OH+]=C=C1CCCO1
42 117.0546205681 CCC(O)C(=O)C=[OH+] Intermediate Fragment 
43 99.0440558841 CC=C(O)C#C[OH2+]
44 59.0491412641 CC=C[OH2+]
45 57.0334912001 CC#C[OH2+]
46 61.0284058201 OCC=[OH+]
47 117.0546205681 OCCCOC#C[OH2+] Intermediate Fragment 
48 117.0546205681 CCOC(=C=[OH+])CO Intermediate Fragment 
49 115.0389705041 OC1CCOC1=C=[OH+]
50 111.0076703761 O=C1C=COC1=C=[OH+]
51 169.0468498201 N=C(N)N=C1N=CN=C1[N+](=O)O
52 171.0624998841 NC(=[NH2+])N=C1N=CN=C1N(O)O
53 154.0359507881 N=C=NC1=C([N+](=O)O)N=CN1
54 124.0617716121 NC(=[NH2+])N=C1C=NC=N1
55 153.0519352001 NC(=[NH2+])N=C1N=CN=C1N=O
56 171.0624998841 N=C(N)[N+]#CN=CN=CN(O)O Intermediate Fragment 
57 110.0461215481 N#CN=C=NC(N)=[NH2+]
58 99.0665226441 C=NC=NC(N)=[NH2+]
59 97.0508725801 C=NC#[N+]C(=N)N
60 72.0556236121 C=NC(N)=[NH2+]
61 70.0399735481 C#[N+]C(=N)N
62 100.0141527241 N#CN=C[N+](=O)O
63 102.0298027881 N#C[NH+]=CN(O)O
64 171.0624998841 N=C=NC(C[N+](=O)O)=NC(=N)N Intermediate Fragment 
65 129.0407018201 N=C(N)N=C=C[N+](=O)O
66 171.0624998841 C=NC(=NC(=N)N)C(=N)[N+](=O)O Intermediate Fragment 
67 171.0624998841 N=C=NC(=C=NC(N)=[NH2+])N(O)O Intermediate Fragment 
68 144.0516008521 N=C(N)N=C=C(N)[N+](=O)O
69 173.0781499481 NC(=[NH2+])N=C1NCN=C1N(O)O
70 175.0938000121 NC(=[NH2+])N=C1NCNC1N(O)O
71 177.1094500761 NC(=[NH2+])NC1NCNC1N(O)O
72 255.0836292521 NC(=[NH2+])N=C1C(N(O)O)=NCN1C1=CC(O)=CO1
73 257.0992793161 NC(=[NH2+])N=C1C(N(O)O)=NCN1C1CC(O)=CO1
74 259.1149293801 NC(=[NH2+])N=C1C(N(O)O)=NCN1C1CC(O)CO1
75 269.0992793161 C=C1OC(N2CN=C(N(O)O)C2=NC(N)=[NH2+])C=C1O
76 210.0509321561 C=C1OC(N2C=NC([NH+](O)O)=C2)=CC1=O
77 251.0887146321 C=C1C=CC(N2CN=C([N+](=O)O)C2=NC(=N)N)O1
78 222.0985510441 C=C1OC(N2CN=CC2=NC(N)=[NH2+])C=C1O
79 269.0992793161 C=C1OC(N(C#[N+]C(=N)N)CN=CN(O)O)C=C1O Intermediate Fragment 
80 197.1033020761 C=C1OC(N(C)C=NC(N)=[NH2+])CC1=O
81 200.0665822201 C=C1OC(N=C[NH+]=CN(O)O)CC1=O
82 269.0992793161 CC(=O)C(O)=C=CN1CN=C(N(O)O)C1=NC(N)=[NH2+] Intermediate Fragment 
83 269.0992793161 C#COC(C=CO)N1CN=C(N(O)O)C1=NC(N)=[NH2+] Intermediate Fragment 
84 227.0887146321 NC(=[NH2+])N=C1C(N(O)O)=NCN1CC=C=O
85 243.0836292521 NC(=[NH2+])N=C1C(N(O)O)=NCN1C(=O)C=CO
86 269.0992793161 NC(=[NH2+])N=C1C(N(O)O)=NCN1C1CCC(=C=O)O1
87 269.0992793161 NC(=[NH2+])N=CN(CN=CN(O)O)C1C=CC(=C=O)O1 Intermediate Fragment 
88 269.0992793161 NC(=[NH2+])N=C1C(N(O)O)=NCN1CC=CC(=O)C=O Intermediate Fragment 
89 238.0934656641 NC(=[NH2+])N=C1C=NCN1C1CC(O)C(=C=O)O1
90 126.0774216761 NC(=[NH2+])N=C1C=NCN1
91 240.1091157281 NC(=[NH2+])N=C1C=NCN1C1CC(O)C(=CO)O1
92 198.0873176641 [NH2+]=C1C=NCN1C1CC(O)C(=CO)O1
93 181.0607685681 OC1CC(N2C=CN=C2)OC1=C=[OH+]
94 240.1091157281 NC(=[NH2+])N=C1C=NCN1CCC(O)C(=O)C=O Intermediate Fragment 
95 222.0985510441 NC(=[NH2+])N=C1C=NCN1CC=C(O)C#CO
96 180.0879863601 NC(=[NH2+])N=C1C=NCN1CC#CO
97 240.1091157281 NC(=[NH2+])N=C1C=NCN1C(=O)CC(O)C=CO Intermediate Fragment 
98 168.0879863601 CC(=O)N1CN=CC1=NC(N)=[NH2+]
99 269.0992793161 NC(=[NH2+])N=C1C(NO)=NCN1C1CC(O)C(=C=O)O1
100 155.0675852641 NC(=[NH2+])N=C1NC=NC1N=O
101 287.1098440001 NC(=[NH2+])N=CN(CN=CN(O)O)C1CC(O)C(=C=O)O1 Intermediate Fragment 
102 226.0934656641 N#CN(C=NC(N)=[NH2+])C1CC(O)C(=CO)O1
103 112.0617716121 N#CNC=NC(N)=[NH2+]
104 114.0774216761 N=CNC=NC(N)=[NH2+]
105 116.0930717401 NCNC=NC(N)=[NH2+]
106 198.0985510441 N#CN(C=NC(N)=[NH2+])C1CC(O)CO1
107 208.0829009801 C=C1OC(N(C#N)C=NC(N)=[NH2+])C=C1O
108 208.0829009801 N#CN(C=NC(N)=[NH2+])C1CCC(=C=O)O1
109 226.0934656641 N#CN(C=NC(N)=[NH2+])CCC(O)C(=O)C=O Intermediate Fragment 
110 226.0934656641 N#CN(C=NC(N)=[NH2+])C(=O)CC(O)C=CO Intermediate Fragment 
111 224.0778156001 N#CN(C=NC(N)=[NH2+])C1CC(O)C(=C=O)O1
112 215.1138667601 CN(C=NC(N)=[NH2+])C1CC(O)C(=CO)O1
113 144.0655196001 C=[NH+]C1CC(O)C(=CO)O1
114 146.0811696641 C=[NH+]C1CC(O)C(CO)O1
115 215.1138667601 CN(C=NC(N)=[NH2+])CCC(O)C(=O)C=O Intermediate Fragment 
116 215.1138667601 CN(C=NC(N)=[NH2+])C(=O)CC(O)C=CO Intermediate Fragment 
117 213.0982166961 CN(C=NC(N)=[NH2+])C1CC(O)C(=C=O)O1
118 154.0498695361 C[NH+](C)C1=CC(=O)C(=C=O)O1
119 152.0342194721 C=[N+](C)C1=CC(=O)C(=C=O)O1
120 101.0821727081 CNC=NC(N)=[NH2+]
121 103.0978227721 CNCNC(N)=[NH2+]
122 195.0876520121 C=C1OC(N(C)C#[N+]C(=N)N)C=C1O
123 195.0876520121 CN(C=NC(N)=[NH2+])C1C=CC(=C=O)O1
124 140.0342194721 C=[NH+]C1C=C(O)C(=C=O)O1
125 142.0498695361 C=[NH+]C1CC(O)C(=C=O)O1
126 213.0982166961 CN(C=NC(N)=[NH2+])CC=C(O)C(=O)C=O Intermediate Fragment 
127 195.0876520121 CN(C=C=C(O)C#CO)C=NC(N)=[NH2+]
128 125.0821727081 C#CN(C)C=NC(N)=[NH2+]
129 213.0982166961 CN(C=NC(N)=[NH2+])C(=O)CC(O)C#CO Intermediate Fragment 
130 213.0982166961 CN(C=NC(N)=[NH2+])C(C=CO)OC#CO Intermediate Fragment 
131 171.0876520121 CN(C=NC(N)=[NH2+])C(=O)C=CO
132 213.0982166961 CC(OC(=C=O)C=O)N(C)C=NC(N)=[NH2+] Intermediate Fragment 
133 211.0825666321 CN(C=NC(N)=[NH2+])C1C=C(O)C(=C=O)O1
134 193.0720019481 C=C1OC(N(C)C#[N+]C(=N)N)=CC1=O
135 193.0720019481 CN(C#[N+]C(=N)N)C1C=CC(=C=O)O1
136 211.0825666321 CN(C=C=C(O)C(=O)C=O)C=NC(N)=[NH2+] Intermediate Fragment 
137 211.0825666321 CN(C=NC(N)=[NH2+])C(C=C=O)OC#CO Intermediate Fragment 
138 211.0825666321 C=C(OC(=C=O)C=O)N(C)C=NC(N)=[NH2+] Intermediate Fragment 
139 209.0669165681 CN(C#[N+]C(=N)N)C1C=C(O)C(=C=O)O1
140 75.0189037561 [NH+]#CN(O)O
141 199.0825666321 NC(=[NH2+])N=CN=C1CC(O)C(=CO)O1
142 181.0720019481 NC(=[NH2+])N=CN=C1CCC(=C=O)O1
143 197.0669165681 NC(=[NH2+])N=CN=C1CC(O)C(=C=O)O1
144 89.0345538201 C=[N+]=CN(O)O
145 71.0239891361 C=[N+]=C=NO
146 91.0502038841 C[NH+]=CN(O)O
147 76.0869237401 CNC(N)[NH3+]
148 55.0290745161 C=[N+]=C=N
149 53.0134244521 C#[N+]C#N
150 212.0301967121 O=C=C1OC(N=C=[N+]=CN(O)O)C=C1O
151 214.0458467761 O=C=C1OC(N=C[NH+]=CN(O)O)C=C1O
152 186.0509321561 OC1=COC(N=C[NH+]=CN(O)O)=C1
153 216.0614968401 O=C=C1OC(N=C[NH+]=CN(O)O)CC1O
154 198.0509321561 C=C1OC(N=C=[N+]=CN(O)O)C=C1O
155 198.0509321561 O=C=C1C=CC(N=C[NH+]=CN(O)O)O1
156 216.0614968401 O=CC(=O)C(O)=CCN=C[NH+]=CN(O)O Intermediate Fragment 
157 128.0454528521 C#CN=C[NH+]=CN(O)O
158 216.0614968401 O=C(CC(O)C#CO)N=C[NH+]=CN(O)O Intermediate Fragment 
159 218.0771469041 OC=C1OC(N=C[NH+]=CN(O)O)CC1O
160 157.0607685681 [NH+]#CN=C1CC(O)C(CO)O1
161 93.0658539481 C[NH2+]CN(O)O
162 108.0767529801 NC[NH2+]CN(O)O
163 200.0665822201 O=C=C1CCC(N=C[NH+]=CN(O)O)O1
164 218.0771469041 O=CC(=O)C(O)CCN=C[NH+]=CN(O)O Intermediate Fragment 
165 218.0771469041 O=C(CC(O)C=CO)N=C[NH+]=CN(O)O Intermediate Fragment 
166 130.0247174081 O=CN=C=[N+]=CN(O)O
167 218.0771469041 CC(O)C(=C=O)OCN=C[NH+]=CN(O)O Intermediate Fragment 
168 285.0941939361 NC(=[NH2+])N=CN(CN=CN(O)O)C1C=C(O)C(=C=O)O1
169 287.1098440001 N=CN(C(CN(O)O)=NC(N)=[NH2+])C1CC(O)C(=C=O)O1 Intermediate Fragment 
170 287.1098440001 CN(C(=NC(N)=[NH2+])C(=N)N(O)O)C1CC(O)C(=C=O)O1 Intermediate Fragment 
171 287.1098440001 CN=C(C(N=C1CC(O)C(=CO)O1)=NC(N)=[NH2+])N(O)O Intermediate Fragment 
172 158.0672509161 C=NC(=C=NC(N)=[NH2+])N(O)O
173 156.0516008521 C#[N+]C(=C=NC(=N)N)N(O)O
174 132.0655196001 [NH2+]=C1CC(O)C(CO)O1
175 287.1098440001 NC(=[NH2+])N=C=C(N=C=NC1CC(O)C(CO)O1)N(O)O Intermediate Fragment 
176 87.0189037561 N#CC[N+](=O)O
177 82.0399735481 [CH+]=C=NC(=N)N
178 131.0563518841 NC(=[NH2+])N=C=CN(O)O
179 126.0549549161 C=[NH+]C1C=C(O)C(=C)O1
180 144.0655196001 C=[NH+]CCC(O)C(=O)C=O Intermediate Fragment 
181 144.0655196001 C=[NH+]C(=O)CC(O)C=CO Intermediate Fragment 
182 97.0508725801 N#CC=NC(N)=[NH2+]
183 287.1098440001 NC(=[NH2+])N=C1C(N(O)O)=NCN1CCC(O)C(=O)C=O Intermediate Fragment 
184 269.0992793161 NC(=[NH2+])N=C1C(N(O)O)=NCN1CC=C(O)C#CO
185 231.1200147601 NC(=[NH2+])N=C1C(N(O)O)=NCN1CCCO
186 229.1043646961 NC(=[NH2+])N=C1C(N(O)O)=NCN1CC=CO
187 185.0669165681 [NH2+]=C1C(N(O)O)=NCN1CC#CO
188 227.0887146321 N=C(N)[N+]#CN(CC#CO)CN=CN(O)O Intermediate Fragment 
189 227.0887146321 NC(=[NH2+])N=C=C(N=C=NCC=CO)N(O)O Intermediate Fragment 
190 225.0730645681 N=C(N)N=C1C([N+](=O)O)=NCN1CC#CO
191 197.0781499481 C#CN1CN=C(N(O)O)C1=NC(N)=[NH2+]
192 199.0938000121 C=CN1CN=C(N(O)O)C1=NC(N)=[NH2+]
193 182.0672509161 C=CN1C=NC(N(O)O)=C1[NH+]=C=N
194 155.0563518841 C#CN1CN=C(N(O)O)C1=[NH2+]
195 195.0624998841 C#CN1CN=C([N+](=O)O)C1=NC(=N)N
196 195.0624998841 C#CN=C=NC(=C=NC(N)=[NH2+])N(O)O Intermediate Fragment 
197 287.1098440001 CC(OC(=C=O)CO)N1CN=C(N(O)O)C1=NC(N)=[NH2+] Intermediate Fragment 
198 75.0440558841 OCC=C[OH2+]
199 213.0730645681 CC(=O)N1CN=C([N+](=O)O)C1=NC(=N)N
200 215.0887146321 CC(=O)N1CN=C(N(O)O)C1=NC(N)=[NH2+]
201 215.0887146321 CC(=O)N(C#[N+]C(=N)N)CN=CN(O)O Intermediate Fragment 
202 287.1098440001 NC(=[NH2+])N=C1C(N(O)O)=NCN1C(CCO)OC#CO Intermediate Fragment 
203 245.0992793161 NC(=[NH2+])N=C1C(N(O)O)=NCN1C(=O)CCO
204 287.1098440001 NC(=[NH2+])N=C1C(N(O)O)=NCN1C(=O)CC(O)C=CO Intermediate Fragment 
205 241.0679791881 NC(=[NH2+])N=C1C(N(O)O)=NCN1C(=O)C#CO
206 47.0491412641 CC[OH2+]
207 29.0385765801 C=[CH3+]
208 219.1200147601 CC(O)N1CNC(N(O)O)C1=NC(N)=[NH2+]
209 219.1200147601 CC(O)N(C=NC(N)=[NH2+])CN=CN(O)O Intermediate Fragment 
210 217.1043646961 CC(O)N1CN=C(N(O)O)C1=NC(N)=[NH2+]
211 217.1043646961 CC(=O)N(C=NC(N)=[NH2+])CN=CN(O)O Intermediate Fragment 
212 156.0879863601 CC(O)N(C#N)C=NC(N)=[NH2+]
213 73.0284058201 OCC#C[OH2+]
214 55.0178411361 C#CC=[OH+]
215 203.0887146321 NC(=[NH2+])N=C1C(N(O)O)=NCN1CO
216 201.0730645681 NC(=[NH2+])N=C1C(N(O)O)=NCN1C=O
217 184.0465154721 N=C=[NH+]C1=C(N(O)O)N=CN1C=O
218 157.0356164401 N=C1C([N+](=O)O)=NCN1C=O
219 201.0730645681 NC(=[NH2+])N=C=C(N=C=NCO)N(O)O Intermediate Fragment 
220 199.0574145041 N=C(N)N=C1C([N+](=O)O)=NCN1C=O
221 152.0566862321 N=C(N)N=C1C=NCN1C#[O+]
222 182.0308654081 N#CN=C1C([N+](=O)O)=NCN1C=O
223 199.0574145041 NC(=[NH2+])N=C=C(N=C=NC=O)N(O)O Intermediate Fragment 
224 71.0491412641 C#CC(C)[OH2+]
225 71.0491412641 CCC#C[OH2+]
226 285.0941939361 NC(=[NH2+])N=C1C(N(O)O)=NCN1C(=O)CC(O)C#CO
227 285.0941939361 NC(=[NH2+])N=CN(CN=CN(O)O)C(=O)C=C(O)C#CO Intermediate Fragment 
