#In-silico ESI-MS/MS [M+H]+ Spectra
#PREDICTED BY CFM-ID 4.0.8
#SMILES=[C@H]1(C[C@@H](O[C@@H]1CO)n1c(cc(nc1=O)N)Nc1nc(c2c(c1)[nH]c1c2cccc1)C)O
#InChiKey=SRXVOMTUHFERPI-SPYBWZPUSA-N
energy0
307.13019 100.00 5 44 50 86 85 88 75 32 70 89 80 59 78 90 68 91 65 (53.989 1.9074 1.5783 0.124 0.084645 0.078718 0.067545 0.040776 0.033837 0.031935 0.023106 0.016328 0.0088778 0.0086757 0.0054054 0.0018787 0.0010092)
423.17753 51.12 0 200 235 136 133 266 239 252 260 275 123 236 269 271 255 286 258 262 259 264 280 256 281 276 (28.87 0.50567 0.080918 0.059462 0.031559 0.019317 0.01795 0.010927 0.0085233 0.0084419 0.0076421 0.0070149 0.0069223 0.0039584 0.0039549 0.0014997 0.0014028 0.0012107 0.0010849 0.00075404 0.00043532 0.00025417 0.00023176 0.00018212)
energy1
127.06144 8.42 30 (4.5937)
262.10872 3.93 40 46 (1.6744 0.47155)
264.12437 8.41 41 45 (3.0948 1.4972)
279.13527 4.46 43 (2.4337)
290.10364 13.27 25 49 33 71 (4.0628 2.3254 0.45078 0.40568)
291.09889 8.34 31 79 (4.5477 0.0038505)
307.13019 100.00 5 44 32 50 70 88 78 59 85 80 75 68 89 86 65 90 91 (46.075 2.9861 2.9102 0.82189 0.43678 0.38442 0.20928 0.16045 0.142 0.1318 0.10857 0.07055 0.046517 0.031933 0.02269 0.021236 0.020745)
energy2
45.03349 11.99 103 (1.7289)
55.01784 6.62 204 (0.95451)
57.03349 32.55 101 (4.6924)
61.02841 7.46 147 (1.0758)
71.04914 8.14 227 228 (0.75081 0.42266)
73.02841 4.21 150 149 (0.55784 0.049785)
181.07602 9.97 29 (1.4366)
196.08692 19.86 26 (2.8632)
198.10257 86.32 9 110 114 111 113 112 (9.1297 0.8091 0.72372 0.66778 0.63212 0.48177)
247.09782 6.20 51 (0.89349)
262.10872 6.40 40 46 (0.46703 0.45617)
274.10872 4.72 159 (0.68023)
290.10364 7.32 25 33 49 71 (0.52287 0.33054 0.18505 0.016534)
292.11929 8.54 211 190 268 107 (0.53532 0.42626 0.23357 0.036092)
294.13494 5.22 257 249 (0.42202 0.32982)
307.13019 29.34 32 5 50 44 65 80 59 68 70 86 78 75 88 85 89 91 90 (1.4464 1.2245 0.28245 0.27566 0.19873 0.1938 0.17283 0.15033 0.074716 0.051091 0.045896 0.026459 0.022001 0.019179 0.017539 0.01495 0.013116)
309.14584 6.35 4 (0.9159)
317.11454 8.56 158 161 157 (0.5556 0.38286 0.29516)
319.13019 10.63 134 (1.5324)
331.13019 20.82 124 (3.001)
333.14584 100.00 125 126 127 (6.058 4.5159 3.8419)
335.16149 7.15 13 185 (1.017 0.014204)
337.14075 92.72 135 (13.366)
343.13019 4.19 194 (0.60389)
345.14584 11.19 182 (1.613)
347.16149 12.60 178 (1.816)
353.16082 8.79 238 (1.2666)
363.15640 6.61 232 16 187 183 189 188 186 192 191 (0.50305 0.10881 0.079225 0.054607 0.05414 0.051448 0.03528 0.033205 0.033096)
378.15607 4.67 251 19 (0.64268 0.030394)
382.15098 4.64 261 243 (0.51907 0.14916)

0 423.1775296361 Cc1nc(Nc2cc([NH3+])nc(=O)n2C2CC(O)C(CO)O2)cc2[nH]c3ccccc3c12
1 391.1513148881 CC1=NC(=NC2=CC([NH3+])=NC(=O)N2C2C=C(O)CO2)CC2=C1C1=CC=CCC1=N2
2 393.1669649521 CC1=NC(=NC2=CC([NH3+])=NC(=O)N2C2C=C(O)CO2)CC2=C1C1=CCCCC1=N2
3 405.1669649521 C=C1OC(N2C(=O)N=C([NH3+])C=C2N=C2CC3=C(C4=CCCCC4=N3)C(C)=N2)C=C1O
4 309.1458355841 CC1=NC(=NC2=NC(O)=NC([NH3+])=C2)C=C2N=C3CCC=CC3C21
5 307.1301855201 CC1=NC(=NC2=NC(O)=NC([NH3+])=C2)C=C2N=C3C=CC=CC3C21
6 99.0440558841 C=C1OC=CC1[OH2+]
7 101.0597059481 CC1OC=CC1[OH2+]
8 388.1404158561 C=C1OC(N2C(=O)N=CC=C2[NH+]=C2CC3=C(C4=CC=CCC4=N3)C(C)=N2)C=C1O
9 198.1025738041 CC1=NC(=[NH2+])C=C2N=C3C=CC=CC3C21
10 210.0873176641 C=C1OC(N2C=CC([NH3+])=NC2O)=CC1O
11 387.1564002681 C=C1C=CC(N2C(=O)N=C([NH3+])C=C2N=C2CC3=C(C4=CC=CCC4=N3)C(C)=N2)O1
12 405.1669649521 CC(=O)C(O)=C=CN1C(=O)N=C([NH3+])C=C1N=C1CC2=C(C3=CCCCC3=N2)C(C)=N1 Intermediate Fragment 
13 335.1614856481 C#CN1C(=O)N=C([NH3+])C=C1N=C1CC2=C(C(C)=N1)C1CCCCC1=N2
14 405.1669649521 C#CC(O)=C=C(O)N1C(=O)N=C([NH3+])C=C1N=C1CC2=C(C(C)=N1)C1CCCCC1=N2 Intermediate Fragment 
15 405.1669649521 C#COC(=C=CO)N1C(=O)N=C([NH3+])C=C1N=C1CC2=C(C(C)=N1)C1CCCCC1=N2 Intermediate Fragment 
16 363.1564002681 CC1=NC(=NC2=CC([NH3+])=NC(=O)N2CC#CO)CC2=C1C1=CCCCC1=N2
17 379.1513148881 CC1=NC(=NC2=CC([NH3+])=NC(=O)N2C(=O)C#CO)CC2=C1C1CCCCC1=N2
18 405.1669649521 C=C1OC(N(C(=N)O)C(=C=C=[NH2+])N=C2CC3=C(C4=CCCCC4=N3)C(C)=N2)C=C1O Intermediate Fragment 
19 378.1560659201 C=C1OC([NH+](C(=C)N=C2CC3=C(C4=CC=CCC4=N3)C(C)=N2)C(=N)O)=CC1O
20 405.1669649521 C=C1OC(N2C(=O)N=C([NH3+])C=C2N=CCC2=C(C(C)=N)C3=CC=CCC3=N2)C=C1O Intermediate Fragment 
21 313.1771357121 CC1=NC(=NC2=NC(O)=NC([NH3+])=C2)CC2=C1C1CCCCC1N2
22 313.1771357121 CC1=NC(=NC(C=C=[NH2+])=NC(=N)O)CC2=C1C1CCCCC1N2 Intermediate Fragment 
23 311.1614856481 CC1=NC(=NC2=NC(O)=NC([NH3+])=C2)CC2=C1C1CCCCC1=N2
24 289.1196208361 [CH2+]C1=NC(=NC2=NC=NC(N)=C2)CC2=C1C1=CC=CCC1=N2
25 290.1036364241 [CH2+]C1=NC(=NC2=NC(O)=NC=C2)CC2=C1C1=CC=CCC1=N2
26 196.0869237401 CC1=NC(=[NH2+])C=C2N=C3C=CC=CC3=C21
27 194.0712736761 [CH2+]C1=NC(=N)C=C2N=C3C=CC=CC3=C21
28 112.0505382321 [NH3+]C1=CC=NC(O)=N1
29 181.0760247081 [CH3+]=C1N=CC=C2N=C3C=CC=CC3=C12
30 127.0614372641 NC1=NC(O)=NC([NH3+])=C1
31 291.0988853921 [NH3+]C1=CC(N=C2C=C3N=C4C=CC=CC4=C3C=N2)=NC(O)=N1
32 307.1301855201 CC1=NC(=NC(=N)C=C([NH3+])N=C=O)CC2=C1C1=CC=CCC1=N2 Intermediate Fragment 
33 290.1036364241 CC1=NC(=NC#CC(N)=[N+]=C=O)CC2=C1C1=CC=CCC1=N2
34 221.0821727081 CC1=NC(=NC#[NH+])C=C2N=C3C=CC=CC3=C21
35 223.0978227721 CC1=NC(=NC#[NH+])C=C2N=C3C=CC=CC3C21
36 235.0978227721 [CH2+]C(=N)N=C1C=C2N=C3C=CC=CC3=C2C(C)=N1
37 237.1134728361 CC(=[NH2+])N=C1C=C2N=C3C=CC=CC3=C2C(C)=N1
38 239.1291229001 CC(=[NH2+])N=C1C=C2N=C3C=CC=CC3C2C(C)=N1
39 260.0930717401 [CH2+]C1=NC(=NC(=N)C#CN)C=C2N=C3C=CC=CC3=C21
40 262.1087218041 CC1=NC(=NC(=[NH2+])C#CN)C=C2N=C3C=CC=CC3=C21
41 264.1243718681 CC1=NC(=NC(=[NH2+])C#CN)C=C2N=C3C=CC=CC3C21
42 277.1196208361 CC1=NC(=NC(=N)[C+]=C(N)N)C=C2N=C3C=CC=CC3=C21
43 279.1352709001 CC1=NC(=NC(=[NH2+])C=C(N)N)C=C2N=C3C=CC=CC3=C21
44 307.1301855201 CC1=NC(=NC(C=C(N)N)=NC#[O+])CC2=C1C1=CC=CCC1=N2 Intermediate Fragment 
45 264.1243718681 CC1=NC(=NC#CC(N)=[NH2+])C=C2N=C3C=CC=CC3C21
46 262.1087218041 CC1=NC(=NC#CC(N)=[NH2+])C=C2N=C3C=CC=CC3=C21
47 260.0930717401 [CH2+]C1=NC(=NC#CC(=N)N)C=C2N=C3C=CC=CC3=C21
48 265.1083874561 C=C(N=C1C=C2N=C3C=CC=CC3C2C(C)=N1)[NH+]=C=O
49 290.1036364241 CC1=NC(=NC(C#CN)=NC#[O+])CC2=C1C1=CC=CCC1=N2
50 307.1301855201 CC1=NC(=NC(C=C=[NH2+])=NC(=N)O)CC2=C1C1=CC=CCC1=N2 Intermediate Fragment 
51 247.0978227721 CC1=NC(=NC#CC#[NH+])CC2=C1C1=CC=CCC1=N2
52 245.0821727081 [CH2+]C1=NC(=NC#CC#N)CC2=C1C1=CC=CCC1=N2
53 262.0723362961 [CH+]=C1N=C(N=C=NC(=N)O)C=C2N=C3C=CC=CC3=C12
54 264.0879863601 C=C1N=C(N=C=[NH+]C(=N)O)C=C2N=C3C=CC=CC3=C12
55 266.1036364241 C=C1N=C(N=C=[NH+]C(=N)O)C=C2N=C3C=CC=CC3C12
56 278.1036364241 [CH2+]C(=NC(=N)O)N=C1C=C2N=C3C=CC=CC3=C2C(C)=N1
57 280.1192864881 CC1=NC(=NC(C)=[NH+]C(=N)O)C=C2N=C3C=CC=CC3=C21
58 305.1145354561 [CH2+]C1=NC(=NC(C#CN)=NC(=N)O)CC2=C1C1=CC=CCC1=N2
59 307.1301855201 CC(=NC(=O)N=C=[NH2+])N=C1CC2=C(C3=CC=CCC3=N2)C(C)=N1 Intermediate Fragment 
60 222.1025738041 C#C[NH+]=C1C=C2N=C3C=CC=CC3C2C(C)=N1
61 220.0869237401 C#C[NH+]=C1C=C2N=C3C=CC=CC3=C2C(C)=N1
62 263.0927373921 C=C(N=C1C=C2N=C3C=CC=CC3=C2C(C)=N1)[NH+]=C=O
63 261.0770873281 [CH+]=C(N=C=O)N=C1C=C2N=C3C=CC=CC3=C2C(C)=N1
64 305.1145354561 [CH2+]C(=NC(=O)N=C=N)N=C1CC2=C(C3=CC=CCC3=N2)C(C)=N1
65 307.1301855201 C=C([NH3+])N=C(O)N=C=NC1=NC(C)=C2C(=C1)N=C1CC=CC=C12 Intermediate Fragment 
66 206.0712736761 C#[N+]C1=NC(=C)C2=C3C=CC=CC3=NC2=C1
67 249.0770873281 C=C1N=C(N=C=[NH+]C=O)C=C2N=C3C=CC=CC3=C12
68 307.1301855201 CC1=C2C(=CC(N=C=C=C([NH3+])N=C(N)O)=N1)N=C1CC=CC=C12 Intermediate Fragment 
69 305.1145354561 [CH2+]C1=NC(=NC#CC(N)=NC(N)=O)CC2=C1C1=CC=CCC1=N2
70 307.1301855201 C=C=C1C(=CC(N)=NC2=NC(O)=NC([NH3+])=C2)N=C2CC=CC=C12 Intermediate Fragment 
71 290.1036364241 C=C=C1C(=C=C=NC2=NC(O)=NC([NH3+])=C2)N=C2CC=CC=C12
72 281.1145354561 NC(C=C1C=C2C=CC=CC2=N1)=NC1=NC(O)=NC([NH3+])=C1
73 279.0988853921 NC1=CC(N=C(N)[C+]=C2C=C3C=CC=CC3=N2)=NC(O)=N1
74 156.0807757401 C#[CH+]C1C(=C)N=C2C=CC=CC21
75 307.1301855201 C=C=NC(CC1=CC2=CC=CCC2=N1)=NC1=NC(O)=NC([NH3+])=C1 Intermediate Fragment 
76 264.0879863601 NC1=CC(N=C=[C+]C2=CC3=C(C=CC=C3)N2)=NC(O)=N1
77 266.1036364241 [NH3+]C1=CC(N=C=CC2=CC3=C(C=CC=C3)N2)=NC(O)=N1
78 307.1301855201 [CH2+]C(=NC(C)=NC1=NC(O)=NC(N)=C1)C1=CN=C2CC=CC=C12 Intermediate Fragment 
79 291.0988853921 [CH2+]C(N=C=NC1=NC(O)=NC(N)=C1)=C1C=NC2=C1C=CC=C2
80 307.1301855201 C=C1N=C2CC=CC=C2C1=C(C)N=C=NC1=NC(O)=NC([NH3+])=C1 Intermediate Fragment 
81 171.0916747721 C=C1N=C2C=CC=CC2=C1C(C)=[NH2+]
82 137.0457872001 C#[N+]C1=NC(O)=NC(N)=C1
83 154.0651256761 C#[CH+]C1=C2C=CC=CC2=NC1=C
84 152.0566862321 N=C=NC1=NC(O)=NC([NH3+])=C1
85 307.1301855201 CC(=N)C1=C(C=C=NC2=NC(O)=NC([NH3+])=C2)N=C2CC=CC=C21 Intermediate Fragment 
86 307.1301855201 [CH2+]C1=NC(=NC2=NC(O)=NC(N)=C2)CC=C1C1=CC=CCC1=N Intermediate Fragment 
87 305.1145354561 [CH2+]C1=NC(=NC2=NC(O)=NC(N)=C2)C=CC1=C1C=CC=CC1=N
88 307.1301855201 [CH2+]C1=NC(=NC2=NC(O)=NC(N)=C2)CC(N=C2C=CC=CC2)=C1 Intermediate Fragment 
89 307.1301855201 [CH2+]C1=NC(=NC2=NC(O)=NC(N)=C2)CC(N)=C1C1=CC=CC=C1 Intermediate Fragment 
90 307.1301855201 C=C=C1C(C=C)=NC2=C1C(C)=NC(=NC1=NC(O)=NC([NH3+])=C1)C2 Intermediate Fragment 
91 307.1301855201 CC=C=C=C1C=NC2=C1C(C)=NC(=NC1=NC(O)=NC([NH3+])=C1)C2 Intermediate Fragment 
92 305.1145354561 [CH2+]C1=NC(=NC(=N)C=C(N)N=C=O)CC2=C1C1=CC=CCC1=N2 Intermediate Fragment 
93 115.0389705041 OC1C=COC1=C[OH2+]
94 87.0440558841 [OH2+]C1C=COC1
95 115.0389705041 O=C=C=C(O)CC[OH2+] Intermediate Fragment 
96 117.0546205681 OC1C=COC1C[OH2+]
97 99.0440558841 [OH2+]C=C1C=CCO1
98 117.0546205681 C=COC(=C[OH2+])CO Intermediate Fragment 
99 117.0546205681 C=C=C(O)C(O)C[OH2+] Intermediate Fragment 
100 99.0440558841 C=C=C(O)C=C[OH2+]
101 57.0334912001 CC#C[OH2+]
102 117.0546205681 OC=C=C(O)CC[OH2+] Intermediate Fragment 
103 45.0334912001 C=C[OH2+]
104 117.0546205681 OC=C=COCC[OH2+] Intermediate Fragment 
105 405.1669649521 CC1=NC(=NC2=CC([NH3+])=NCN2C2C=C(O)C(=C=O)O2)CC2=C1C1=CCCCC1=N2
106 406.1509805401 CC1=NC(=[NH+]C2=CC=NC(=O)N2C2C=C(O)C(=C=O)O2)CC2=C1C1CCCCC1=N2
107 292.1192864881 CC1=NC(=[NH+]C2=NC(O)=NC=C2)C=C2N=C3C=CC=CC3C21
108 406.1509805401 CC1=NC(=[NH+]C2=CC=NC(=O)N2C=C=C(O)C(=O)C=O)CC2=C1C1CCCCC1=N2 Intermediate Fragment 
109 200.1182238681 CC1=NC(=[NH2+])C=C2N=C3CCC=CC3C21
110 198.1025738041 CC(=NC#[NH+])C1=C(C)N=C2CC=CC=C21 Intermediate Fragment 
111 198.1025738041 C=C=NC(=[NH2+])CC1=CC2=CC=CCC2=N1 Intermediate Fragment 
112 198.1025738041 C=C=C1C(=CC(N)=[NH2+])N=C2CC=CC=C12 Intermediate Fragment 
113 198.1025738041 CC(=N)C1=C(CC#[NH+])N=C2CC=CC=C21 Intermediate Fragment 
114 198.1025738041 [CH2+]C1=NC(=N)CC=C1C1=CC=CCC1=N Intermediate Fragment 
115 226.0822322841 [NH3+]C1C=CN(C2=CC(O)C(=C=O)O2)C(O)N1
116 226.0822322841 [NH3+]C1C=CN(C=C=C(O)C(=O)C=O)C(O)N1 Intermediate Fragment 
117 228.0978823481 [NH3+]C1CCN(C2=CC(O)C(=C=O)O2)C(O)N1
118 228.0978823481 [NH3+]C1CCN(C(O)=C=C(O)C#CO)C(O)N1 Intermediate Fragment 
119 183.0916747721 [CH3+]=C1N=CC=C2N=C3C=CC=CC3C12
120 407.1462295081 [NH3+]C1=NC(=O)N(C2C=C(O)C(=C=O)O2)C(N=C2CC3=C(C=N2)C2CCCCC2=N3)=C1
121 405.1669649521 CC1=NC(=NC2=CC([NH3+])=NC(=O)N2C2C=CC(=C=O)O2)CC2=C1C1CCCCC1=N2
122 375.1564002681 CC1=NC(=NC2=CC([NH3+])=NC(=O)N2C2C=CCO2)CC2=C1C1=CC=CCC1=N2
123 423.1775296361 C=C(OC(=C=O)CO)N1C(=O)N=C([NH3+])C=C1N=C1CC2=C(C(C)=N1)C1CCCCC1=N2 Intermediate Fragment 
124 331.1301855201 C#CN1C(=O)N=C([NH3+])C=C1N=C1CC2=C(C3=CC=CCC3=N2)C(C)=N1
125 333.1458355841 C#CN1C(=O)N=C([NH3+])C=C1N=C1CC2=C(C3=CCCCC3=N2)C(C)=N1
126 333.1458355841 C#CN(C(=N)O)C(=C=C=[NH2+])N=C1CC2=C(C3=CCCCC3=N2)C(C)=N1 Intermediate Fragment 
127 333.1458355841 C#CNC(O)=NC([NH3+])=C=C=NC1=NC(C)=C2C(=C1)N=C1CCCC=C12 Intermediate Fragment 
128 75.0440558841 OCC=C[OH2+]
129 347.1251001401 [CH+]=C(O)N1C(=O)N=C(N)C=C1N=C1CC2=C(C3=CC=CCC3=N2)C(C)=N1
130 349.1407502041 C=C(O)N1C(=O)N=C([NH3+])C=C1N=C1CC2=C(C3=CC=CCC3=N2)C(C)=N1
131 351.1564002681 C=C(O)N1C(=O)N=C([NH3+])C=C1N=C1CC2=C(C3=CCCCC3=N2)C(C)=N1
132 393.1669649521 C=C(OC#CO)N1C(=O)N=C([NH3+])C=C1N=C1CC2=C(C(C)=N1)C1CCCCC1=N2
133 423.1775296361 C=C(O)C(=C=O)OCN1C(=O)N=C([NH3+])C=C1N=C1CC2=C(C(C)=N1)C1CCCCC1=N2 Intermediate Fragment 
134 319.1301855201 CC1=NC(=NC2=CC([NH3+])=NC(=O)N2C)C=C2N=C3C=CC=CC3=C21
135 337.1407502041 CC1=NC(=NC2=CC([NH3+])=NC(=O)N2C=O)CC2=C1C1=CCCCC1=N2
136 423.1775296361 CC1=NC(=NC2=CC([NH3+])=NC(=O)N2C=C=C(O)C(=O)C=O)CC2=C1C1CCCCC1N2 Intermediate Fragment 
137 339.1927857761 C#CN1C(=O)N=C([NH3+])C=C1N=C1CC2NC3CCCCC3C2C(C)=N1
138 337.1771357121 C#CN1C(=O)N=C([NH3+])C=C1N=C1CC2=C(C(C)=N1)C1CCCCC1N2
139 319.1665710281 C#CN1CN=C([NH3+])C=C1N=C1CC2=C(C3=CCCCC3=N2)C(C)=N1
140 84.9920203121 O=CC(=O)C#[O+]
141 87.0076703761 O=CC(=[OH+])C=O
142 68.9971056921 [O+]#CC#CO
143 59.0127557561 O=C=C[OH2+]
144 89.0233204401 O=CC(=[OH+])CO
145 71.0127557561 O=CC#C[OH2+]
146 71.0127557561 CC(=O)C#[O+]
147 61.0284058201 OCC=[OH+]
148 91.0389705041 OCC(=[OH+])CO
149 73.0284058201 OCC#C[OH2+]
150 73.0284058201 CC(=[OH+])C=O
151 93.0546205681 OCC([OH2+])CO
152 75.0440558841 CC(=[OH+])CO
153 325.1771357121 CC1=NC(=NC2=CC([NH3+])=NC(=O)N2C)C=C2N=C3CCCCC3C21
154 323.1614856481 CC1=NC(=NC2=CC([NH3+])=NC(=O)N2C)C=C2N=C3CCC=CC3C21
155 321.1458355841 CC1=NC(=NC2=CC([NH3+])=NC(=O)N2C)C=C2N=C3C=CC=CC3C21
156 321.1458355841 C=NC(=C=C([NH3+])N=C=O)N=C1CC2=C(C3=CCCCC3=N2)C(C)=N1 Intermediate Fragment 
157 317.1145354561 [CH2+]N1C(=O)N=C(N)C=C1N=C1C=C2N=C3C=CC=CC3=C2C(C)=N1
158 317.1145354561 [CH+]=NC(=C=C(N)N=C=O)N=C1CC2=C(C3=CC=CCC3=N2)C(C)=N1 Intermediate Fragment 
159 274.1087218041 C#[N+]C(=C=C=N)N=C1CC2=C(C3=CC=CCC3=N2)C(C)=N1
160 289.1196208361 C#[N+]C(=C=C(N)N)N=C1C=C2N=C3C=CC=CC3=C2C(C)=N1
161 317.1145354561 [CH2+]N(C(=N)O)C(=C=C=N)N=C1C=C2N=C3C=CC=CC3=C2C(C)=N1 Intermediate Fragment 
162 103.0389705041 C=C(O)C(=[OH+])CO
163 105.0546205681 C=C(O)C([OH2+])CO
164 87.0440558841 C=C(O)C=C[OH2+]
165 47.0491412641 CC[OH2+]
166 405.1669649521 CC1=NC(=NC2=CC([NH3+])=NC(=O)N2C=C=C(O)C#CO)CC2=C1C1CCCCC1=N2
167 377.1720503321 CC(O)=C=CN1C(=O)N=C([NH3+])C=C1N=C1CC2=C(C3=CCCCC3=N2)C(C)=N1
168 387.1564002681 C#CC(O)=C=CN1C(=O)N=C([NH3+])C=C1N=C1CC2=C(C3=CCCCC3=N2)C(C)=N1
169 101.0597059481 C=C=C(O)CC[OH2+]
170 388.1404158561 CC1=NC(=[NH+]C2=CC=NC(=O)N2C=C=C(O)C#CO)CC2=C1C1=CCCCC1=N2
171 387.1564002681 CC1=NC(=NC2=CC([NH3+])=NC(=O)N2CC#CC#CO)CC2=C1C1=CCCCC1=N2
172 361.1407502041 CC1=NC(=NC2=CC([NH3+])=NC(=O)N2CC#CO)CC2=C1C1=CC=CCC1=N2
173 359.1251001401 CC1=NC(=NC2=CC(N)=NC(=O)N2[CH+]C#CO)CC2=C1C1=CC=CCC1=N2
174 405.1669649521 CC1=NC(=NC(=C=C=[NH2+])N(C=C=C(O)C#CO)C(=N)O)CC2=C1C1CCCCC1=N2 Intermediate Fragment 
175 367.1877003961 CC1=NC(=NC2=CC([NH3+])=NC(=O)N2CC#CO)CC2=C1C1CCCCC1N2
176 349.1771357121 C#CCN1C(=O)N=C([NH3+])C=C1N=C1CC2=C(C(C)=N1)C1CCCCC1=N2
177 365.1720503321 CC1=NC(=NC2=CC([NH3+])=NC(=O)N2CC#CO)CC2=C1C1CCCCC1=N2
178 347.1614856481 C#CCN1C(=O)N=C([NH3+])C=C1N=C1CC2=C(C3=CCCCC3=N2)C(C)=N1
179 365.1720503321 CC1=NC(=NC(=C=C([NH3+])N=C=O)N=CC#CO)CC2=C1C1CCCCC1N2 Intermediate Fragment 
180 365.1720503321 C=C1N=C2CCCCC2C1=C(C)N=C=NC1=CC([NH3+])=NC(=O)N1CC#CO Intermediate Fragment 
181 346.1298511721 CC1=NC(=[NH+]C2=CC=NC(=O)N2CC#CO)CC2=C1C1=CC=CCC1=N2
182 345.1458355841 C#CCN1C(=O)N=C([NH3+])C=C1N=C1CC2=C(C3=CC=CCC3=N2)C(C)=N1
183 363.1564002681 CC1=NC(=NC(=C=C([NH3+])N=C=O)N=CC#CO)CC2=C1C1CCCCC1=N2 Intermediate Fragment 
184 320.1505866161 CC1=NC(=NC(=C=C=N)[NH+]=CC#CO)CC2=C1C1CCCCC1=N2
185 335.1614856481 CC1=NC(=NC(=C=C(N)N)[NH+]=CC#CO)CC2=C1C1=CCCCC1=N2
186 363.1564002681 CC1=NC(=NC(=C=C(N)[NH3+])N(C=O)CC#CO)CC2=C1C1=CC=CCC1=N2 Intermediate Fragment 
187 363.1564002681 CC1=NC(=NC(=C=C=[NH2+])N(CC#CO)C(=N)O)CC2=C1C1=CCCCC1=N2 Intermediate Fragment 
188 363.1564002681 C=C([NH3+])N=C(O)N(C=NC1=NC(C)=C2C(=C1)N=C1CC=CC=C12)CC#CO Intermediate Fragment 
189 363.1564002681 CC1=C2C(=CC(N=C=C=C([NH3+])N=C(O)N=CC#CO)=N1)N=C1CCCCC12 Intermediate Fragment 
190 292.1192864881 CC1=NC(=NC#CC(=N)[NH+]=C=O)CC2=C1C1=CCCCC1=N2
191 363.1564002681 C=C1N=C2CCCC=C2C1=C(C)N=C=NC1=CC([NH3+])=NC(=O)N1CC#CO Intermediate Fragment 
192 363.1564002681 CC(=N)C1=C(CC=NC2=CC([NH3+])=NC(=O)N2CC#CO)N=C2CC=CC=C21 Intermediate Fragment 
193 344.1142011081 CC1=NC(=NC2=CC=NC(=O)N2[CH+]C#CO)CC2=C1C1=CC=CCC1=N2
194 343.1301855201 [C+]#CCN1C(=O)N=C(N)C=C1N=C1CC2=C(C3=CC=CCC3=N2)C(C)=N1
195 361.1407502041 CC1=NC(=NC(=C=C=[NH2+])N(CC#CO)C(=N)O)CC2=C1C1=CC=CCC1=N2 Intermediate Fragment 
196 361.1407502041 C=C(N)N=C(O)N(C#[N+]C1=NC(C)=C2C(=C1)N=C1CC=CC=C12)CC#CO Intermediate Fragment 
197 41.0021910721 [CH+]=C=O
198 63.0440558841 OCC[OH2+]
199 421.1618795721 CC1=NC(=NC2=CC([NH3+])=NC(=O)N2C=C=C(O)C(=O)C=O)CC2=C1C1CCCCC1=N2
200 423.1775296361 CC1=NC(=NC2=CC([NH3+])=NC(=O)N2C(O)=C=C(O)C#CO)CC2=C1C1CCCCC1N2 Intermediate Fragment 
201 355.1877003961 C=C(O)N1C(=O)N=C([NH3+])C=C1N=C1CC2=C(C(C)=N1)C1CCCCC1N2
202 353.1720503321 C=C(O)N1C(=O)N=C([NH3+])C=C1N=C1CC2=C(C(C)=N1)C1CCCCC1=N2
203 43.0178411361 C=C=[OH+]
204 55.0178411361 C#CC=[OH+]
205 339.1564002681 CC1=NC(=NC2=CC([NH3+])=NC(=O)N2C=O)CC2=C1C1CCCCC1=N2
206 335.1251001401 CC1=NC(=NC2=CC([NH3+])=NC(=O)N2C=O)CC2=C1C1=CC=CCC1=N2
207 318.0985510441 CC1=NC(=NC2=CC=NC(=O)N2C#[O+])CC2=C1C1=CC=CCC1=N2
208 153.0407018201 NC1=CC(N)=NC(=O)N1C#[O+]
209 155.0563518841 NC1=CC([NH3+])=NC(=O)N1C=O
210 335.1251001401 CC1=NC(=NC(=C=C([NH3+])N=C=O)N=C=O)CC2=C1C1=CCCCC1=N2 Intermediate Fragment 
211 292.1192864881 CC1=NC(=NC(=C=C=N)[NH+]=C=O)CC2=C1C1=CCCCC1=N2
212 305.1145354561 CC1=NC(=NC(=C=C(N)N)[NH+]=C=O)C=C2N=C3C=CC=CC3=C21
213 335.1251001401 CC1=NC(=NC(=C=C(N)N)N(C#[O+])C=O)CC2=C1C1=CC=CCC1=N2 Intermediate Fragment 
214 335.1251001401 CC1=NC(=NC(=C=C=[NH2+])N(C=O)C(=N)O)CC2=C1C1=CC=CCC1=N2 Intermediate Fragment 
215 249.1134728361 CC1=NC(=NC#CC#[NH+])CC2=C1C1=CCCCC1=N2
216 308.1142011081 C=C(N=C1C=C2N=C3C=CC=CC3=C2C(C)=N1)[NH+](C=O)C(=N)O
217 318.0985510441 CC1=NC(=NC(=C=C=N)N(C#[O+])C=O)CC2=C1C1=CC=CCC1=N2
218 335.1251001401 C=C(N=C1CC2=C(C3=CC=CCC3=N2)C(C)=N1)N(C=O)C(=O)N=C=[NH2+] Intermediate Fragment 
219 293.1033020761 C=C(N=C1C=C2N=C3C=CC=CC3=C2C(C)=N1)[NH+](C=O)C=O
220 335.1251001401 C=C(N)N=C(O)N(C#[O+])C=NC1=NC(C)=C2C(=C1)N=C1CC=CC=C12 Intermediate Fragment 
221 335.1251001401 CC1=C2C(=CC(N=C=C=C([NH3+])N=C(O)N=C=O)=N1)N=C1CCCC=C12 Intermediate Fragment 
222 335.1251001401 CC(=NC1=CC(N)=NC(=O)N1C#[O+])N=C(C)C1=CN=C2CC=CC=C12 Intermediate Fragment 
223 335.1251001401 C=C1N=C2CC=CC=C2C1=C(C)N=C=NC1=CC([NH3+])=NC(=O)N1C=O Intermediate Fragment 
224 333.1094500761 CC1=NC(=NC2=CC(N)=NC(=O)N2C#[O+])CC2=C1C1=CC=CCC1=N2
225 333.1094500761 CC1=NC(=NC(=C=C=N)N(C#[O+])C(=N)O)CC2=C1C1=CC=CCC1=N2 Intermediate Fragment 
226 89.0597059481 C=C(O)CC[OH2+]
227 71.0491412641 C=CC(=C)[OH2+]
228 71.0491412641 C#CCC[OH2+]
229 91.0753560121 CC(O)CC[OH2+]
230 73.0647913281 C=C([OH2+])CC
231 381.1669649521 CC1=NC(=NC2=CC([NH3+])=NC(=O)N2C(=O)C#CO)CC2=C1C1CCCCC1N2
232 363.1564002681 C#CC(=O)N1C(=O)N=C([NH3+])C=C1N=C1CC2=C(C(C)=N1)C1CCCCC1=N2
233 377.1356648241 CC1=NC(=NC2=CC([NH3+])=NC(=O)N2C(=O)C#CO)CC2=C1C1=CCCCC1=N2
234 29.0385765801 C=[CH3+]
235 423.1775296361 CC1=NC(=NC2=CC([NH3+])=NC(=O)N2C(=C=CO)OC#CO)CC2=C1C1CCCCC1N2 Intermediate Fragment 
236 423.1775296361 C=C(N=C1CC2=C(C(C)=N1)C1CCCCC1N2)N(C(=O)N=C=[NH2+])C1C=C(O)C(=C=O)O1 Intermediate Fragment 
237 355.1764670161 C=C(N=C1CC2NC3CCCCC3C2C(C)=N1)[NH+]=C1C=C(O)C(=C=O)O1
238 353.1608169521 C=C(N=C1CC2=C(C(C)=N1)C1CCCCC1N2)[NH+]=C1C=C(O)C(=C=O)O1
239 423.1775296361 CC1=NC(=NC(=C=C=[NH2+])N(C(=N)O)C2C=C(O)C(=C=O)O2)CC2=C1C1CCCCC1N2 Intermediate Fragment 
240 251.1291229001 CC1=NC(=NC#CC#[NH+])CC2=C1C1CCCCC1=N2
241 175.0713332521 NC(O)[NH2+]C1C=C(O)C(=CO)O1
242 380.1353304761 CC1=C2C(=CC(N=C[NH+](C(=N)O)C3C=C(O)C(=C=O)O3)=N1)N=C1CCCC=C12
243 382.1509805401 CC1=C2C(=CC(N=C[NH+](C(=N)O)C3C=C(O)C(=C=O)O3)=N1)N=C1CCCCC12
244 394.1509805401 C=C(N=C1CC2=C(C3=CCCCC3=N2)C(C)=N1)[NH+](C(=N)O)C1C=C(O)C(=C=O)O1
245 396.1666306041 C=C(N=C1CC2=C(C(C)=N1)C1CCCCC1=N2)[NH+](C(=N)O)C1C=C(O)C(=C=O)O1
246 379.1400815081 C=C(N=C1CC2=C(C3=CCCCC3=N2)C(C)=N1)[NH+](C=O)C1C=C(O)C(=C=O)O1
247 396.1666306041 C=C(N=C1CC2=C(C(C)=N1)C1CCCCC1=N2)[NH+](C(=N)O)C(O)=C=C(O)C#CO Intermediate Fragment 
248 406.1509805401 CC1=NC(=NC(=C=C=N)[NH+](C=O)C2C=C(O)C(=C=O)O2)CC2=C1C1CCCCC1=N2
249 294.1349365521 CC1=NC(=NC(=C=C=N)[NH2+]C=O)CC2=C1C1=CCCCC1=N2
250 380.1717159841 CC1=NC(=NC(=C=C=N)[NH+]=C2C=C(O)C(=C=O)O2)CC2NC3CCCCC3C12
251 378.1560659201 CC1=NC(=NC(=C=C=N)[NH+]=C2C=C(O)C(=C=O)O2)CC2=C1C1CCCCC1N2
252 423.1775296361 CC1=NC(=NC(=C=C(N)[NH3+])N(C=O)C2C=C(O)C(=C=O)O2)CC2=C1C1CCCCC1=N2 Intermediate Fragment 
253 266.1400219321 CC1=NC(=NC#CC(N)=[NH2+])C=C2N=C3CCC=CC3C21
254 395.1826150161 CC1=NC(=NC(=C=C(N)N)[NH+]=C2C=C(O)C(=C=O)O2)CC2=C1C1CCCCC1N2
255 423.1775296361 CC1=NC(=NC(=C=C([NH3+])N=C=O)N=C2C=C(O)C(=C=O)O2)CC2NC3CCCCC3C12 Intermediate Fragment 
256 423.1775296361 CC1=C2C(CC(N=C=C=C([NH3+])N=C(O)N=C3C=C(O)C(=C=O)O3)=N1)NC1CCCCC21 Intermediate Fragment 
257 294.1349365521 CC1=NC(=NC#CC(N)=[NH+]C=O)CC2=C1C1=CCCCC1=N2
258 423.1775296361 C=C([NH3+])N=C(O)N(C=NC1=NC(C)=C2C(=C1)N=C1CCCCC12)C1C=C(O)C(=C=O)O1 Intermediate Fragment 
259 423.1775296361 CC=C1C(=CC(N)=NC2=CC([NH3+])=NC(=O)N2C2C=C(O)C(=C=O)O2)N=C2CCCCC12 Intermediate Fragment 
260 423.1775296361 CC=NC(CC1=CC2CCCCC2=N1)=NC1=CC([NH3+])=NC(=O)N1C1C=C(O)C(=C=O)O1 Intermediate Fragment 
261 382.1509805401 [NH3+]C1=NC(=O)N(C2C=C(O)C(=C=O)O2)C(N=CCC2=CC3CCCCC3=N2)=C1
262 423.1775296361 CC(=NC1=CC([NH3+])=NC(=O)N1C1C=C(O)C(=C=O)O1)N=C(C)C1=CN=C2CCCCC12 Intermediate Fragment 
263 265.0931313161 CCNC1=CC([NH3+])=NC(=O)N1C1C=C(O)C(=C=O)O1
264 423.1775296361 C=C1NC2CCCCC2C1=C(C)N=C=NC1=CC([NH3+])=NC(=O)N1C1C=C(O)C(=C=O)O1 Intermediate Fragment 
265 268.1040303481 NCNC1=CC([NH3+])=NC(O)N1C1C=C(O)C(=C=O)O1
266 423.1775296361 CC(=N)C1=C(CC=NC2=CC([NH3+])=NC(=O)N2C2C=C(O)C(=C=O)O2)N=C2CCCCC21 Intermediate Fragment 
267 406.1509805401 CC=C1C(=CC=NC2=CC([NH3+])=NC(=O)N2C2C=C(O)C(=C=O)O2)N=C2CCCC=C12
268 292.1192864881 C=C=C1C(=CC=NC2=NC(O)=NC([NH3+])=C2)N=C2CC=CC=C12
269 423.1775296361 CC1=NC(=NC2=CC([NH3+])=NC(=O)N2C2C=C(O)C(=C=O)O2)CC=C1C1CCCCC1=N Intermediate Fragment 
270 406.1509805401 CC1=NC(=NC2=CC([NH3+])=NC(=O)N2C2C=C(O)C(=C=O)O2)CC=C1C1=CCCC=C1
271 423.1775296361 CC1=NC(=NC2=CC([NH3+])=NC(=O)N2C2C=C(O)C(=C=O)O2)CC(N=C2CCCCC2)=C1 Intermediate Fragment 
272 330.1196804121 CC1=NC(=NC2=CC([NH3+])=NC(=O)N2C2C=C(O)C(=C=O)O2)CCC1
273 216.0879863601 [CH2+]C1=NC(=NC2=NC(O)=NC(N)=C2)CC=C1
274 330.1196804121 CC1=NC(=NC2=CC([NH3+])=NC(=O)N2C=C=C(O)C(=O)C=O)CCC1 Intermediate Fragment 
275 423.1775296361 CC1=NC(=NC2=CC([NH3+])=NC(=O)N2C2C=C(O)C(=C=O)O2)CC(N)=C1C1=CCCCC1 Intermediate Fragment 
276 423.1775296361 CCC1=NC2=C(C(C)=NC(=NC3=CC([NH3+])=NC(=O)N3C3C=C(O)C(=C=O)O3)C2)C1CC Intermediate Fragment 
277 397.1618795721 CCC1CC2=C(CC(=NC3=CC([NH3+])=NC(=O)N3C3C=C(O)C(=C=O)O3)N=C2C)N1
278 397.1618795721 CCC1CNC2=C1C(C)=NC(=NC1=CC([NH3+])=NC(=O)N1C1C=C(O)C(=C=O)O1)C2
279 395.1462295081 CCC1C=NC2=C1C(C)=NC(=NC1=CC([NH3+])=NC(=O)N1C1C=C(O)C(=C=O)O1)C2
280 423.1775296361 CCCC1C(C)=NC2=C1C(C)=NC(=NC1=CC([NH3+])=NC(=O)N1C1C=C(O)C(=C=O)O1)C2 Intermediate Fragment 
281 423.1775296361 CCCCC1C=NC2=C1C(C)=NC(=NC1=CC([NH3+])=NC(=O)N1C1C=C(O)C(=C=O)O1)C2 Intermediate Fragment 
282 369.1305794441 CC1=NC(=NC2=CC([NH3+])=NC(=O)N2C2C=C(O)C(=C=O)O2)CC2=C1CCN2
283 371.1462295081 CC1=NC(=NC2=CC([NH3+])=NC(=O)N2C2C=C(O)C(=C=O)O2)CC2NCCC12
284 383.1462295081 CC1=NC(=NC2=CC([NH3+])=NC(=O)N2C2C=C(O)C(=C=O)O2)CC2=C1C(C)CN2
285 393.1305794441 CC=C1C=NC2=C1C(C)=NC(=NC1=CC([NH3+])=NC(=O)N1C1C=C(O)C(=C=O)O1)C2
286 423.1775296361 CCCCC1=NC2=C(C1)C(C)=NC(=NC1=CC([NH3+])=NC(=O)N1C1C=C(O)C(=C=O)O1)C2 Intermediate Fragment 
