#In-silico ESI-MS/MS [M+H]+ Spectra
#PREDICTED BY CFM-ID 4.0.8
#SMILES=C1(CC(OC1CO)n1c(c(c(=O)[nH]c1=O)C)C1OC2C(C1O)c1c(O2)cc(c2c1oc(=O)c1c2CCC1=O)C=O)O
#InChiKey=PVSQICHYXBONHY-UHFFFAOYSA-N
energy0
551.12964 12.64 123 124 3 18 130 125 253 29 19 96 22 176 26 35 27 33 24 25 28 34 256 21 303 (2.2744 1.932 1.8428 0.98804 0.83456 0.70387 0.2183 0.076475 0.064336 0.058547 0.054457 0.03189 0.031256 0.02279 0.013591 0.0077966 0.0075485 0.005232 0.0038909 0.0033251 0.0032481 0.0025289 0.00050064)
569.14020 100.00 0 181 295 318 233 291 150 252 326 274 216 275 341 330 147 235 337 220 293 217 328 316 239 131 315 317 323 237 294 304 325 (68.385 0.98707 0.40934 0.39019 0.38086 0.35775 0.27936 0.24294 0.21636 0.19416 0.18208 0.13396 0.11527 0.076938 0.074056 0.043172 0.027955 0.02511 0.020625 0.01874 0.012784 0.010989 0.009161 0.0084644 0.0073751 0.0057737 0.0043403 0.0026409 0.0025597 0.001363 0.0010531)
energy1
57.03349 11.51 89 (1.2147)
87.04406 14.39 78 206 (1.366 0.15335)
99.04406 54.09 8 87 82 (3.8405 1.2217 0.64687)
117.05462 26.49 80 91 94 86 83 (1.4002 0.60892 0.47011 0.24528 0.071224)
123.01890 13.09 39 (1.3813)
125.03455 89.07 40 (9.4012)
127.05020 40.23 41 (4.2467)
223.07133 9.90 10 105 110 (0.84432 0.16983 0.030351)
241.08190 10.75 103 106 115 116 113 114 (1.0504 0.045157 0.01504 0.012135 0.0087995 0.0036924)
425.09794 8.44 65 51 72 (0.73078 0.13788 0.021738)
453.09286 100.00 5 52 64 71 70 48 63 69 198 49 61 50 75 59 54 66 57 (7.7048 0.54232 0.47984 0.43979 0.22835 0.22766 0.22217 0.13045 0.11434 0.098488 0.088347 0.055375 0.053194 0.052625 0.045713 0.037469 0.034393)
463.07721 24.96 175 (2.6345)
465.09286 22.27 156 171 172 158 160 170 162 169 163 168 174 (2.0409 0.074227 0.050781 0.0457 0.039056 0.022582 0.020968 0.019619 0.013428 0.012712 0.010692)
479.07212 12.58 203 205 (1.3202 0.0077566)
479.10851 10.41 134 136 135 (1.0891 0.005822 0.0036484)
481.08777 63.16 149 186 201 197 200 196 190 195 188 192 189 202 199 191 (5.7493 0.24082 0.15446 0.15419 0.12247 0.044695 0.042883 0.038831 0.027261 0.02516 0.021815 0.021163 0.013023 0.010656)
483.10342 13.50 148 (1.425)
523.13472 14.04 320 15 (0.81453 0.66721)
525.11399 15.28 23 334 213 306 (1.5412 0.062437 0.0082742 0.00075994)
533.11907 14.70 17 13 16 30 (1.053 0.26342 0.20383 0.031483)
539.12964 9.81 127 2 335 322 223 (0.58649 0.33134 0.057819 0.036061 0.023914)
541.14529 15.70 319 128 321 129 224 336 146 225 290 226 (0.81357 0.39739 0.23495 0.079667 0.044448 0.032247 0.026922 0.013737 0.013657 0.00014185)
551.12964 89.56 3 130 124 125 123 27 176 25 22 34 18 29 24 19 21 96 33 253 26 35 28 256 303 (5.1375 1.0282 0.70139 0.64198 0.52172 0.26527 0.17706 0.16878 0.13921 0.11837 0.11424 0.1106 0.073746 0.069965 0.043674 0.029745 0.027474 0.026431 0.022325 0.020682 0.011222 0.001996 0.0014145)
569.14020 77.99 0 181 150 318 295 131 328 291 274 233 326 235 216 330 341 275 147 316 239 220 252 337 217 294 323 325 237 293 317 304 315 (5.0732 1.8682 0.34705 0.082276 0.072595 0.066478 0.065297 0.061908 0.061003 0.057864 0.056984 0.054601 0.051021 0.049636 0.045959 0.040866 0.037018 0.029941 0.023635 0.021163 0.020879 0.015066 0.0095157 0.0070575 0.004799 0.0045723 0.00097071 0.00094188 0.0008356 0.00041135 0.00034425)
energy2
45.03349 8.58 85 (0.88612)
59.04914 30.43 88 (3.1406)
75.04406 31.02 139 (3.2021)
125.03455 66.53 40 (6.867)
127.05020 32.38 41 (3.3424)
169.06077 16.17 269 119 (0.94705 0.72159)
215.06625 11.79 286 (1.2173)
269.04445 14.88 62 (1.5361)
281.07681 12.96 261 (1.3382)
283.09246 8.50 260 (0.87754)
285.03936 16.91 262 (1.7457)
287.05501 8.37 263 (0.86349)
287.12376 18.93 257 (1.9544)
382.05574 9.90 247 (1.0217)
382.09213 10.72 43 (1.1064)
425.09794 10.20 51 72 65 (0.45158 0.33863 0.26281)
438.08196 9.17 238 (0.94606)
453.09286 47.15 5 71 61 75 59 52 54 57 66 50 48 63 64 198 70 49 69 (1.8311 0.43407 0.34513 0.27724 0.2743 0.25904 0.25151 0.21644 0.20179 0.17617 0.17165 0.14825 0.1244 0.062323 0.055067 0.027969 0.0097383)
461.06156 10.64 204 (1.098)
463.07721 13.84 175 (1.4283)
477.09286 11.00 133 132 (0.91807 0.21718)
479.07212 18.26 203 205 (1.5292 0.35566)
479.10851 100.00 135 136 134 (5.1598 3.7182 1.4438)
481.08777 91.39 192 149 191 186 201 190 202 195 196 189 199 188 200 197 (1.7124 1.3551 0.9898 0.75245 0.68513 0.68088 0.67518 0.63798 0.45334 0.36124 0.35107 0.34722 0.2708 0.16096)
483.13981 8.49 137 (0.87646)
485.15546 8.49 138 (0.87646)
509.08269 17.34 329 (1.7899)
523.09834 11.84 333 307 214 (1.098 0.12282 0.0014621)
539.12964 9.23 335 2 127 322 223 (0.48612 0.17735 0.14199 0.11448 0.032477)
551.12964 13.84 130 303 123 96 124 125 176 256 35 253 3 22 34 24 26 21 19 28 18 33 25 29 27 (0.47478 0.33037 0.32039 0.17816 0.074221 0.042246 0.0050045 0.0015719 0.000381 0.00020696 0.00014725 0.00013765 0.00011235 8.908e-05 8.8511e-05 6.5665e-05 5.397e-05 5.0296e-05 4.5482e-05 4.2385e-05 3.7677e-05 2.7171e-05 2.2007e-05)

0 569.1402006601 Cc1c(C2OC3Oc4cc(C=O)c5c6c(c(=O)oc5c4C3C2O)C(=O)CC6)n(C2CC(O)C(C[OH2+])O2)c(=O)[nH]c1=O
1 537.1139859121 CC1=C(C2OC3=C(C2=O)C2=C(C=C(CO)C4=C2OC(=O)C2=C4CCC2O)O3)N(C2C=C(O)CO2)C(O)=NC1=[OH+]
2 539.1296359761 CC1=C(C2OC3=C(C2=O)C2=C(C=C(CO)C4=C2OC(=O)C2C(O)CCC42)O3)N(C2C=C(O)CO2)C(O)=NC1=[OH+]
3 551.1296359761 C=C1OC(N2C(O)=NC(=[OH+])C(C)=C2C2OC3=C(C2=O)C2=C(C=C(CO)C4=C2OC(=O)C2C(O)CCC42)O3)C=C1O
4 455.1085066081 CC1=C([OH2+])N=C(O)N=C1C1OC2=C(C1=O)C1=C(C=C(CO)C3=C1OC(=O)C1C(O)CCC31)O2
5 453.0928565441 CC1=C([OH2+])N=C(O)N=C1C1OC2=C(C1=O)C1=C(C=C(CO)C3=C1OC(=O)C1=C3CCC1O)O2
6 451.0772064801 CC1=C([OH2+])N=C(O)N=C1C1OC2=C(C1=O)C1=C(C=C(CO)C3=C1OC(=O)C1=C3C=CC1O)O2
7 449.0615564161 CC1=C([OH2+])N=C(O)N=C1C1OC2=C(C1=O)C1=C(C=C(CO)C3=C1OC(=O)C1=C3C=CC1=O)O2
8 99.0440558841 C=C1OC=CC1[OH2+]
9 329.0655791761 O=C1OC2=C(C(CO)=CC3=C2C2=C(OCC2=[OH+])O3)C2=C1C(O)CC2
10 223.0713332521 C=C1OC(N2C=C(C)C(=[OH+])N=C2O)=CC1O
11 225.0869833161 C=C1OC(N2C=C(C)C(=[OH+])NC2O)=CC1O
12 227.1026333801 C=C1OC(N2C=C(C)C([OH2+])NC2O)=CC1O
13 533.1190712921 C=C1OC(N2C(O)=NC(=[OH+])C(C)=C2C2CC3=C(OC4=C3C3=C(C(CO)=C4)C4=C(C(=O)O3)C(O)C=C4)O2)C=C1O
14 519.1034212281 C=C1OC(N2C(O)=NC(=[OH+])C(C)=C2C2OC3=C(C2=O)C2=C(C=CC4=C2OC(=O)C2=C4CCC2O)O3)C=C1O
15 523.1347213561 C=C1OC(N2C(O)=NC(=[OH+])C(C)=C2C2OC3=C(C2=O)C2=C(C=CC4=C2OC(O)C2C(O)CCC42)O3)C=C1O
16 533.1190712921 C=C1OC(N2C(O)=NC(=[OH+])C(C)=C2C2OC3=C(C2=O)C2=C(C=C(C)C4=C2OC(=O)C2=C4CCC2O)O3)C=C1O
17 533.1190712921 C=C1C=CC(N2C(O)=NC(=[OH+])C(C)=C2C2OC3=C(C2=O)C2=C(C=C(CO)C4=C2OC(=O)C2=C4CCC2O)O3)O1
18 551.1296359761 C=C(CO)OC(=C)N1C(O)=NC(=[OH+])C(C)=C1C1OC2=C(C1=O)C1=C(C=C(CO)C3=C1OC(=O)C1=C3CCC1O)O2 Intermediate Fragment 
19 551.1296359761 CC(=O)C(O)=C=CN1C(O)=NC(=[OH+])C(C)=C1C1OC2=C(C1=O)C1=C(C=C(CO)C3=C1OC(=O)C1C(O)CCC31)O2 Intermediate Fragment 
20 481.1241566721 C#CN1C(O)=NC(=[OH+])C(C)=C1C1OC2=C(C1=O)C1=C(C=C(CO)C3=C1OC(O)C1C(O)CCC31)O2
21 551.1296359761 C#CC(O)=C=C(O)N1C(O)=NC(=[OH+])C(C)=C1C1OC2=C(C1=O)C1=C(C=C(CO)C3=C1OC(O)C1C(O)CCC31)O2 Intermediate Fragment 
22 551.1296359761 C#COC(=C=CO)N1C(O)=NC(=[OH+])C(C)=C1C1OC2=C(C1=O)C1=C(C=C(CO)C3=C1OC(O)C1C(O)CCC31)O2 Intermediate Fragment 
23 525.1139859121 CC1=C(C2OC3=C(C2=O)C2=C(C=C(CO)C4=C2OC(O)C2C(O)CCC42)O3)N(C(=[OH+])C#CO)C(O)=NC1=O
24 551.1296359761 C=C1OC(N(C(=N)O)C(=C(C)C=[OH+])C2OC3=C(C2=O)C2=C(C=C(CO)C4=C2OC(=O)C2=C4CCC2O)O3)C=C1O Intermediate Fragment 
25 551.1296359761 C=C1OC(=NC(=C(C)C(=[OH+])N=C=O)C2OC3=C(C2=O)C2=C(C=C(CO)C4=C2OC(O)C2C(O)CCC42)O3)C=C1O Intermediate Fragment 
26 551.1296359761 C=C1OC(N2C(O)=NC(=[OH+])C(C)=C2CC(O)=C2C(=O)OC3=C2C2=C(C(CO)=C3)C3=C(C(=O)O2)C(O)CC3)C=C1O Intermediate Fragment 
27 551.1296359761 C=C1OC(N2C(O)=NC(=[OH+])C(C)=C2COC2=C(C=O)C3=C(C=C(CO)C4=C3OC(=O)C3=C4CCC3O)O2)C=C1O Intermediate Fragment 
28 551.1296359761 C=C1OC(N2C(O)=NC(=[OH+])C(C)=C2C(C=O)OC2=CC3=C(C=C(CO)C4=C3OC(=O)C3=C4CCC3O)O2)C=C1O Intermediate Fragment 
29 551.1296359761 C=C1OC(N2C(O)=NC(=[OH+])C(C)=C2C2OC3=C(C2=O)C2=C(C=C(CO)C(C4=C(C(=O)O)C(O)CC4)=C2)O3)C=C1O Intermediate Fragment 
30 533.1190712921 C=C1OC(N2C(O)=NC(=[OH+])C(C)=C2C2OC3=C(C2=O)C2=C(C=C(CO)C(C4=CCC(O)C4=C=O)=C2)O3)C=C1O
31 507.1398067361 C=C1OC(N2C(O)=NC(=[OH+])C(C)=C2C2OC3=C(C2=O)C2=C(C=C(CO)C(C4=CC(O)CC4)=C2)O3)C=C1O
32 505.1241566721 C=C1OC(N2C(O)=NC(=[OH+])C(C)=C2C2OC3=C(C2=O)C2=C(C=C(CO)C(C4=CC(O)C=C4)=C2)O3)C=C1O
33 551.1296359761 C=C1OC(N2C(O)=NC(=[OH+])C(C)=C2C2OC3=C(C2=O)C2=C(C=C(CO)C4=C2OC(=O)C=C4CCCO)O3)C=C1O Intermediate Fragment 
34 551.1296359761 C=C1OC(N2C(O)=NC(=[OH+])C(C)=C2C2OC3=C(C2=O)C2=C(C=C(CO)C4=C2OC(=O)C(CO)=C4CC)O3)C=C1O Intermediate Fragment 
35 551.1296359761 C=C1OC(N2C(O)=NC(=[OH+])C(C)=C2C2OC3=C(C2=O)C2=C(C=C(CO)C4=C2OC(=O)C(C(C)O)=C4C)O3)C=C1O Intermediate Fragment 
36 507.1034212281 C=C1OC(N2C(O)=NC(=[OH+])C(C)=C2C2OC3=C(C2=O)C2=C(C=C(CO)C4=C2OC(=O)C=C4C)O3)C=C1O
37 505.0877711641 C=C1OC(N2C(O)=NC(=[OH+])C(C)=C2C2OC3=C(C2=O)C2=C(C=C(C=O)C4=C2OC(=O)C=C4C)O3)C=C1O
38 459.1398067361 CC1=C([OH2+])N=C(O)N=C1C1OC2=C(C1=O)C1=C(C=C(CO)C3C1OC(O)C1C(O)CCC31)O2
39 123.0189037561 [CH+]=C1C=NC(O)=NC1=O
40 125.0345538201 C=C1C=NC(O)=NC1=[OH+]
41 127.0502038841 CC1C=NC(O)=NC1=[OH+]
42 459.1398067361 C#CC(=NC(=O)N=C=[OH+])C1OC2=C(C1=O)C1C(CC(CO)C3C4CCC(O)C4C(O)OC13)O2 Intermediate Fragment 
43 382.0921282721 C#CC(=[NH2+])C1OC2=C(C1=O)C1=C(C=C(CO)C3=C1OC(=O)C1C(O)CCC31)O2
44 459.1398067361 CC1=C([OH2+])N=C(O)N=C1CC(O)=C1C(=O)OC2=C1C1=C(C(CO)=C2)C2CCC(O)C2C(O)O1 Intermediate Fragment 
45 459.1398067361 CCC1C2=C(OC(O)C1CO)C1=C(C=C2CO)OC2=C1C(=O)C(C1=NC(O)=NC([OH2+])=C1C)O2 Intermediate Fragment 
46 457.1241566721 CC1=C([OH2+])N=C(O)N=C1C1OC2=C(C1=O)C1=C(C=C(CO)C3=C1OC(O)C1C(O)CCC31)O2
47 435.0822918601 CC1=C([OH2+])N=C(O)N=C1C1CC2=C(OC3=C2C2=C(C(CO)=C3)C3=C(C(=O)C=C3)C(=O)O2)O1
48 453.0928565441 CC(C(=N)C1OC2=C(C1=O)C1=C(C=C(CO)C3=C1OC(=O)C1=C3CCC1O)O2)=C([OH2+])N=C=O Intermediate Fragment 
49 453.0928565441 CC(C(=NC=O)C1OC2=C(C1=O)C1=C(C=C(CO)C3=C1OC(=O)C1=C3C=CC1O)O2)=C(N)[OH2+] Intermediate Fragment 
50 453.0928565441 CC(=C=[OH+])C(=NC(=N)O)C1OC2=C(C1=O)C1=C(C=C(CO)C3=C1OC(=O)C1=C3CCC1O)O2 Intermediate Fragment 
51 425.0979419241 C#CC(=[NH+]C(=N)O)C1OC2=C(C1=O)C1=C(C=C(CO)C3=C1OC(=O)C1C(O)CCC31)O2
52 453.0928565441 C#CC(=NC(=O)N=C=[OH+])C1OC2=C(C1=O)C1=C(C=C(CO)C3=C1OC(O)C1C(O)CCC31)O2 Intermediate Fragment 
53 408.0713928281 C#CC(=[NH+]C=O)C1OC2=C(C1=O)C1=C(C=C(CO)C3=C1OC(=O)C1=C3CCC1O)O2
54 453.0928565441 CC(=C=C1OC2=C(C1=O)C1=C(C=C(CO)C3=C1OC(=O)C1=C3CCC1O)O2)C(=[OH+])N=C(N)O Intermediate Fragment 
55 367.0812292401 CC#CC1OC2=C(C1=[OH+])C1=C(C=C(CO)C3=C1OC(=O)C1=C3CCC1O)O2
56 393.0604937961 CC(=C=C1OC2=C(C1=O)C1=C(C=C(CO)C3=C1OC(=O)C1=C3C=CC1O)O2)C=[OH+]
57 453.0928565441 CC1=C([OH2+])N=C(O)N=C1CC(O)=C1C(=O)OC2=C1C1=C(C(CO)=C2)C2=C(C(=O)O1)C(O)C=C2 Intermediate Fragment 
58 435.0822918601 CC1=C([OH2+])N=C(O)N=C1CC(=O)C1=COC2=C1C1=C(C(CO)=C2)C2=C(C(=O)C=C2)C(=O)O1
59 453.0928565441 CC1=C([OH2+])N=C(O)N=C1C(C=O)OC1=CC2=C(C=C(CO)C3=C2OC(=O)C2=C3C=CC2O)O1 Intermediate Fragment 
60 267.0287997441 O=CC1=CC2=C(C=CO2)C2=C1C1=C(C(=O)C=C1)C(=[OH+])O2
61 453.0928565441 CC1=C([OH2+])N=C(O)N=C1C(=O)C(=O)C1=COC2=C1C1=C(C(CO)=C2)C2=C(C(=O)O1)C(O)CC2 Intermediate Fragment 
62 269.0444498081 O=C1C=CC2=C1C(=[OH+])OC1=C2C(CO)=CC2=C1C=CO2
63 453.0928565441 CC1=C([OH2+])N=C(O)N=C1C1OC=C(C2=C(O)C=C(CO)C3=C2OC(=O)C2=C3C=CC2O)C1=O Intermediate Fragment 
64 453.0928565441 CC1=C([OH2+])N=C(O)N=C1C1OC2=C(C1=O)C1=C(C=C(CO)C(C3=CCC(O)C3=C=O)=C1O)O2 Intermediate Fragment 
65 425.0979419241 CC1=C([OH2+])N=C(O)N=C1C1OC2=C(C1=O)C1=C(C=C(CO)C(C3=CC(O)C=C3)=C1O)O2
66 453.0928565441 CC1=C([OH2+])N=C(O)N=C1C1OC2=C(C1=O)C1=C(C=C(CO)C(C3=C(C(=O)O)C(O)C=C3)=C1)O2 Intermediate Fragment 
67 435.0822918601 CC1=C([OH2+])N=C(O)N=C1C1OC2=C(C1=O)C1=C(C=C(CO)C(C3=CC=C(O)C3=C=O)=C1)O2
68 409.1030273041 CC1=C([OH2+])N=C(O)N=C1C1OC2=C(C1=O)C1=C(C=C(CO)C(C3=CC(O)C=C3)=C1)O2
69 453.0928565441 C=CC(O)C1=CC2=C(OC1=O)C1=C(C=C2CO)OC2=C1C(=O)C(C1=NC(O)=NC([OH2+])=C1C)O2 Intermediate Fragment 
70 453.0928565441 CC1=C([OH2+])N=C(O)N=C1C1OC2=C(C1=O)C1=C(C=C(CO)C3=C1OC(=O)C=C3C=CCO)O2 Intermediate Fragment 
71 453.0928565441 C=CC1=C(CO)C(=O)OC2=C1C(CO)=CC1=C2C2=C(O1)OC(C1=NC(O)=NC([OH2+])=C1C)C2=O Intermediate Fragment 
72 425.0979419241 CCC1=CC(=O)OC2=C1C(CO)=CC1=C2C2=C(O1)OC(C1=NC(O)=NC([OH2+])=C1C)C2=O
73 423.0822918601 C=CC1=CC(=O)OC2=C1C(CO)=CC1=C2C2=C(O1)OC(C1=NC(O)=NC([OH2+])=C1C)C2=O
74 421.0666417961 C#CC1=CC(=O)OC2=C1C(CO)=CC1=C2C2=C(O1)OC(C1=NC(O)=NC([OH2+])=C1C)C2=O
75 453.0928565441 C=C(O)C1=C(C)C2=C(OC1=O)C1=C(C=C2CO)OC2=C1C(=O)C(C1=NC(O)=NC([OH2+])=C1C)O2 Intermediate Fragment 
76 111.0076703761 O=C1C=COC1=C=[OH+]
77 115.0389705041 OC1C=COC1=C[OH2+]
78 87.0440558841 [OH2+]C1C=COC1
79 115.0389705041 O=C=C=C(O)CC[OH2+] Intermediate Fragment 
80 117.0546205681 OC1C=COC1C[OH2+]
81 89.0597059481 [OH2+]C1CCOC1
82 99.0440558841 [OH2+]C=C1C=CCO1
83 117.0546205681 C=COC(=C[OH2+])CO Intermediate Fragment 
84 91.0389705041 OCC(=[OH+])CO
85 45.0334912001 C=C[OH2+]
86 117.0546205681 C=C=C(O)C(O)C[OH2+] Intermediate Fragment 
87 99.0440558841 C=C=C(O)C=C[OH2+]
88 59.0491412641 CC=C[OH2+]
89 57.0334912001 CC#C[OH2+]
90 61.0284058201 OCC=[OH+]
91 117.0546205681 OC=C=C(O)CC[OH2+] Intermediate Fragment 
92 43.0178411361 C#C[OH2+]
93 89.0597059481 C=C(O)CC[OH2+]
94 117.0546205681 OC=C=COCC[OH2+] Intermediate Fragment 
95 119.0702706321 OC1CCOC1C[OH2+]
96 551.1296359761 CC1=C(C2OC3=C(C2=O)C2=C(C=C(CO)C4=C2OC(O)C2C(O)CCC42)O3)N(C2C=C(O)C(=C=[OH+])O2)C=NC1=O
97 333.0968793041 OCC1=CC2=C(C3=C1C1CCC(O)C1C(O)O3)C1=C(OCC1=[OH+])O2
98 311.0550144921 O=C1C=CC2=C1C(=[OH+])OC1=C2C(CO)=CC2=C1C1=C(OCC1)O2
99 327.0499291121 O=C1OC2=C(C(CO)=CC3=C2C2=C(OCC2=[OH+])O3)C2=C1C(O)C=C2
100 235.0349477441 [CH2+]C1=CN(C2C=C(O)C(=C=O)O2)C(O)=NC1=O
101 237.0505978081 CC1=CN(C2C=C(O)C(=C=[OH+])O2)C(O)=NC1=O
102 239.0662478721 CC1=CN(C2C=C(O)C(=C=[OH+])O2)C(O)NC1=O
103 241.0818979361 CC1=CN(C2C=C(O)C(=C=[OH+])O2)C(O)NC1O
104 131.0815040121 CC1C=NC(O)NC1[OH2+]
105 223.0713332521 CC1=CN(C2C=CC(=C=[OH+])O2)C(O)NC1=O
106 241.0818979361 CC1=CN(C=C=C(O)C(=O)C=[OH+])C(O)NC1O Intermediate Fragment 
107 155.0815040121 C#CN1C=C(C)C([OH2+])NC1O
108 153.0658539481 C#CN1C=C(C)C(=[OH+])NC1O
109 89.0233204401 O=CC(=[OH+])CO
110 223.0713332521 CC1=CN(C=C=C(O)C#C[OH2+])C(O)NC1=O
111 183.0764186321 CC1=CN(CC#CO)C(O)NC1=[OH+]
112 181.0607685681 CC1=CN(CC#CO)C(O)=NC1=[OH+]
113 241.0818979361 CC1=CN(C(O)=C=C(O)C#C[OH2+])C(O)NC1O Intermediate Fragment 
114 241.0818979361 CC=CN(C(O)NC=O)C1C=C(O)C(=C=[OH+])O1 Intermediate Fragment 
115 241.0818979361 CC(C=O)=CN(C(N)O)C1C=C(O)C(=C=[OH+])O1 Intermediate Fragment 
116 241.0818979361 CC(=CN=C1C=C(O)C(=C=[OH+])O1)C(O)NCO Intermediate Fragment 
117 243.0975480001 CC1CN(C2C=C(O)C(=C=[OH+])O2)C(O)NC1O
118 243.0975480001 CC1CN(C(O)=C=C(O)C#C[OH2+])C(O)NC1O Intermediate Fragment 
119 169.0607685681 C=C([OH2+])N1C=C(C)C(=O)N=C1O
120 245.1131980641 CC1CN(C2C=C(O)C(=C[OH2+])O2)C(O)NC1O
121 247.1288481281 CC1CN(C2C=C(O)C(C[OH2+])O2)C(O)NC1O
122 249.1444981921 CC1CN(C2CC(O)C(C[OH2+])O2)C(O)NC1O
123 551.1296359761 CC1=C(C2CC3=C(OC4=C3C3=C(C(CO)=C4)C4CCC(O)C4C(=O)O3)O2)N(C2C=C(O)C(=C=[OH+])O2)C(O)=NC1=O
124 551.1296359761 CC1=C(C2OC3=C(C2=O)C2=C(C=C(CO)C4=C2OCC2C(O)CCC42)O3)N(C2C=C(O)C(=C=[OH+])O2)C(O)=NC1=O
125 551.1296359761 CC1=C(C2OC3=C(C2=O)C2=C(C=C(CO)C4=C2OC(O)C2CCCC42)O3)N(C2C=C(O)C(=C=[OH+])O2)C(O)=NC1=O
126 537.1139859121 CC1=C(C2OC3=C(C2=O)C2=C(C=CC4=C2OC(O)C2C(O)CCC42)O3)N(C2C=C(O)C(=C=[OH+])O2)C(O)=NC1=O
127 539.1296359761 CC1=C(C2OC3=C(C2=O)C2=C(C=CC4C2OC(O)C2C(O)CCC42)O3)N(C2C=C(O)C(=C=[OH+])O2)C(O)=NC1=O
128 541.1452860401 CC1=C(C2OC3=C(C2=O)C2=C(CCC4C2OC(O)C2C(O)CCC42)O3)N(C2C=C(O)C(=C=[OH+])O2)C(O)=NC1=O
129 541.1452860401 CC1=C(C2OC3=C(C2=O)C2=C(CCC4C2OC(O)C2C(O)CCC42)O3)N(C(O)=C=C(O)C#C[OH2+])C(O)=NC1=O Intermediate Fragment 
130 551.1296359761 CC1=CC2=C(C3=C1C1CCC(O)C1C(O)O3)C1=C(O2)OC(C2=C(C)C(=O)N=C(O)N2C2C=C(O)C(=C=[OH+])O2)C1=O
131 569.1402006601 C=C(OC(=C=[OH+])CO)N1C(O)=NC(=O)C(C)=C1C1OC2=C(C1=O)C1=C(C=C(CO)C3=C1OC(O)C1C(O)CCC31)O2 Intermediate Fragment 
132 477.0928565441 C#CN1C(O)=NC(=[OH+])C(C)=C1C1OC2=C(C1=O)C1=C(C=C(CO)C3=C1OC(=O)C1=C3CCC1O)O2
133 477.0928565441 C#CN1C(O)=NC(=[OH+])C(C)=C1CC(O)=C1C(=O)OC2=C1C1=C(C(CO)=C2)C2=C(C(=O)O1)C(O)C=C2 Intermediate Fragment 
134 479.1085066081 C#CN1C(O)=NC(=[OH+])C(C)=C1C1OC2=C(C1=O)C1=C(C=C(CO)C3=C1OC(=O)C1C(O)CCC31)O2
135 479.1085066081 C#CN1C(O)=NC(=[OH+])C(C)=C1CC(O)=C1C(=O)OC2=C1C1=C(C(CO)=C2)C2=C(C(=O)O1)C(O)CC2 Intermediate Fragment 
136 479.1085066081 C#CN1C(O)=NC(=[OH+])C(C)=C1C(C=O)OC1=CC2=C(C=C(CO)C3=C2OC(=O)C2=C3CCC2O)O1 Intermediate Fragment 
137 483.1398067361 C#CN1C(O)=NC(=[OH+])C(C)=C1C1OC2=C(C1=O)C1=C(C=C(CO)C3C1OC(O)C1C(O)CCC31)O2
138 485.1554568001 C#CN1C(O)=NC(=[OH+])C(C)=C1C1OC2=C(C1=O)C1=C(CC(CO)C3C1OC(O)C1C(O)CCC13)O2
139 75.0440558841 OCC=C[OH2+]
140 495.1034212281 C=C([OH2+])N1C(O)=NC(=O)C(C)=C1C1OC2=C(C1=O)C1=C(C=C(CO)C3=C1OC(=O)C1=C3CCC1O)O2
141 495.1034212281 C=C([OH2+])N(C(=N)O)C(=C(C)C=O)C1OC2=C(C1=O)C1=C(C=C(CO)C3=C1OC(=O)C1=C3C=CC1O)O2 Intermediate Fragment 
142 495.1034212281 C=C([OH2+])N1C(O)=NC(=O)C(C)=C1C(C=O)OC1=CC2=C(C=C(CO)C3=C2OC(=O)C2=C3C=CC2O)O1 Intermediate Fragment 
143 497.1190712921 C=C([OH2+])N1C(O)=NC(=O)C(C)=C1C1OC2=C(C1=O)C1=C(C=C(CO)C3=C1OC(=O)C1C(O)CCC31)O2
144 499.1347213561 C=C([OH2+])N1C(O)=NC(=O)C(C)=C1C1OC2=C(C1=O)C1=C(C=C(CO)C3=C1OC(O)C1C(O)CCC31)O2
145 501.1503714201 C=C([OH2+])N1C(O)=NC(=O)C(C)=C1C1OC2=C(C1=O)C1=C(C=C(CO)C3C1OC(O)C1C(O)CCC31)O2
146 541.1452860401 C=C([OH+]C#CO)N1C(O)=NC(=O)C(C)=C1C1OC2=C(C1=O)C1=C(C=C(CO)C3C1OC(O)C1C(O)CCC31)O2
147 569.1402006601 C=C(O)C(=C=[OH+])OCN1C(O)=NC(=O)C(C)=C1C1OC2=C(C1=O)C1=C(C=C(CO)C3=C1OC(O)C1C(O)CCC31)O2 Intermediate Fragment 
148 483.1034212281 CC1=C(C2OC3=C(C2=O)C2=C(C=C(CO)C4=C2OC(=O)C2C(O)CCC42)O3)N(C=[OH+])C(O)=NC1=O
149 481.0877711641 CC1=C(C2OC3=C(C2=O)C2=C(C=C(CO)C4=C2OC(=O)C2=C4CCC2O)O3)N(C=[OH+])C(O)=NC1=O
150 569.1402006601 CC1=C(C2OC3=C(C2=O)C2=C(C=C(CO)C4C2OC(O)C2C(O)CCC42)O3)N(C=C=C(O)C(=O)C=[OH+])C(O)=NC1=O Intermediate Fragment 
151 87.0076703761 O=CC(=[OH+])C=O
152 93.0546205681 OCC([OH2+])CO
153 471.1398067361 CC1=C(C2OC3=C(C2=O)C2=C(C=C(CO)C4=C2OC(O)C2C(O)CCC42)O3)N(C)C(O)=NC1=[OH+]
154 469.1241566721 CC1=C(C2OC3=C(C2=O)C2=C(C=C(CO)C4=C2OC(=O)C2C(O)CCC42)O3)N(C)C(O)=NC1=[OH+]
155 467.1085066081 CC1=C(C2OC3=C(C2=O)C2=C(C=C(CO)C4=C2OC(=O)C2=C4CCC2O)O3)N(C)C(O)=NC1=[OH+]
156 465.0928565441 CC1=C(C2OC3=C(C2=O)C2=C(C=C(CO)C4=C2OC(=O)C2=C4C=CC2O)O3)N(C)C(O)=NC1=[OH+]
157 139.0502038841 [CH2+]N1C=C(C)C(=O)N=C1O
158 465.0928565441 C=NC(=C(C)C(=[OH+])N=C=O)C1OC2=C(C1=O)C1=C(C=C(CO)C3=C1OC(=O)C1=C3CCC1O)O2 Intermediate Fragment 
159 394.0921282721 C=C=C([NH+]=C)C1OC2=C(C1=O)C1=C(C=C(CO)C3=C1OC(=O)C1=C3CCC1O)O2
160 465.0928565441 CC(C=[OH+])=C(C1OC2=C(C1=O)C1=C(C=C(CO)C3=C1OC(=O)C1=C3C=CC1=O)O2)N(C)C(=N)O Intermediate Fragment 
161 437.0979419241 C=C=C(C1OC2=C(C1=O)C1=C(C=C(CO)C3=C1OC(=O)C1=C3C=CC1O)O2)[NH+](C)C(=N)O
162 465.0928565441 C=C=C([OH2+])N=C(O)N(C)C=C1OC2=C(C1=O)C1=C(C=C(CO)C3=C1OC(=O)C1=C3C=CC1O)O2 Intermediate Fragment 
163 465.0928565441 CC1=C(CC(O)=C2C(=O)OC3=C2C2=C(C(CO)=C3)C3=C(C(=O)C=C3)C(=O)O2)N(C)C(O)=NC1=[OH+] Intermediate Fragment 
164 447.0822918601 CC1=C(CC(=O)C2=COC3=C2C2=C(C(C=O)=C3)C3=C(C(=O)C=C3)C(=O)O2)N(C)C(O)=NC1=[OH+]
165 181.0607685681 C=C1C(=[OH+])N=C(O)N(C)C1=CC=O
166 179.0451185041 C=C1C(=[OH+])N=C(O)N(C)C1=C=C=O
167 151.0502038841 C=C1C(=C)N([CH2+])C(O)=NC1=O
168 465.0928565441 CC1=C(C(C=O)OC2=CC3=C(C=C(CO)C4=C3OC(=O)C3=C4C=CC3=O)O2)N(C)C(O)=NC1=[OH+] Intermediate Fragment 
169 465.0928565441 CC1=C(C(=O)C(=O)C2=COC3=C2C2=C(C(CO)=C3)C3=C(C(=O)O2)C(O)C=C3)N(C)C(O)=NC1=[OH+] Intermediate Fragment 
170 465.0928565441 CC1=C(C2OC=C(C3=C(O)C=C(CO)C4=C3OC(=O)C3=C4C=CC3=O)C2=O)N(C)C(O)=NC1=[OH+] Intermediate Fragment 
171 465.0928565441 CC1=C(C2OC3=C(C2=O)C2=C(C=C(CO)C4=C2OC(=O)C=C4C=C=CO)O3)N(C)C(O)=NC1=[OH+] Intermediate Fragment 
172 465.0928565441 C=CC1=C(C=O)C(=O)OC2=C1C(CO)=CC1=C2C2=C(O1)OC(C1=C(C)C(=[OH+])N=C(O)N1C)C2=O Intermediate Fragment 
173 437.0979419241 C=CC1=CC(=O)OC2=C1C(CO)=CC1=C2C2=C(O1)OC(C1=C(C)C(=[OH+])N=C(O)N1C)C2=O
174 465.0928565441 C=C(O)C1=C(C)C2=C(OC1=O)C1=C(C=C2C=O)OC2=C1C(=O)C(C1=C(C)C(=[OH+])N=C(O)N1C)O2 Intermediate Fragment 
175 463.0772064801 CC1=C(C2OC3=C(C2=O)C2=C(C=C(CO)C4=C2OC(=O)C2=C4C=CC2=O)O3)N(C)C(O)=NC1=[OH+]
176 551.1296359761 CC1=C(C2OC3=C(C2=O)C2=C(C=C(CO)C4=C2OC(O)C2C(O)CCC42)O3)N(C=C=C(O)C#C[OH2+])C(O)=NC1=O
177 511.1347213561 CC1=C(C2OC3=C(C2=O)C2=C(C=C(CO)C4=C2OC(O)C2C(O)CCC42)O3)N(CC#CO)C(O)=NC1=[OH+]
178 493.1241566721 C#CCN1C(O)=NC(=[OH+])C(C)=C1C1OC2=C(C1=O)C1=C(C=C(CO)C3=C1OC(=O)C1C(O)CCC31)O2
179 509.1190712921 CC1=C(C2OC3=C(C2=O)C2=C(C=C(CO)C4=C2OC(=O)C2C(O)CCC42)O3)N(CC#CO)C(O)=NC1=[OH+]
180 507.1034212281 CC1=C(C2OC3=C(C2=O)C2=C(C=C(CO)C4=C2OC(=O)C2=C4CCC2O)O3)N(CC#CO)C(O)=NC1=[OH+]
181 569.1402006601 CC1=C(C2OC3=C(C2=O)C2=C(C=C(CO)C4C2OC(O)C2C(O)CCC42)O3)N(C(O)=C=C(O)C#C[OH2+])C(O)=NC1=O Intermediate Fragment 
182 73.0284058201 OCC#C[OH2+]
183 77.0597059481 OCCC[OH2+]
184 485.1190712921 CC1=C(C2OC3=C(C2=O)C2=C(C=C(CO)C4=C2OC(O)C2C(O)CCC42)O3)N(C=[OH+])C(O)=NC1=O
185 153.0294684401 CC1=CN(C#[O+])C(O)=NC1=O
186 481.0877711641 CC(C(=O)N=C=O)=C(N=C=[OH+])C1OC2=C(C1=O)C1=C(C=C(CO)C3=C1OC(=O)C1C(O)CCC31)O2 Intermediate Fragment 
187 410.0870428921 C=C=C([NH+]=C=O)C1OC2=C(C1=O)C1=C(C=C(CO)C3=C1OC(=O)C1C(O)CCC31)O2
188 481.0877711641 CC(C=O)=C(C1OC2=C(C1=O)C1=C(C=C(CO)C3=C1OC(=O)C1=C3C=CC1O)O2)N(C=[OH+])C(=N)O Intermediate Fragment 
189 481.0877711641 C=C=C(C1OC2=C(C1=O)C1=C(C=C(CO)C3=C1OC(=O)C1C(O)CCC31)O2)N(C=[OH+])C(=O)N=C=O Intermediate Fragment 
190 481.0877711641 CC(=C=C1OC2=C(C1=O)C1=C(C=C(CO)C3=C1OC(=O)C1C(O)CCC31)O2)C(=O)N=C(O)N=C=[OH+] Intermediate Fragment 
191 481.0877711641 CC1=C(CC(O)=C2C(=O)OC3=C2C2=C(C(CO)=C3)C3=C(C(=O)O2)C(O)C=C3)N(C=[OH+])C(O)=NC1=O Intermediate Fragment 
192 481.0877711641 CC1=C(C(C=O)OC2=CC3=C(C=C(CO)C4=C3OC(=O)C3=C4C=CC3O)O2)N(C=[OH+])C(O)=NC1=O Intermediate Fragment 
193 195.0400331241 CC1=C(C=C=O)N(C=[OH+])C(O)=NC1=O
194 197.0556831881 CC1=C(CC=O)N(C=[OH+])C(O)=NC1=O
195 481.0877711641 CC1=C(C(=O)C(=O)C2=COC3=C2C2=C(C(CO)=C3)C3=C(C(=O)O2)C(O)CC3)N(C=[OH+])C(O)=NC1=O Intermediate Fragment 
196 481.0877711641 CC1=C(C2OC=C(C3=C(O)C=C(CO)C4=C3OC(=O)C3=C4C=CC3O)C2=O)N(C=[OH+])C(O)=NC1=O Intermediate Fragment 
197 481.0877711641 CC1=C(C2OC3=C(C2=O)C2=C(C=C(CO)C(C4=CCC(O)C4=C=O)=C2O)O3)N(C=[OH+])C(O)=NC1=O Intermediate Fragment 
198 453.0928565441 CC1=C(C2OC3=C(C2=O)C2=C(C=C(CO)C(C4=CC(O)C=C4)=C2O)O3)N(C=[OH+])C(O)=NC1=O
199 481.0877711641 CC1=C(C2OC3=C(C2=O)C2=C(C=C(CO)C(C4=C(C(=O)O)C(O)C=C4)=C2)O3)N(C=[OH+])C(O)=NC1=O Intermediate Fragment 
200 481.0877711641 CC1=C(C2OC3=C(C2=O)C2=C(C=C(CO)C4=C2OC(=O)C=C4C=CCO)O3)N(C=[OH+])C(O)=NC1=O Intermediate Fragment 
201 481.0877711641 C=CC1=C(CO)C(=O)OC2=C1C(CO)=CC1=C2C2=C(O1)OC(C1=C(C)C(=O)N=C(O)N1C=[OH+])C2=O Intermediate Fragment 
202 481.0877711641 C=C(O)C1=C(C)C2=C(OC1=O)C1=C(C=C2CO)OC2=C1C(=O)C(C1=C(C)C(=O)N=C(O)N1C=[OH+])O2 Intermediate Fragment 
203 479.0721211001 C=C(O)C1=C(C)C2=C(OC1=O)C1=C(C=C2C=O)OC2=C1C(=O)C(C1=C(C)C(=O)N=C(O)N1C=[OH+])O2
204 461.0615564161 CC1=C(C2OC3=C(C2=O)C2=C(C=C(C=O)C4=C2OC(=O)C2=C4C=CC2=O)O3)N(C)C(O)=NC1=[OH+]
205 479.0721211001 CC1=C(CC(O)=C2C(=O)OC3=C2C2=C(C(CO)=C3)C3=C(C(=O)C=C3)C(=O)O2)N(C=[OH+])C(O)=NC1=O Intermediate Fragment 
206 87.0440558841 C=C(O)C=C[OH2+]
207 69.0334912001 C#CC=C[OH2+]
208 71.0491412641 C=CC(=C)[OH2+]
209 71.0491412641 C#CCC[OH2+]
210 91.0753560121 CC(O)CC[OH2+]
211 73.0647913281 C=C([OH2+])CC
212 527.1296359761 CC1=C(C2OC3=C(C2=O)C2=C(C=C(CO)C4C2OC(O)C2C(O)CCC42)O3)N(C(=[OH+])C#CO)C(O)=NC1=O
213 525.1139859121 CC1=C(C(C=O)OC2=CC3=C(C=C(CO)C4=C3OC(=O)C3C(O)CCC43)O2)N(C(=[OH+])C#CO)C(O)=NC1=O Intermediate Fragment 
214 523.0983358481 CC1=C(C2OC3=C(C2=O)C2=C(C=C(CO)C4=C2OC(=O)C2C(O)CCC42)O3)N(C(=[OH+])C#CO)C(O)=NC1=O
215 47.0491412641 CC[OH2+]
216 569.1402006601 CC1=C(C2OC3=C(C2=O)C2=C(C=C(CO)C4C2OC(O)C2C(O)CCC42)O3)N(C(=C=CO)OC#C[OH2+])C(O)=NC1=O Intermediate Fragment 
217 569.1402006601 C=C=C(C1OC2=C(C1=O)C1=C(CC(CO)C3C1OC(O)C1C(O)CCC13)O2)N(C(=O)N=C=O)C1C=C(O)C(=C=[OH+])O1 Intermediate Fragment 
218 498.1394723881 C=C=C([NH+]=C1C=C(O)C(=C=O)O1)C1OC2=C(C1=O)C1=C(CC(CO)C3C1OC(O)C1C(O)CCC13)O2
219 498.1394723881 C#CC(=[NH+]C(O)=C=C(O)C#CO)C1OC2=C(C1=O)C1=C(CC(CO)C3C1OC(O)C1C(O)CCC13)O2 Intermediate Fragment 
220 569.1402006601 CC(C=O)=C(C1OC2=C(C1=O)C1=C(C=C(CO)C3=C1OC(O)C1C(O)CCC31)O2)N(C(=N)O)C1C=C(O)C(=C=[OH+])O1 Intermediate Fragment 
221 395.0761438601 CC(=C=C1OC2=C(C1=O)C1=C(C=C(CO)C3=C1OC(=O)C1=C3CCC1O)O2)C=[OH+]
222 175.0713332521 NC(O)[NH2+]C1C=C(O)C(=CO)O1
223 539.1296359761 C=C=C(C1OC2=C(C1=O)C1=C(C=C(CO)C3=C1OC(O)C1C(O)CCC31)O2)[NH+](C(=N)O)C1C=C(O)C(=C=O)O1
224 541.1452860401 C=C=C(C1OC2=C(C1=O)C1=C(C=C(CO)C3C1OC(O)C1C(O)CCC31)O2)[NH+](C(=N)O)C1C=C(O)C(=C=O)O1
225 541.1452860401 C=C=C(C1OC2=C(C1=O)C1=C(C=C(CO)C3C1OC(O)C1C(O)CCC31)O2)[NH+](C(=N)O)C(O)=C=C(O)C#CO Intermediate Fragment 
226 541.1452860401 C=C=C(CC(O)=C1C(=O)OC2=C1C1=C(C(CO)=C2)C2CCC(O)C2C(O)O1)[NH+](C(=N)O)C1C=C(O)C(=C=O)O1 Intermediate Fragment 
227 552.1136515641 CC(C=O)=C(C1OC2=C(C1=O)C1=C(C=C(CO)C3=C1OC(=O)C1C(O)CCC31)O2)[NH+](C=O)C1C=C(O)C(=C=O)O1
228 526.1343870081 CC(C=O)=C([NH+]=C1C=C(O)C(=C=O)O1)C1OC2=C(C1=O)C1=C(C=C(CO)C3C1OC(O)C1C(O)CCC31)O2
229 526.1343870081 CC(=C=O)C(=[NH+]C(O)=C=C(O)C#CO)C1OC2=C(C1=O)C1=C(C=C(CO)C3C1OC(O)C1C(O)CCC31)O2 Intermediate Fragment 
230 524.1187369441 CC(C=O)=C([NH+]=C1C=C(O)C(=C=O)O1)C1OC2=C(C1=O)C1=C(C=C(CO)C3=C1OC(O)C1C(O)CCC31)O2
231 496.1238223241 C=C=C([NH+]=C1C=C(O)C(=C=O)O1)C1OC2=C(C1=O)C1=C(C=C(CO)C3C1OC(O)C1C(O)CCC31)O2
232 522.1030868801 CC(C=O)=C([NH+]=C1C=C(O)C(=C=O)O1)C1OC2=C(C1=O)C1=C(C=C(CO)C3=C1OC(=O)C1C(O)CCC31)O2
233 569.1402006601 CC(C(N)=O)=C(C1OC2=C(C1=O)C1=C(C=C(CO)C3=C1OC(O)C1C(O)CCC31)O2)N(C=O)C1C=C(O)C(=C=[OH+])O1 Intermediate Fragment 
234 524.1187369441 C=C=C(C1OC2=C(C1=O)C1=C(C=C(CO)C3=C1OC(O)C1C(O)CCC31)O2)[NH+](C=O)C1C=C(O)C(=C=O)O1
235 569.1402006601 CC(C(=O)N=C=O)=C(N=C1C=C(O)C(=C=[OH+])O1)C1OC2=C(C1=O)C1=C(CC(CO)C3C1OC(O)C1C(O)CCC13)O2 Intermediate Fragment 
236 494.1081722601 C=C=C([NH+]=C1C=C(O)C(=C=O)O1)C1OC2=C(C1=O)C1=C(C=C(CO)C3=C1OC(O)C1C(O)CCC31)O2
237 569.1402006601 CC(=C=C1OC2=C(C1=O)C1=C(CC(CO)C3C1OC(O)C1C(O)CCC13)O2)C(=O)N=C(O)N=C1C=C(O)C(=C=[OH+])O1 Intermediate Fragment 
238 438.0819575121 CC(=C=C1OC2=C(C1=O)C1=C(C=C(CO)C3=C1OC(=O)C1C(O)CCC31)O2)C(=O)[NH+]=C=O
239 569.1402006601 C=C=C(O)N=C(O)N(C=C1OC2=C(C1=O)C1=C(C=C(CO)C3C1OC(O)C1C(O)CCC31)O2)C1C=C(O)C(=C=[OH+])O1 Intermediate Fragment 
240 515.1296359761 N=C(O)[NH+](C=C1OC2=C(C1=O)C1=C(C=C(CO)C3C1OC(O)C1C(O)CCC31)O2)C1C=C(O)C(=C=O)O1
241 399.0822918601 N=C(O)[NH+]=C=C1OC2=C(C1=O)C1=C(C=C(CO)C3=C1OC(=O)C1C(O)CCC31)O2
242 397.0666417961 N=C(O)[NH+]=C=C1OC2=C(C1=O)C1=C(C=C(CO)C3=C1OC(=O)C1=C3CCC1O)O2
243 498.1030868801 O=C=C1OC([NH+](C=O)C=C2OC3=C(C2=O)C2=C(C=C(CO)C4=C2OC(O)C2C(O)CCC42)O3)C=C1O
244 472.1238223241 O=C=C1OC(=[NH+]C=C2OC3=C(C2=O)C2=C(CC(CO)C4C2OC(O)C2C(O)CCC24)O3)C=C1O
245 513.1139859121 N=C(O)[NH+](C=C1OC2=C(C1=O)C1=C(C=C(CO)C3=C1OC(O)C1C(O)CCC31)O2)C1C=C(O)C(=C=O)O1
246 500.1187369441 O=C=C1OC([NH+](C=O)C=C2OC3=C(C2=O)C2=C(C=C(CO)C4C2OC(O)C2C(O)CCC42)O3)C=C1O
247 382.0557427641 O=C[NH+]=C=C1OC2=C(C1=O)C1=C(C=C(CO)C3=C1OC(=O)C1=C3CCC1O)O2
248 496.0874368161 O=C=C1OC([NH+](C=O)C=C2OC3=C(C2=O)C2=C(C=C(CO)C4=C2OC(=O)C2C(O)CCC42)O3)C=C1O
249 494.0717867521 O=C=C1OC([NH+](C=O)C=C2OC3=C(C2=O)C2=C(C=C(CO)C4=C2OC(=O)C2=C4CCC2O)O3)C=C1O
250 454.1132576401 C=C1OC(=[NH+]C=C2OC3=C(C2=O)C2=C(C=C(CO)C4=C2OC(O)C2C(O)CCC42)O3)C=C1O
251 472.1238223241 O=C1C(=C=[NH+]C(O)=C=C(O)C#CO)OC2=C1C1=C(CC(CO)C3C1OC(O)C1C(O)CCC13)O2 Intermediate Fragment 
252 569.1402006601 CC1=C(CC(O)=C2C(=O)OC3=C2C2=C(C(CO)=C3)C3CCC(O)C3C(O)O2)N(C2C=C(O)C(=C=[OH+])O2)C(O)=NC1=O Intermediate Fragment 
253 551.1296359761 CC1=C(CC(=O)C2=COC3=C2C2=C(C(CO)=C3)C3CCC(O)C3C(=O)O2)N(C2C=C(O)C(=C=[OH+])O2)C(O)=NC1=O
254 437.0979419241 CC1=C([OH2+])N=C(O)N=C1CC(=O)C1=COC2=C1C1=C(C(CO)=C2)C2=C(C(=O)O1)C(O)C=C2
255 255.0975480001 CC1=C(C)N(C2C=C(O)C(=C=[OH+])O2)C(O)NC1O
256 551.1296359761 CC1=C(CC(=O)C2=COC3=C2C2=C(C(CO)=C3)C3CCC(O)C3C(=O)O2)N(C=C=C(O)C(=O)C=[OH+])C(O)=NC1=O Intermediate Fragment 
257 287.1237627481 CC1C(O)NC(O)N(C2C=C(O)C(=C=[OH+])O2)C1CCO
258 285.1081126841 CC1=C(CCO)N(C2C=C(O)C(=C=[OH+])O2)C(O)NC1O
259 285.1081126841 CC1=C(CCO)N(C(O)=C=C(O)C#C[OH2+])C(O)NC1O Intermediate Fragment 
260 283.0924626201 CC1=C(CCO)N(C2C=C(O)C(=C=[OH+])O2)C(O)NC1=O
261 281.0768125561 CC1=C(CCO)N(C2C=C(O)C(=C=[OH+])O2)C(O)=NC1=O
262 285.0393644281 O=C1C=CC2=C1C(=O)OC1C3=CC(=[OH+])OC3=CC(CO)=C21
263 287.0550144921 O=C1OC2C3=CC(=[OH+])OC3=CC(CO)=C2C2=C1C(O)C=C2
264 257.1131980641 CC1C(O)NC(O)N(C2C=C(O)C(=C=[OH+])O2)C1C
265 257.1131980641 CC1C(O)NC(O)N(C(O)=C=C(O)C#C[OH2+])C1C Intermediate Fragment 
266 139.0502038841 C=C1C(=[OH+])N=C(O)N=C1C
267 255.0975480001 CC1=C(C)N(C=C=C(O)C(=O)C=[OH+])C(O)NC1O Intermediate Fragment 
268 255.0975480001 CC1=C(C)N(C(O)=C=C(O)C#C[OH2+])C(O)NC1O Intermediate Fragment 
269 169.0607685681 C=C1C(=O)N=C(O)N(C=[OH+])C1C
270 167.0451185041 C=C1C(=C)N(C=[OH+])C(O)=NC1=O
271 251.0662478721 CC1=C(C)N(C2C=C(O)C(=C=[OH+])O2)C(O)=NC1=O
272 249.0505978081 [CH2+]C1=C(C)N(C2C=C(O)C(=C=O)O2)C(O)=NC1=O
273 313.0342790481 O=C=C1C(=[OH+])OC2=C1C1=C(C(CO)=C2)C2=C(C(=O)O1)C(O)C=C2
274 569.1402006601 CC1=C(COC2=C(C=O)C3=C(C=C(CO)C4=C3OC(O)C3C(O)CCC43)O2)N(C2C=C(O)C(=C=[OH+])O2)C(O)=NC1=O Intermediate Fragment 
275 569.1402006601 CC1=C(C(C=O)OC2=CC3=C(C=C(CO)C4=C3OC(O)C3C(O)CCC43)O2)N(C2C=C(O)C(=C=[OH+])O2)C(O)=NC1=O Intermediate Fragment 
276 283.0237143641 O=CC1=C2C3=C(C(=O)C=C3)C(=O)OC2C2=CC(=[OH+])OC2=C1
277 281.0080643001 O=C1C=C2C(=CC(C#[O+])=C3C4=C(C(=O)C=C4)C(=O)OC23)O1
278 271.0600998721 OCC1=CC2=C(C=CO2)C2=C1C1=C(C(=[OH+])O2)C(O)C=C1
279 265.0131496801 O=C1C=CC2=C1C(=O)OC1=C2C(C#[O+])=CC2=C1C=CO2
280 295.0560771121 CC1=C(C(=O)CO)N(C2C=C(O)C(=C=[OH+])O2)C(O)=NC1=O
281 297.0717271761 CC1=C(C(O)CO)N(C2C=C(O)C(=C=[OH+])O2)C(O)=NC1=O
282 299.0873772401 CC1=C(C(O)CO)N(C2C=C(O)C(=C=[OH+])O2)C(O)NC1=O
283 301.1030273041 CC1=C(C(O)CO)N(C2C=C(O)C(=C=[OH+])O2)C(O)NC1O
284 185.0556831881 CC1=C([OH2+])N=C(O)N=C1C(=O)CO
285 301.1030273041 CC1=C(C(O)CO)N(C(O)=C=C(O)C#C[OH2+])C(O)NC1O Intermediate Fragment 
286 215.0662478721 CC1=C(C(O)CO)N(C=[OH+])C(O)=NC1=O
287 213.0505978081 CC1=C(C(=O)CO)N(C=[OH+])C(O)=NC1=O
288 303.1186773681 CC1C(O)NC(O)N(C2C=C(O)C(=C=[OH+])O2)C1C(O)CO
289 303.1186773681 CC1C(O)NC(O)N(C(O)=C=C(O)C#C[OH2+])C1C(O)CO Intermediate Fragment 
290 541.1452860401 CC1=C(COC2=CC3=C(C=C(CO)C4=C3OC(O)C3C(O)CCC43)O2)N(C2C=C(O)C(=C=[OH+])O2)C(O)=NC1=O
291 569.1402006601 CC1=C(C(=O)C(=O)C2=COC3=C2C2OC(O)C4C(O)CCC4C2C(CO)=C3)N(C2C=C(O)C(=C=[OH+])O2)C(O)=NC1=O Intermediate Fragment 
292 301.0706645561 O=C1OC2=C(C(CO)=CC3=C2C(C=[OH+])=CO3)C2=C1C(O)CC2
293 569.1402006601 CC1=C(C2OC(O)=C(C3=CC=C(CO)C4=C3OC(O)C3C(O)CCC43)C2=O)N(C2C=C(O)C(=C=[OH+])O2)C(O)=NC1=O Intermediate Fragment 
294 569.1402006601 CC1=C(C2OC(OC3=CC4=C(C(CO)=C3)C3CCC(O)C3C(O)O4)=CC2=O)N(C2C=C(O)C(=C=[OH+])O2)C(O)=NC1=O Intermediate Fragment 
295 569.1402006601 CC1=C(C2OC=C(C3=C(O)C=C(CO)C4=C3OC(O)C3C(O)CCC43)C2=O)N(C2C=C(O)C(=C=[OH+])O2)C(O)=NC1=O Intermediate Fragment 
296 245.0444498081 O=C1C=CC2=C1C(=O)OC1=C2C(CO)=CC([OH2+])=C1
297 243.0287997441 O=CC1=CC([OH2+])=CC2=C1C1=C(C(=O)C=C1)C(=O)O2
298 243.0287997441 C=CC1=C(C#[O+])C(=O)OC2=C1C(C=O)=CC(O)=C2 Intermediate Fragment 
299 323.0873772401 CC1=C(C2OCCC2O)N(C2C=C(O)C(=C=[OH+])O2)C(O)=NC1=O
300 325.1030273041 CC1=C(C2OCCC2O)N(C2C=C(O)C(=C=[OH+])O2)C(O)NC1=O
301 327.1186773681 CC1=C(C2OCCC2O)N(C2C=C(O)C(=C=[OH+])O2)C(O)NC1O
302 329.1343274321 CC1C(O)NC(O)N(C2C=C(O)C(=C=[OH+])O2)C1C1OCCC1O
303 551.1296359761 CC1=C(C2OC=C(C3=CC=C(CO)C4=C3OC(=O)C3C(O)CCC43)C2=O)N(C2C=C(O)C(=C=[OH+])O2)C(O)=NC1=O
304 569.1402006601 CC1=C(C2OC(=O)C3C(O)CCC3C2=CCO)C2=C(O1)OC(C1=C(C)C(=O)N=C(O)N1C1C=C(O)C(=C=[OH+])O1)C2=O Intermediate Fragment 
305 527.1296359761 CC1=C(C2=CC3CCC(O)C3C(O)O2)C2=C(O1)OC(C1=C(C)C(=O)N=C(O)N1C1C=C(O)C(=C=[OH+])O1)C2=O
306 525.1139859121 CC1=C(C2=CC3CCC(O)C3C(=O)O2)C2=C(O1)OC(C1=C(C)C(=O)N=C(O)N1C1C=C(O)C(=C=[OH+])O1)C2=O
307 523.0983358481 CC1=C(C2=CC3=C(C(=O)O2)C(O)CC3)C2=C(O1)OC(C1=C(C)C(=O)N=C(O)N1C1C=C(O)C(=C=[OH+])O1)C2=O
308 189.0182350601 O=C=CC1=COC(=[OH+])C2=C1C=CC2=O
309 191.0338851241 O=C1C=CC2=C1C(=[OH+])OC=C2C=CO
310 193.0495351881 O=C1C=CC2=C1C(=[OH+])OC=C2CCO
311 151.0389705041 OC1C=CC2=C1C(=[OH+])OC=C2
312 149.0233204401 O=C1C=CC2=C1C(=[OH+])OC=C2
313 175.0389705041 C=C=C1COC(=[OH+])C2=C1C=CC2=O
314 195.0651852521 OCCC1=COC(=[OH+])C2=C1C=CC2O
315 569.1402006601 CC1=C(C2OC3=C(C2=O)C(C2=CC4CCC(O)C4C(O)O2)=C(C=CCO)O3)N(C2C=C(O)C(=C=[OH+])O2)C(O)=NC1=O Intermediate Fragment 
316 569.1402006601 CC1=C(C2OC3=C(C=C(C=C(CO)C4=COC(O)C5C(O)CCC45)O3)C2=O)N(C2C=C(O)C(=C=[OH+])O2)C(O)=NC1=O Intermediate Fragment 
317 569.1402006601 C=C(CO)C1=C(C2=COC3=C2C(=O)C(C2=C(C)C(=O)N=C(O)N2C2C=C(O)C(=C=[OH+])O2)O3)OC(O)C2C(O)CCC12 Intermediate Fragment 
318 569.1402006601 CC1=C(C2OC3=C(C2=O)C2=C(C=C(CO)C(C4CCC(O)C4CO)=C2O)O3)N(C2C=C(O)C(=C=[OH+])O2)C(O)=NC1=O Intermediate Fragment 
319 541.1452860401 CC1=C(C2OC3=C(C2=O)C2=C(C=C(CO)C(C4CCC(O)C4)C2O)O3)N(C2C=C(O)C(=C=[OH+])O2)C(O)=NC1=O
320 523.1347213561 CC1=C(C2OC3=C(C2=O)C2=C(C=C(CO)C(C4CCC(O)C4)=C2)O3)N(C2C=C(O)C(=C=[OH+])O2)C(O)=NC1=O
321 541.1452860401 CC1=C(C2OC3=C(C2=O)C2=C(C=C(CO)C(C4CCC(O)C4)C2O)O3)N(C(O)=C=C(O)C#C[OH2+])C(O)=NC1=O Intermediate Fragment 
322 539.1296359761 CC1=C(C2OC3=C(C2=O)C2=C(C=C(CO)C(C4CCC(O)C4)=C2O)O3)N(C2C=C(O)C(=C=[OH+])O2)C(O)=NC1=O
323 569.1402006601 CC1=C(C2OC3=C(C2=O)C2=C(C=C(CO)C(C4CCC(O)C4)=C2OCO)O3)N(C2C=C(O)C(=C=[OH+])O2)C(O)=NC1=O Intermediate Fragment 
324 525.1503714201 CC1=C(C2OC3=C(C2=O)C2=C(C=C(CO)C(C4CCC(O)C4)C2)O3)N(C2C=C(O)C(=C=[OH+])O2)C(O)=NC1=O
325 569.1402006601 CC1=C(C2OC3=C(C2=O)C2=C(C=C(CO)C=C2OC(O)C2CCCC2O)O3)N(C2C=C(O)C(=C=[OH+])O2)C(O)=NC1=O Intermediate Fragment 
326 569.1402006601 CC1=C(C2OC3=C(C2=O)C2=C(C=C(CO)C(C4CCC(O)C4C(O)O)=C2)O3)N(C2C=C(O)C(=C=[OH+])O2)C(O)=NC1=O Intermediate Fragment 
327 521.1190712921 CC1=C(C2OC3=C(C2=O)C2=C(C=C(CO)C(C4=CC(O)CC4)=C2)O3)N(C2C=C(O)C(=C=[OH+])O2)C(O)=NC1=O
328 569.1402006601 CCC(O)C1CC2=C(OC1O)C1=C(C=C2CO)OC2=C1C(=O)C(C1=C(C)C(=O)N=C(O)N1C1C=C(O)C(=C=[OH+])O1)O2 Intermediate Fragment 
329 509.0826857841 CC1=C(C2OC3=C(C2=O)C2=C(C=C(CO)C4=C2OC(=O)CC4)O3)N(C2C=C(O)C(=C=[OH+])O2)C(O)=NC1=O
330 569.1402006601 CC1=C(C2OC3=C(C2=O)C2=C(C=C(CO)C4=C2OC(O)CC4CCCO)O3)N(C2C=C(O)C(=C=[OH+])O2)C(O)=NC1=O Intermediate Fragment 
331 511.0983358481 CC1=C(C2OC3=C(C2=O)C2=C(C=C(CO)C4=C2OC(O)CC4)O3)N(C2C=C(O)C(=C=[OH+])O2)C(O)=NC1=O
332 513.1139859121 CC1=C(C2OC3=C(C2=O)C2=C(C=C(CO)C4CCC(O)OC24)O3)N(C2C=C(O)C(=C=[OH+])O2)C(O)=NC1=O
333 523.0983358481 CC1=C(C2OC3=C(C2=O)C2=C(C=C(CO)C4=C2OC(=O)CC4C)O3)N(C2C=C(O)C(=C=[OH+])O2)C(O)=NC1=O
334 525.1139859121 CC1=C(C2OC3=C(C2=O)C2=C(C=C(CO)C4=C2OC(O)CC4C)O3)N(C2C=C(O)C(=C=[OH+])O2)C(O)=NC1=O
335 539.1296359761 CCC1CC(O)OC2=C1C(CO)=CC1=C2C2=C(O1)OC(C1=C(C)C(=O)N=C(O)N1C1C=C(O)C(=C=[OH+])O1)C2=O
336 541.1452860401 CCC1CC(O)OC2C3=C(C=C(CO)C12)OC1=C3C(=O)C(C2=C(C)C(=O)N=C(O)N2C2C=C(O)C(=C=[OH+])O2)O1
337 569.1402006601 CCC1C2=C(OC(O)C1CO)C1=C(C=C2CO)OC2=C1C(=O)C(C1=C(C)C(=O)N=C(O)N1C1C=C(O)C(=C=[OH+])O1)O2 Intermediate Fragment 
338 539.0932504681 CC1=C(C2OC3=C(C2=O)C2=C(C=C(CO)C4=C2OC(=O)C(CO)C4)O3)N(C2C=C(O)C(=C=[OH+])O2)C(O)=NC1=O
339 541.1089005321 CC1=C(C2OC3=C(C2=O)C2=C(C=C(CO)C4=C2OC(O)C(CO)C4)O3)N(C2C=C(O)C(=C=[OH+])O2)C(O)=NC1=O
340 537.1139859121 CCC1CC(=O)OC2=C1C(CO)=CC1=C2C2=C(O1)OC(C1=C(C)C(=O)N=C(O)N1C1C=C(O)C(=C=[OH+])O1)C2=O
341 569.1402006601 CC1=C(C2OC3=C(C2=O)C2=C(C=C(CO)C4=C2OC(O)C(C(C)O)C4C)O3)N(C2C=C(O)C(=C=[OH+])O2)C(O)=NC1=O Intermediate Fragment 
342 567.1245505961 CC1=C(C2OC3=C(C2=O)C2=C(C=C(CO)C4=C2OC(O)C2C(O)CCC42)O3)N(C2C=C(O)C(=C=[OH+])O2)C(O)=NC1=O
