#In-silico ESI-MS/MS [M+H]+ Spectra
#PREDICTED BY CFM-ID 4.0.8
#SMILES=[nH]1c(nc2c(c1=O)ncn2[C@@H]1O[C@H](CO)[C@@H](C1)O)NC/C=C/c1cc(c(cc1)OC)OC
#InChiKey=DFUGRUFVONJBQG-GIDVQNCESA-N
energy0
177.09101 8.09 26 172 173 177 (5.2399 0.13947 0.12713 0.038255)
284.11420 4.48 91 103 (2.9011 0.16493)
312.10912 7.39 48 52 90 83 (3.0663 1.8231 0.17038 1.6957e-05)
328.14042 100.00 19 89 101 115 66 63 73 53 112 86 74 113 114 75 79 68 (61.656 3.5498 2.1394 0.252 0.19597 0.18616 0.16269 0.10287 0.089771 0.047963 0.037989 0.030152 0.020094 0.019088 0.015776 0.0049974)
energy1
145.06479 9.13 170 (2.5779)
151.07536 6.61 40 199 (1.6935 0.17291)
177.09101 49.32 26 172 173 177 (11.848 1.1728 0.56462 0.33508)
272.11420 5.66 116 105 (1.1648 0.43246)
282.09855 6.95 104 92 (1.3419 0.61918)
284.11420 16.51 103 91 (2.6756 1.9846)
296.11420 52.60 45 49 (13.565 1.2798)
300.14550 5.66 61 47 51 (0.816 0.5998 0.1814)
312.10912 31.20 48 52 90 83 (4.9197 3.8824 0.0029378 0.00013015)
328.14042 100.00 19 101 53 115 112 63 89 79 68 113 74 73 86 114 66 75 (23.386 2.3083 0.58589 0.58377 0.38597 0.23932 0.17157 0.099082 0.08061 0.07502 0.066784 0.063975 0.056403 0.056127 0.052804 0.012492)
energy2
59.04914 8.68 10 331 (0.96114 0.078212)
75.04406 29.34 255 (3.5154)
93.06988 14.84 158 (1.7781)
95.08553 13.19 151 (1.58)
106.06513 9.18 318 (1.0999)
125.09609 8.87 153 (1.0628)
137.05971 18.39 198 (2.2036)
147.08044 11.28 167 (1.3514)
149.05971 10.93 189 188 (0.98207 0.32782)
151.07536 8.84 199 40 (0.69133 0.36773)
152.05669 9.10 29 (1.0906)
162.09134 23.35 140 (2.7976)
164.05669 8.83 36 (1.0579)
166.07234 8.28 37 (0.99217)
177.09101 12.99 26 173 177 172 (0.92621 0.39926 0.11562 0.11514)
178.07234 14.70 42 (1.7609)
179.10666 8.29 25 168 169 (0.91047 0.052415 0.030123)
228.08799 16.64 98 118 (1.0595 0.93437)
230.10364 26.77 364 327 (1.6183 1.5892)
242.10364 38.68 94 (4.6336)
258.09855 15.48 109 (1.8544)
272.11420 27.93 116 105 (2.0626 1.2835)
284.11420 9.41 103 91 (0.56454 0.56229)
285.13460 11.47 64 (1.3738)
296.11420 41.59 45 49 (4.6917 0.29091)
312.10912 14.58 52 48 83 90 (1.108 0.61288 0.022512 0.0038453)
328.14042 100.00 79 89 19 53 68 101 115 73 86 63 112 75 114 66 113 74 (3.167 3.0509 1.8561 0.89254 0.70665 0.56343 0.28975 0.26143 0.19755 0.18928 0.18305 0.18138 0.15227 0.14331 0.080642 0.065049)
354.15607 13.50 251 (1.6172)
416.19285 10.73 219 125 216 213 (0.82712 0.16002 0.15441 0.1439)
427.16121 9.35 218 228 (0.75363 0.36608)

0 444.1877599721 COc1ccc(C=CC[NH2+]c2nc3c(ncn3C3CC(O)C(CO)O3)c(=O)[nH]2)cc1OC
1 426.1771952881 COC1CCC(CC=C=[NH+]C2=NC=C3N=CN(C4C=C(O)C(=C=O)O4)C3=N2)CC1OC
2 119.0702706321 OC1CCOC1C[OH2+]
3 119.0702706321 O=CCC(O)CC[OH2+] Intermediate Fragment 
4 117.0546205681 OC1CCOC1=C[OH2+]
5 89.0597059481 [OH2+]C1CCOC1
6 99.0440558841 C=C1OCC=C1[OH2+]
7 99.0440558841 [OH+]=C=C1CCCO1
8 117.0546205681 CCC(O)C(=O)C=[OH+] Intermediate Fragment 
9 99.0440558841 CC=C(O)C#C[OH2+]
10 59.0491412641 CC=C[OH2+]
11 57.0334912001 CC#C[OH2+]
12 61.0284058201 OCC=[OH+]
13 117.0546205681 O=CCC(O)C=C[OH2+] Intermediate Fragment 
14 89.0597059481 CC(O)C=C[OH2+]
15 117.0546205681 OCCCOC#C[OH2+] Intermediate Fragment 
16 117.0546205681 CCOC(=C=[OH+])CO Intermediate Fragment 
17 115.0389705041 OC1CCOC1=C=[OH+]
18 326.1247657921 COC1=CC(=C=C=C=[NH+]C2=NC(O)=C3N=CNC3=N2)CCC1OC
19 328.1404158561 COC1CCC(=C=C=C=[NH+]C2=NC(O)=C3N=CNC3=N2)CC1OC
20 310.1298511721 COC1=CC(=C=C=C=[NH+]C2=NC=C3N=CNC3=N2)CCC1OC
21 194.1175551721 COC1CCC(C#CC#[NH+])CC1OC
22 192.1019051081 COC1C=C(C#CC#[NH+])CCC1OC
23 190.0862550441 COC1=C(OC)CCC(C#CC#[NH+])=C1
24 188.0706049801 COC1=C(OC)C=C(C#CC#[NH+])C=C1
25 179.1066561401 C#CC=C1C=C(OC)C([OH+]C)CC1
26 177.0910060761 C#CC=C1C=C(OC)C([OH+]C)=CC1
27 175.0753560121 C#CC=C1C=C(OC)C([O+]=C)=CC1
28 150.0410361681 [NH3+]C1=NC(=O)C2=NC=NC2=N1
29 152.0566862321 [NH3+]C1=NC(=O)C2=NCNC2=N1
30 154.0723362961 [NH3+]C1=NC(=O)C2NCNC2=N1
31 169.1223062041 C#CC1CCC([OH+]C)C(OC)C1
32 167.1066561401 C#CC1=CC(OC)C([OH+]C)CC1
33 165.0910060761 C#CC1=CC(OC)=C([OH+]C)CC1
34 163.0753560121 C#CC1=CC(OC)=C([OH+]C)C=C1
35 162.0410361681 C=[NH+]C1=NC(=O)C2=NC=NC2=N1
36 164.0566862321 C[NH2+]C1=NC(=O)C2=NC=NC2=N1
37 166.0723362961 C[NH2+]C1=NC(=O)C2=NCNC2=N1
38 168.0879863601 C[NH2+]C1=NC(=O)C2NCNC2=N1
39 153.0910060761 C=C1C=C(OC)C([OH+]C)=CC1
40 151.0753560121 C=[O+]C1=CCC(=C)C=C1OC
41 176.0566862321 CC=[NH+]C1=NC(=O)C2=NC=NC2=N1
42 178.0723362961 CC[NH2+]C1=NC(=O)C2=NC=NC2=N1
43 190.0723362961 CCC=[NH+]C1=NC(=O)C2=NC=NC2=N1
44 192.0879863601 CCC[NH2+]C1=NC(=O)C2=NC=NC2=N1
45 296.1142011081 COC1=CC(=C=C=C=[NH+]C2=NC(O)=C3N=CNC3=N2)CCC1
46 298.1298511721 COC1CCCC(=C=C=C=[NH+]C2=NC(O)=C3N=CNC3=N2)C1
47 300.1455012361 COC1CCCC(C=C=C=[NH+]C2=NC(O)=C3N=CNC3=N2)C1
48 312.1091157281 COC1=CC(=C=C=C=[NH+]C2=NC(O)=C3N=CNC3=N2)CCC1O
49 296.1142011081 COC1C=CC(=C=C=C=[NH+]C2=NC(O)=C3N=CNC3=N2)CC1
50 298.1298511721 COC1CCC(=C=C=C=[NH+]C2=NC(O)=C3N=CNC3=N2)CC1
51 300.1455012361 COC1CCC(C=C=C=[NH+]C2=NC(O)=C3N=CNC3=N2)CC1
52 312.1091157281 COC1CCC(=C=C=C=[NH+]C2=NC(O)=C3N=CNC3=N2)C=C1O
53 328.1404158561 COC1CCC(=C=C=C=[NH+]C(=N)N=C2NC=NC2=C=O)CC1OC Intermediate Fragment 
54 311.1138667601 COC1=CCC(=CC#CN=C=[NH+]C2=C(C=O)N=CN2)C=C1OC
55 217.0971540761 COC1=CC(=C=C=C=NC#[NH+])CCC1OC
56 219.1128041401 COC1CCC(=C=C=C=NC#[NH+])CC1OC
57 221.1284542041 COC1CCC(C=C=C=NC#[NH+])CC1OC
58 230.0924030441 C=[O+]C1=CCC(=C=C=C=NC(=N)N)C=C1OC
59 232.1080531081 COC1=CCC(=C=C=C=NC(N)=[NH2+])C=C1OC
60 234.1237031721 COC1=CC(=C=C=C=NC(N)=[NH2+])CCC1OC
61 300.1455012361 COC1CCC(=C=C=C=NC(=[NH2+])N=C2C=NC=N2)CC1OC
62 326.1247657921 COC1=CC(=C=C=C=NC(=[NH2+])N=C2NC=NC2=C=O)CCC1OC
63 328.1404158561 COC1CCC(=C=C=C=[NH+]C(N=C2C=NC=N2)=NC=O)CC1OC Intermediate Fragment 
64 285.1346022041 COC1=CC(=CC#CN=C=[NH+]C2=CN=CN2)CCC1OC
65 283.1189521401 COC1=CCC(=CC#CN=C=[NH+]C2=CN=CN2)C=C1OC
66 328.1404158561 COC1=CC(=C=C=C=[NH+]C(N)=NC(=O)C2=CNC=N2)CCC1OC Intermediate Fragment 
67 311.1138667601 COC1=CCC(=CC#CN=C=[NH+]C(=O)C2=CNC=N2)C=C1OC
68 328.1404158561 COC1=CC(=CC#C[NH+]=C=NC(O)=C2N=CNC2=N)CCC1OC Intermediate Fragment 
69 204.1019051081 C=[NH+]C#CC=C1C=C(OC)C(OC)=CC1
70 247.1077187601 COC1=CC(=CC#CN=C=[NH+]C=O)CCC1OC
71 245.0920686961 COC1=CCC(=CC#CN=C=[NH+]C=O)C=C1OC
72 243.0764186321 C=[O+]C1=CCC(=CC#CN=C=NC=O)C=C1OC
73 328.1404158561 COC1=CC(=CC#C[NH+]=C=NC2=C(C(N)=O)N=CN2)CCC1OC Intermediate Fragment 
74 328.1404158561 COC1CCC(=C=C=C=[NH+]C2=NC(O)=CC(N=C=N)=N2)CC1OC Intermediate Fragment 
75 328.1404158561 COC1CCC(=C=C=C=[NH+]C2=NC(O)=C(N=C=N)C=N2)CC1OC Intermediate Fragment 
76 284.1029677281 COC1=CCC(=C=C=C=[NH+]C2=NC(O)=CC=N2)C=C1OC
77 286.1186177921 COC1=CC(=C=C=C=[NH+]C2=NC(O)=CC=N2)CCC1OC
78 301.1295168241 COC1=CC(=C=C=C=NC2=NC(O)=C([NH3+])C=N2)CCC1OC
79 328.1404158561 C=NC1=C(O)N=C([NH+]=C=C=C=C2C=C(OC)C(OC)CC2)N=C1N Intermediate Fragment 
80 297.0982166961 C=[O+]C1=CCC(=C=C=C=NC2=NC(O)=CC(N)=N2)C=C1OC
81 299.1138667601 COC1=CCC(=C=C=C=NC2=NC(O)=CC([NH3+])=N2)C=C1OC
82 301.1295168241 COC1=CC(=C=C=C=NC2=NC(O)=CC([NH3+])=N2)CCC1OC
83 312.1091157281 C=[O+]C1=CCC(=C=C=C=NC2=NC(O)=C(N)C(N)=N2)C=C1OC
84 311.1138667601 C=[NH+]C1=C(O)N=C(N=C=C=C=C2C=C(OC)C(OC)=CC2)N=C1
85 326.1247657921 C=[NH+]C1=C(O)N=C(N=C=C=C=C2C=C(OC)C(OC)=CC2)N=C1N
86 328.1404158561 C=NC1=NC([NH+]=C=C=C=C2C=C(OC)C(OC)CC2)=NC(O)=C1N Intermediate Fragment 
87 311.1138667601 C=[NH+]C1=NC(N=C=C=C=C2C=C(OC)C(OC)=CC2)=NC(O)=C1
88 297.0982166961 C=[O+]C1=CCC(=C=C=C=NC2=NC(O)=C(N)C=N2)C=C1OC
89 328.1404158561 COC=C(CCC(C)=C=C=C=[NH+]C1=NC(O)=C2N=CNC2=N1)OC Intermediate Fragment 
90 312.1091157281 COC=C(C=CC=C=C=C=[NH+]C1=NC(O)=C2N=CNC2=N1)OC
91 284.1142011081 COC=CCC(C)=C=C=C=[NH+]C1=NC(O)=C2N=CNC2=N1
92 282.0985510441 COC#CCC(C)=C=C=C=[NH+]C1=NC(O)=C2N=CNC2=N1
93 244.1192864881 CCC(C)C=C=C=[NH+]C1=NC(O)=C2N=CNC2=N1
94 242.1036364241 CCC(C)=C=C=C=[NH+]C1=NC(O)=C2N=CNC2=N1
95 240.0879863601 C=CC(C)=C=C=C=[NH+]C1=NC(O)=C2N=CNC2=N1
96 238.0723362961 C#CC(C)=C=C=C=[NH+]C1=NC(O)=C2N=CNC2=N1
97 89.0597059481 COC=C[OH+]C
98 228.0879863601 CC(C)C=C=C=[NH+]C1=NC(=O)C2=NC=NC2=N1
99 226.0723362961 CC(C)=C=C=C=[NH+]C1=NC(=O)C2=NC=NC2=N1
100 224.0566862321 [CH2+]C(C)=C=C=C=NC1=NC(=O)C2=NC=NC2=N1
101 328.1404158561 COC=CC(=C=C=C=[NH+]C1=NC(O)=C2N=CNC2=N1)CCCOC Intermediate Fragment 
102 268.0829009801 COC#CCC=C=C=C=[NH+]C1=NC(O)=C2N=CNC2=N1
103 284.1142011081 CCC(=C=C=C=[NH+]C1=NC(O)=C2N=CNC2=N1)C=COC
104 282.0985510441 CCC(=C=C=C=[NH+]C1=NC(O)=C2N=CNC2=N1)C#COC
105 272.1142011081 COCCC(C)=C=C=C=[NH+]C1=NC(O)=C2N=CNC2=N1
106 270.0985510441 COC=CC(C)=C=C=C=[NH+]C1=NC(O)=C2N=CNC2=N1
107 268.0829009801 COC#CC(C)=C=C=C=[NH+]C1=NC(O)=C2N=CNC2=N1
108 260.1142011081 COCCCC=C=C=[NH+]C1=NC(O)=C2N=CNC2=N1
109 258.0985510441 COCCC=C=C=C=[NH+]C1=NC(O)=C2N=CNC2=N1
110 256.0829009801 COCC=C=C=C=C=[NH+]C1=NC(O)=C2N=CNC2=N1
111 254.0672509161 COC=C=C=C=C=C=[NH+]C1=NC(O)=C2N=CNC2=N1
112 328.1404158561 CCC(=C=C=C=[NH+]C1=NC(O)=C2N=CNC2=N1)C=C(COC)OC Intermediate Fragment 
113 328.1404158561 COC(=CC(C)=C=C=C=[NH+]C1=NC(O)=C2N=CNC2=N1)C(C)OC Intermediate Fragment 
114 328.1404158561 CCC(OC)C(C=C=C=C=C=[NH+]C1=NC(O)=C2N=CNC2=N1)OC Intermediate Fragment 
115 328.1404158561 C=C(OC)C(CCC=C=C=C=[NH+]C1=NC(O)=C2N=CNC2=N1)OC Intermediate Fragment 
116 272.1142011081 COCCCC=C=C=C=[NH+]C1=NC(O)=C2N=CNC2=N1
117 270.0985510441 COC=CCC=C=C=C=[NH+]C1=NC(O)=C2N=CNC2=N1
118 228.0879863601 CCC=C=C=C=[NH+]C1=NC(O)=C2N=CNC2=N1
119 226.0723362961 C=CC=C=C=C=[NH+]C1=NC(O)=C2N=CNC2=N1
120 330.1560659201 COC1CCC(C=C=C=[NH+]C2=NC(O)=C3N=CNC3=N2)CC1OC
121 332.1717159841 COC1CCC(CC=C=[NH+]C2=NC(O)=C3N=CNC3=N2)CC1OC
122 334.1873660481 COC1CCC(CCC=[NH+]C2=NC(O)=C3N=CNC3=N2)CC1OC
123 412.1615452241 COC1CCC(=C=C=C=[NH+]C2=NC(O)=C3N=CN(C4CC(O)=CO4)C3=N2)CC1OC
124 414.1771952881 COC1CCC(C=C=C=[NH+]C2=NC(O)=C3N=CN(C4CC(O)=CO4)C3=N2)CC1OC
125 416.1928453521 COC1CCC(CC=C=[NH+]C2=NC(O)=C3N=CN(C4CC(O)=CO4)C3=N2)CC1OC
126 426.1771952881 C=C1OC(N2C=NC3=C(O)N=C([NH+]=C=C=CC4CCC(OC)C(OC)C4)N=C32)C=C1O
127 408.1666306041 C=C1C=CC(N2C=NC3=C(O)N=C([NH+]=C=C=C=C4CCC(OC)C(OC)C4)N=C32)O1
128 426.1771952881 COC1CCC(=C=C=C=[NH+]C2=NC(O)=C3N=CN(CC=C(O)C(C)=O)C3=N2)CC1OC Intermediate Fragment 
129 426.1771952881 C=C(C=O)OC(C)N1C=NC2=C(O)N=C([NH+]=C=C=C=C3CCC(OC)C(OC)C3)N=C21 Intermediate Fragment 
130 426.1771952881 C#COC(C=C=O)N1C=NC2=C(O)N=C([NH+]=C=CCC3CCC(OC)C(OC)C3)N=C21 Intermediate Fragment 
131 426.1771952881 C=C1OC(N2C=NC3=C(O)N=C([NH+]=C=C=C=C(C)CCC(COC)OC)N=C32)C=C1O Intermediate Fragment 
132 426.1771952881 C=C1OC(N2C=NC3=C(O)N=C([NH+]=C=C=C=C(CCCOC)CCOC)N=C32)C=C1O Intermediate Fragment 
133 426.1771952881 C=C1OC(N2C=NC3=C(O)N=C([NH+]=C=C=C=CCCC(OC)C(C)OC)N=C32)C=C1O Intermediate Fragment 
134 200.1645053641 COC1CCC(CCC=[NH2+])CC1OC
135 200.1645053641 COCC(CCC(C)CCC#[NH+])OC Intermediate Fragment 
136 198.1488553001 COC1CCC(CCC#[NH+])CC1OC
137 198.1488553001 COCC(CCC(C)C=CC#[NH+])OC Intermediate Fragment 
138 198.1488553001 COC(C)C(CCCC=CC#[NH+])OC Intermediate Fragment 
139 196.1332052361 COC1CCC(C=CC#[NH+])CC1OC
140 162.0913404241 COC1C=C(C#CC#[NH+])CCC1
141 194.1175551721 COCC=C(C#CC#[NH+])CCCOC Intermediate Fragment 
142 194.1175551721 C=C(C#CC#[NH+])CCC(COC)OC Intermediate Fragment 
143 192.1019051081 COC=C=C(C#CC#[NH+])CCCOC Intermediate Fragment 
144 192.1019051081 C=C(C#CC#[NH+])CCC(=COC)OC Intermediate Fragment 
145 186.0549549161 C=[O+]C1=C(OC)C=C(C#CC#N)C=C1
146 185.1536063321 C=CCC1CCC([OH+]C)C(OC)C1
147 43.0542266441 CC=[CH3+]
148 185.1536063321 C#CCC(C)CCC(COC)[OH+]C Intermediate Fragment 
149 139.1117415201 C#CC=C(C)CCC[OH+]C
150 97.1011768361 [CH2+]#CCC(C)CC
151 95.0855267721 [CH2+]#CC=C(C)CC
152 185.1536063321 C#CCCCCC([OH+]C)C(C)OC Intermediate Fragment 
153 125.0960914561 C#CC=CCCC[OH+]C
154 183.1379562681 C#CCC1CCC([OH+]C)C(OC)C1
155 151.1117415201 C#CC=C1CCCC([OH+]C)C1
156 183.1379562681 C#CC=C(CCC[OH+]C)CCOC Intermediate Fragment 
157 183.1379562681 C#CC=C(C)CCC(COC)[OH+]C Intermediate Fragment 
158 93.0698767081 C=CC(C)=CC#[CH2+]
159 183.1379562681 C#CC=CCCC([OH+]C)C(C)OC Intermediate Fragment 
160 123.0804413921 C#CC#CCCC[OH+]C
161 81.0698767081 [CH2+]#CC=CCC
162 79.0542266441 [CH2+]#CC#CCC
163 115.0753560121 C=C(OC)C(=C)[OH+]C
164 181.1223062041 C#CC=C1CCC([OH+]C)C(OC)C1
165 181.1223062041 C#CC=C(C)CCC(=COC)[OH+]C Intermediate Fragment 
166 181.1223062041 C#CC#CCCC([OH+]C)C(C)OC Intermediate Fragment 
167 147.0804413921 C#CC=C1C=C([OH+]C)C=CC1
168 179.1066561401 C#CC=C(C)C=CC(=COC)[OH+]C Intermediate Fragment 
169 179.1066561401 C#CC#CCCC([OH+]C)C(=C)OC Intermediate Fragment 
170 145.0647913281 C#CC=C1C=C([O+]=C)C=CC1
171 149.0960914561 C#CC=C1C=C([OH+]C)CCC1
172 177.0910060761 C#CC=C(C=C=C[OH+]C)C=COC Intermediate Fragment 
173 177.0910060761 C#CC=C(C)C=CC(=COC)[O+]=C Intermediate Fragment 
174 133.0647913281 C#CC=C(C)CC#C[O+]=C
175 91.0542266441 C#CC(C)=CC#[CH2+]
176 89.0385765801 [C+]#CC=C(C)C#C
177 177.0910060761 C#CC#CCC=C([OH+]C)C(=C)OC Intermediate Fragment 
178 77.0385765801 C=CC#CC#[CH2+]
179 266.0883802841 [NH3+]C1=NC(O)=C2N=CN(C3CC(O)C(=CO)O3)C2=N1
180 268.1040303481 [NH3+]C1=NC(O)=C2N=CN(C3CC(O)C(CO)O3)C2=N1
181 250.0934656641 [NH3+]C1=NC(O)=C2N=CN(C3CCC(=CO)O3)C2=N1
182 268.1040303481 [NH3+]C1=NC(O)=C2N=CN(C(=O)CC(O)CCO)C2=N1 Intermediate Fragment 
183 270.1196804121 [NH3+]C1=NC(O)=C2NCN(C3CC(O)C(CO)O3)C2=N1
184 171.1379562681 C=CC1CCC([OH+]C)C(OC)C1
185 171.1379562681 C#CC(CCC[OH+]C)CCOC Intermediate Fragment 
186 169.1223062041 C#CC(=CCOC)CCC[OH+]C Intermediate Fragment 
187 133.0647913281 C#CC1=CC([OH+]C)=CC=C1
188 149.0597059481 C#CC1=CC(OC)=C([OH2+])C=C1
189 149.0597059481 C#CC1=CC(O)=C([OH+]C)C=C1
190 165.0910060761 C#CC(=C)C=CC(=COC)[OH+]C Intermediate Fragment 
191 163.0753560121 C#CC(=C)C=CC(=COC)[O+]=C Intermediate Fragment 
192 161.0597059481 C#CC1=CC(OC)=C([O+]=C)C=C1
193 278.0883802841 C[NH2+]C1=NC(O)=C2N=CN(C3CC(O)C(=C=O)O3)C2=N1
194 280.1040303481 C[NH2+]C1=NC(O)=C2N=CN(C3CC(O)C(=CO)O3)C2=N1
195 282.1196804121 C[NH2+]C1=NC(O)=C2N=CN(C3CC(O)C(CO)O3)C2=N1
196 282.1196804121 C[NH2+]C1=NC(O)=C2N=CN(C(=O)CC(O)CCO)C2=N1 Intermediate Fragment 
197 284.1353304761 C[NH2+]C1=NC(O)=C2NCN(C3CC(O)C(CO)O3)C2=N1
198 137.0597059481 C=[O+]C1=CCC(=C)C=C1O
199 151.0753560121 C=[O+]C=C=CC(=C)C=COC Intermediate Fragment 
200 290.0883802841 CC[NH2+]C1=NC(O)=C2N=CN(C3C=C(O)C(=C=O)O3)C2=N1
201 292.1040303481 CC[NH2+]C1=NC(O)=C2N=CN(C3CC(O)C(=C=O)O3)C2=N1
202 292.1040303481 CC[NH2+]C1=NC(O)=C2N=CN(CC=C(O)C(=O)C=O)C2=N1 Intermediate Fragment 
203 294.1196804121 CC[NH2+]C1=NC(O)=C2N=CN(C3CC(O)C(=CO)O3)C2=N1
204 294.1196804121 CC[NH2+]C1=NC(O)=C2N=CN(CCC(O)C(=O)C=O)C2=N1 Intermediate Fragment 
205 294.1196804121 CC[NH2+]C1=NC(O)=C2N=CN(C(CCO)OC#CO)C2=N1 Intermediate Fragment 
206 294.1196804121 CC[NH2+]C1=NC(O)=C2N=CN(C(=O)CC(O)C=CO)C2=N1 Intermediate Fragment 
207 304.1040303481 CCC[NH2+]C1=NC(O)=C2N=CN(C3C=C(O)C(=C=O)O3)C2=N1
208 306.1196804121 CCC[NH2+]C1=NC(O)=C2N=CN(C3CC(O)C(=C=O)O3)C2=N1
209 308.1353304761 CCC[NH2+]C1=NC(O)=C2N=CN(C3CC(O)C(=CO)O3)C2=N1
210 308.1353304761 CCC[NH2+]C1=NC(O)=C2N=CN(C(=O)CC(O)C=CO)C2=N1 Intermediate Fragment 
211 412.1615452241 COC1CCCC(CC=C=[NH+]C2=NC(O)=C3N=CN(C4C=C(O)C(=C=O)O4)C3=N2)C1
212 414.1771952881 COC1CCCC(CCC=[NH+]C2=NC(O)=C3N=CN(C4C=C(O)C(=C=O)O4)C3=N2)C1
213 416.1928453521 COC1CCCC(CCC[NH2+]C2=NC(O)=C3N=CN(C4C=C(O)C(=C=O)O4)C3=N2)C1
214 412.1615452241 COC1CCC(CC=C=[NH+]C2=NC(O)=C3N=CN(C4C=C(O)C(=C=O)O4)C3=N2)CC1
215 414.1771952881 COC1CCC(CCC=[NH+]C2=NC(O)=C3N=CN(C4C=C(O)C(=C=O)O4)C3=N2)CC1
216 416.1928453521 COC1CCC(CCC[NH2+]C2=NC(O)=C3N=CN(C4C=C(O)C(=C=O)O4)C3=N2)CC1
217 444.1877599721 COC1CCC(CCC=[NH+]C(=N)N=C2C(=C=O)N=CN2C2C=C(O)C(=C=O)O2)CC1OC Intermediate Fragment 
218 427.1612108761 COC1CCC(CC#CN=C=[NH+]C2=C(C=O)N=CN2C2C=C(O)C(=C=O)O2)CC1OC
219 416.1928453521 COC1CCC(CC=C=NC(=[NH2+])N=C2C=NCN2C2C=C(O)C(=C=O)O2)CC1OC
220 444.1877599721 COC1CCC(CC=C=[NH+]C(=NC=O)N=C2C=NCN2C2C=C(O)C(=C=O)O2)CC1OC Intermediate Fragment 
221 401.1819463201 COC1CCC(CC=CN=C=[NH+]C2=CN=CN2C2C=C(O)C(=C=O)O2)CC1OC
222 401.1819463201 COC1CCC(CC=CN=C=[NH+]C2=CN=CN2C(=O)C=C(O)C#CO)CC1OC Intermediate Fragment 
223 399.1662962561 COC1CCC(CC#CN=C=[NH+]C2=CN=CN2C2C=C(O)C(=C=O)O2)CC1OC
224 397.1506461921 COC1CCC(=CC#CN=C=[NH+]C2=CN=CN2C2C=C(O)C(=C=O)O2)CC1OC
225 183.0764186321 OC1CC(N2C=CN=C2)OC1=C[OH2+]
226 414.1771952881 COC1CCC(C=C=C=NC(=[NH2+])N=C2C=NCN2C2C=C(O)C(=C=O)O2)CC1OC
227 444.1877599721 COC1CCC(CC=C=[NH+]C(N)=NC(=O)C2=CN(C3C=C(O)C(=C=O)O3)C=N2)CC1OC Intermediate Fragment 
228 427.1612108761 COC1CCC(CC#CN=C=[NH+]C(=O)C2=CN(C3C=C(O)C(=C=O)O3)C=N2)CC1OC
229 444.1877599721 COC1CCC(CC=C[NH+]=C=NC(O)=C2N=CN(C3C=C(O)C(=C=O)O3)C2=N)CC1OC Intermediate Fragment 
230 198.0873176641 [NH2+]=C1C=NCN1C1CC(O)C(=CO)O1
231 224.0665822201 [NH2+]=C1C(=C=O)N=CN1C1CC(O)C(=CO)O1
232 444.1877599721 COC1CCC(CC=C[NH+]=C=NC2=C(C(N)=O)N=CN2C2C=C(O)C(=C=O)O2)CC1OC Intermediate Fragment 
233 444.1877599721 COC1CCC(CC=C=[NH+]C2=NC(O)=CC(N(C=N)C3C=C(O)C(=C=O)O3)=N2)CC1OC Intermediate Fragment 
234 417.1768609401 COC1CCC(CCC=NC2=NC(O)=CC([NH+]=C3C=C(O)C(=C=O)O3)=N2)CC1OC
235 159.0764186321 [NH+]#CNC1CC(O)C(CO)O1
236 142.0498695361 C=[NH+]C1CC(O)C(=C=O)O1
237 159.0764186321 [NH+]#CN=C(O)CC(O)CCO Intermediate Fragment 
238 161.0920686961 [NH2+]=CNC1CC(O)C(CO)O1
239 144.0655196001 C=[NH+]C1CC(O)C(=CO)O1
240 444.1877599721 COC1CCC(CCC=[NH+]C2=NC(O)=C(N=C=NC3C=C(O)C(=C=O)O3)C=N2)CC1OC Intermediate Fragment 
241 444.1877599721 C=NC1=C(O)N=C([NH+]=CCCC2CCC(OC)C(OC)C2)N=C1N=C1C=C(O)C(=C=O)O1 Intermediate Fragment 
242 444.1877599721 COC1CCC(CC=C=[NH+]C2=NC(O)=C3N=CN(CC=C(O)C(=O)C=O)C3=N2)CC1OC Intermediate Fragment 
243 426.1771952881 COC1CCC(C=C=C=[NH+]C2=NC(O)=C3N=CN(CC=C(O)C#CO)C3=N2)CC1OC
244 388.1979307321 COC1CCC(CCC=[NH+]C2=NC(O)=C3N=CN(CC#CO)C3=N2)CC1OC
245 386.1822806681 COC1CCC(CC=C=[NH+]C2=NC(O)=C3N=CN(CC#CO)C3=N2)CC1OC
246 384.1666306041 COC1CCC(C=C=C=[NH+]C2=NC(O)=C3N=CN(CC#CO)C3=N2)CC1OC
247 384.1666306041 COCC(CCC(C)=C=C=C=[NH+]C1=NC(O)=C2N=CN(CC#CO)C2=N1)OC Intermediate Fragment 
248 384.1666306041 COCCCC(=C=C=C=[NH+]C1=NC(O)=C2N=CN(CC#CO)C2=N1)CCOC Intermediate Fragment 
249 382.1509805401 COC1CCC(=C=C=C=[NH+]C2=NC(O)=C3N=CN(CC#CO)C3=N2)CC1OC
250 356.1717159841 CCN1C=NC2=C(O)N=C([NH+]=C=C=C=C3CCC(OC)C(OC)C3)N=C21
251 354.1560659201 CCN1C=NC2=C(O)N=C([NH+]=C=C=C=C3C=C(OC)C(OC)CC3)N=C21
252 352.1404158561 CCN1C=NC2=C(O)N=C([NH+]=C=C=C=C3C=C(OC)C(OC)=CC3)N=C21
253 444.1877599721 C=C(O)C(=C=O)OCN1C=NC2=C(O)N=C([NH+]=C=CCC3CCC(OC)C(OC)C3)N=C21 Intermediate Fragment 
254 444.1877599721 COC1CCC(CC=C=[NH+]C2=NC(O)=C3N=CN(C(C)OC(=C=O)C=O)C3=N2)CC1OC Intermediate Fragment 
255 75.0440558841 OCC=C[OH2+]
256 370.1509805401 COC1CCC(=C=C=C=[NH+]C2=NC(O)=C3N=CN(C(C)=O)C3=N2)CC1OC
257 372.1666306041 COC1CCC(C=C=C=[NH+]C2=NC(O)=C3N=CN(C(C)=O)C3=N2)CC1OC
258 372.1666306041 COCC(CCC(C)=C=C=C=[NH+]C1=NC(O)=C2N=CN(C(C)=O)C2=N1)OC Intermediate Fragment 
259 444.1877599721 COC1CCC(CCC=[NH+]C2=NC(O)=C3N=CN(C(C=C=O)OC#CO)C3=N2)CC1OC Intermediate Fragment 
260 47.0491412641 CC[OH2+]
261 400.1615452241 COC1CCC(CC=C=[NH+]C2=NC(O)=C3N=CN(C(=O)C#CO)C3=N2)CC1OC
262 402.1771952881 COC1CCC(CCC=[NH+]C2=NC(O)=C3N=CN(C(=O)C#CO)C3=N2)CC1OC
263 402.1771952881 COC1CCC(CC=C=[NH+]C2=NC(O)=C3N=CN(COC#CO)C3=N2)CC1OC
264 400.1615452241 COC1CCC(C=C=C=[NH+]C2=NC(O)=C3N=CN(COC#CO)C3=N2)CC1OC
265 444.1877599721 COC1CCC(CCC=[NH+]C2=NC(O)=C3N=CN(C(=O)C=C(O)C#CO)C3=N2)CC1OC Intermediate Fragment 
266 398.1458951601 COC1CCC(C=C=C=[NH+]C2=NC(O)=C3N=CN(C(=O)C#CO)C3=N2)CC1OC
267 45.0334912001 C=C[OH2+]
268 376.1979307321 COC1CCC(CCC=[NH+]C2=NC(O)=C3N=CN(C(C)=O)C3=N2)CC1OC
269 374.1822806681 COC1CCC(CC=C=[NH+]C2=NC(O)=C3N=CN(C(C)=O)C3=N2)CC1OC
270 368.1353304761 COC1=CC(=C=C=C=[NH+]C2=NC(O)=C3N=CN(C(C)=O)C3=N2)CCC1OC
271 68.9971056921 [O+]#CC#CO
272 71.0127557561 O=CC#C[OH2+]
273 73.0284058201 OCC#C[OH2+]
274 55.0178411361 C#CC=[OH+]
275 77.0597059481 OCCC[OH2+]
276 360.1666306041 COC1CCC(CC=C=[NH+]C2=NC(O)=C3N=CN(C=O)C3=N2)CC1OC
277 358.1509805401 COC1CCC(C=C=C=[NH+]C2=NC(O)=C3N=CN(C=O)C3=N2)CC1OC
278 340.1404158561 COC1=CC(=C=C=C=[NH+]C2=NC(O)=C3N=CN(C)C3=N2)CCC1OC
279 356.1353304761 COC1CCC(=C=C=C=[NH+]C2=NC(O)=C3N=CN(C=O)C3=N2)CC1OC
280 354.1196804121 COC1=CC(=C=C=C=[NH+]C2=NC(O)=C3N=CN(C=O)C3=N2)CCC1OC
281 87.0440558841 CC(O)C#C[OH2+]
282 71.0491412641 C#CC(C)[OH2+]
283 71.0491412641 CCC#C[OH2+]
284 91.0753560121 CC(O)CC[OH2+]
285 73.0647913281 C=CC(C)[OH2+]
286 444.1877599721 COCC(CCC(C)CC=C=[NH+]C1=NC(O)=C2N=CN(C3C=C(O)C(=C=O)O3)C2=N1)OC Intermediate Fragment 
287 428.1564598441 COCC(CCCC=C=C=[NH+]C1=NC(O)=C2N=CN(C3C=C(O)C(=C=O)O3)C2=N1)OC
288 400.1615452241 COCCCC(C)CC=C=[NH+]C1=NC(O)=C2N=CN(C3C=C(O)C(=C=O)O3)C2=N1
289 286.1298511721 COCCCC(C)=C=C=C=[NH+]C1=NC(O)=C2N=CNC2=N1
290 382.1509805401 C=C1OC(N2C=NC3=C(O)N=C([NH+]=C=C=C=C(C)CCCOC)N=C32)C=C1O
291 150.0913404241 C=C(C#CC#[NH+])CCCOC
292 148.0756903601 C=C(C#CC#[NH+])CC=COC
293 146.0600402961 C=C(C#CC#[NH+])CC#COC
294 141.1273915841 C#CCC(C)CCC[OH+]C
295 137.0960914561 C#CC=C(C)CC=C[OH+]C
296 135.0804413921 C#CC=C(C)CC#C[OH+]C
297 384.1302450961 COCCCCC=C=C=[NH+]C1=NC(O)=C2N=CN(C3C=C(O)C(=C=O)O3)C2=N1
298 356.1353304761 CCC(C)CC=C=[NH+]C1=NC(O)=C2N=CN(C3C=C(O)C(=C=O)O3)C2=N1
299 354.1196804121 CCC(C)C=C=C=[NH+]C1=NC(O)=C2N=CN(C3C=C(O)C(=C=O)O3)C2=N1
300 342.1196804121 CC(C)CC=C=[NH+]C1=NC(O)=C2N=CN(C3C=C(O)C(=C=O)O3)C2=N1
301 340.1040303481 CC(C)C=C=C=[NH+]C1=NC(O)=C2N=CN(C3C=C(O)C(=C=O)O3)C2=N1
302 368.1353304761 CCCC(C)C=C=C=[NH+]C1=NC(O)=C2N=CN(C3C=C(O)C(=C=O)O3)C2=N1
303 370.1509805401 CCCC(C)CC=C=[NH+]C1=NC(O)=C2N=CN(C3C=C(O)C(=C=O)O3)C2=N1
304 372.1666306041 CCCC(C)CCC=[NH+]C1=NC(O)=C2N=CN(C3C=C(O)C(=C=O)O3)C2=N1
305 384.1302450961 CC(C=C=C=[NH+]C1=NC(O)=C2N=CN(C3C=C(O)C(=C=O)O3)C2=N1)CCCO
306 328.1040303481 CCCC=C=[NH+]C1=NC(O)=C2N=CN(C3C=C(O)C(=C=O)O3)C2=N1
307 400.1615452241 COCCCC(C)C=C=C=[NH+]C1=NC(O)=C2N=CN(CC=C(O)C(=O)C=O)C2=N1 Intermediate Fragment 
308 400.1615452241 COCCCC(C)CC=C=[NH+]C1=NC(O)=C2N=CN(C(=O)C=C(O)C#CO)C2=N1 Intermediate Fragment 
309 398.1458951601 COCCCC(C)C=C=C=[NH+]C1=NC(O)=C2N=CN(C3C=C(O)C(=C=O)O3)C2=N1
310 352.1040303481 CCC(C)=C=C=C=[NH+]C1=NC(O)=C2N=CN(C3C=C(O)C(=C=O)O3)C2=N1
311 366.1196804121 CCCC(C)=C=C=C=[NH+]C1=NC(O)=C2N=CN(C3C=C(O)C(=C=O)O3)C2=N1
312 45.0334912001 C=[O+]C
313 360.1666306041 CCC(C)CCC[NH2+]C1=NC(O)=C2N=CN(C3C=C(O)C(=C=O)O3)C2=N1
314 360.1666306041 CCC(C)CCC[NH2+]C1=NC(O)=C2N=CN(C(=O)C=C(O)C#CO)C2=N1 Intermediate Fragment 
315 358.1509805401 CCC(C)CCC=[NH+]C1=NC(O)=C2N=CN(C3C=C(O)C(=C=O)O3)C2=N1
316 358.1509805401 CCC(C)CCC=[NH+]C1=NC(O)=C2N=CN(C(=O)C=C(O)C#CO)C2=N1 Intermediate Fragment 
317 338.1247657921 C=C1OC(N2C=NC3=C(O)N=C([NH+]=C=C=C=C(C)CC)N=C32)C=C1O
318 106.0651256761 C=C(C#CC#[NH+])CC
319 330.1196804121 CCCCC=[NH+]C1=NC(O)=C2N=CN(C3C=C(O)C(=C=O)O3)C2=N1
320 356.1353304761 CCC(C)C=C=C=[NH+]C1=NC(O)=C2N=CN(CC=C(O)C(=O)C=O)C2=N1 Intermediate Fragment 
321 356.1353304761 CCC(C)CC=C=[NH+]C1=NC(O)=C2N=CN(C(=O)C=C(O)C#CO)C2=N1 Intermediate Fragment 
322 336.1091157281 C=CC(C)=C=C=C=[NH+]C1=NC(O)=C2N=CN(C3C=C(O)C(=C)O3)C2=N1
323 108.0807757401 CCC(C)C#CC#[NH+]
324 276.0727302201 C[NH2+]C1=NC(O)=C2N=CN(C3C=C(O)C(=C=O)O3)C2=N1
325 354.1196804121 CCC(C)=C=C=C=[NH+]C1=NC(O)=C2N=CN(CC=C(O)C(=O)C=O)C2=N1 Intermediate Fragment 
326 344.1353304761 CC(C)CCC=[NH+]C1=NC(O)=C2N=CN(C3C=C(O)C(=C=O)O3)C2=N1
327 230.1036364241 CC(C)CC=C=[NH+]C1=NC(=O)C2=NC=NC2=N1
328 101.0597059481 C=[O+]C(C)=COC
329 69.0334912001 C=[O+]C#CC
330 103.0753560121 COC=C(C)[OH+]C
331 59.0491412641 C=C[OH+]C
332 105.0910060761 COCC(C)[OH+]C
333 216.0879863601 CCC=C=C=[NH+]C1=NC(O)=C2N=CNC2=N1
334 113.0597059481 C#CC(=COC)[OH+]C
335 444.1877599721 COCCCC(CC=C=[NH+]C1=NC(O)=C2N=CN(C3C=C(O)C(=C=O)O3)C2=N1)CCOC Intermediate Fragment 
336 386.1458951601 COCCCCCC=C=[NH+]C1=NC(O)=C2N=CN(C3C=C(O)C(=C=O)O3)C2=N1
337 340.1040303481 CCCC=C=C=[NH+]C1=NC(O)=C2N=CN(C3C=C(O)C(=C=O)O3)C2=N1
338 388.1615452241 COCCCCCCC=[NH+]C1=NC(O)=C2N=CN(C3C=C(O)C(=C=O)O3)C2=N1
339 390.1771952881 COCCCCCCC[NH2+]C1=NC(O)=C2N=CN(C3C=C(O)C(=C=O)O3)C2=N1
340 400.1615452241 CCC(CC=C=[NH+]C1=NC(O)=C2N=CN(C3C=C(O)C(=C=O)O3)C2=N1)CCOC
341 398.1458951601 CCC(C=C=C=[NH+]C1=NC(O)=C2N=CN(C3C=C(O)C(=C=O)O3)C2=N1)CCOC
342 390.1771952881 COCCC(C)CCC[NH2+]C1=NC(O)=C2N=CN(C3C=C(O)C(=C=O)O3)C2=N1
343 388.1615452241 COCCC(C)CCC=[NH+]C1=NC(O)=C2N=CN(C3C=C(O)C(=C=O)O3)C2=N1
344 388.1615452241 COCCC(C)CCC=[NH+]C1=NC(O)=C2N=CN(C(=O)C=C(O)C#CO)C2=N1 Intermediate Fragment 
345 386.1458951601 COCCC(C)CC=C=[NH+]C1=NC(O)=C2N=CN(C3C=C(O)C(=C=O)O3)C2=N1
346 384.1302450961 COCCC(C)C=C=C=[NH+]C1=NC(O)=C2N=CN(C3C=C(O)C(=C=O)O3)C2=N1
347 43.0178411361 C#C[OH2+]
348 374.1458951601 COCCCCCC=[NH+]C1=NC(O)=C2N=CN(C3C=C(O)C(=C=O)O3)C2=N1
349 372.1302450961 COCCCCC=C=[NH+]C1=NC(O)=C2N=CN(C3C=C(O)C(=C=O)O3)C2=N1
350 370.1145950321 COCCCC=C=C=[NH+]C1=NC(O)=C2N=CN(C3C=C(O)C(=C=O)O3)C2=N1
351 71.0491412641 CC#C[OH+]C
352 39.0229265161 [C+]#CC
353 444.1877599721 CCC(CC=C=[NH+]C1=NC(O)=C2N=CN(C3C=C(O)C(=C=O)O3)C2=N1)CC(COC)OC Intermediate Fragment 
354 444.1877599721 COC(C)C(CC(C)CC=C=[NH+]C1=NC(O)=C2N=CN(C3C=C(O)C(=C=O)O3)C2=N1)OC Intermediate Fragment 
355 444.1877599721 CCC(OC)C(CCCC=C=[NH+]C1=NC(O)=C2N=CN(C3C=C(O)C(=C=O)O3)C2=N1)OC Intermediate Fragment 
356 332.1353304761 CCCCC[NH2+]C1=NC(O)=C2N=CN(C3C=C(O)C(=C=O)O3)C2=N1
357 414.1408097801 COCC(CCC=C=C=[NH+]C1=NC(O)=C2N=CN(C3C=C(O)C(=C=O)O3)C2=N1)OC
358 302.1247657921 COCC(CC=C=C=C=[NH+]C1=NC(O)=C2N=CNC2=N1)OC
359 416.1564598441 COCC(CCCC=C=[NH+]C1=NC(O)=C2N=CN(C3C=C(O)C(=C=O)O3)C2=N1)OC
360 418.1721099081 COCC(CCCCC=[NH+]C1=NC(O)=C2N=CN(C3C=C(O)C(=C=O)O3)C2=N1)OC
361 444.1877599721 COC(C)C(CCCCC=C=[NH+]C1=NC(O)=C2N=CN(C3C=C(O)C(=C=O)O3)C2=N1)OC Intermediate Fragment 
362 344.1353304761 CCCCCC=[NH+]C1=NC(O)=C2N=CN(C3C=C(O)C(=C=O)O3)C2=N1
363 342.1196804121 CCCCC=C=[NH+]C1=NC(O)=C2N=CN(C3C=C(O)C(=C=O)O3)C2=N1
364 230.1036364241 CCCC=C=C=[NH+]C1=NC(O)=C2N=CNC2=N1
