#In-silico ESI-MS/MS [M+H]+ Spectra
#PREDICTED BY CFM-ID 4.0.8
#SMILES=[nH]1c(nc2c(c1=O)[n+](cn2C1O[C@H](CO)C(C1)O)[C@H]1C(C2C(O1)Oc1c2c2c(c(c1)OC)c(=O)c1c(o2)cccc1O)O)N
#InChiKey=ZTCFHHRYFIHNGN-CNMNQLBFSA-O
energy0
492.11499 44.28 6 60 55 41 53 61 67 16 63 31 65 78 20 70 71 37 76 35 72 75 24 77 26 64 (16.281 0.048888 0.040563 0.031938 0.015622 0.013629 0.011835 0.010011 0.0094883 0.005775 0.0041671 0.0033459 0.0032848 0.0028517 0.0020094 0.0016125 0.0011692 0.001141 0.001129 0.001116 0.0010875 0.00088859 0.00086963 7.914e-05)
494.13064 72.29 79 99 98 94 100 101 104 102 112 90 84 105 95 87 92 88 106 110 108 91 89 111 (23.879 0.68402 0.59314 0.34445 0.23474 0.20887 0.17929 0.17315 0.092472 0.089949 0.086821 0.085246 0.054296 0.038605 0.03649 0.032223 0.029409 0.026831 0.018767 0.016734 0.012081 0.010965)
608.16233 100.00 0 192 231 247 241 210 256 182 225 212 258 191 253 278 276 248 254 281 230 186 188 250 185 275 262 265 259 207 190 251 208 (30.984 2.3895 1.1041 0.52785 0.48969 0.39832 0.26912 0.26016 0.14959 0.096242 0.086146 0.070152 0.059206 0.052309 0.04689 0.045391 0.041204 0.034903 0.034242 0.027333 0.022824 0.011185 0.0098425 0.0095911 0.009485 0.0056696 0.005352 0.0051525 0.0018653 0.0018079 0.00067283)
energy1
150.04104 8.95 10 (2.7285)
152.05669 100.00 5 (30.49)
341.06558 20.65 8 (6.2956)
492.11499 80.42 6 55 60 41 63 16 53 20 26 35 37 61 72 78 31 67 77 24 75 71 76 70 65 64 (20.355 1.0745 1.0026 0.42158 0.30651 0.25416 0.22043 0.19607 0.11844 0.10267 0.084639 0.069054 0.060494 0.057652 0.054359 0.048241 0.02975 0.022727 0.0172 0.013661 0.0037467 0.0028824 0.0018373 0.0007242)
494.13064 52.71 79 99 98 84 94 101 95 100 108 87 112 104 91 89 92 90 110 88 106 111 105 102 (10.44 1.3224 1.3076 0.32749 0.31768 0.26002 0.24149 0.22625 0.22203 0.2081 0.1885 0.16197 0.15272 0.14872 0.13676 0.12986 0.11697 0.067793 0.049648 0.027793 0.0099132 0.0077089)
energy2
57.03349 8.01 218 (1.6979)
137.04579 3.95 32 (0.83777)
139.06144 3.91 33 (0.82949)
152.05669 100.00 5 (21.203)
154.07234 4.30 11 (0.9122)
164.05669 12.79 52 (2.711)
166.07234 5.52 51 (1.1708)
180.05160 5.00 45 166 (0.84491 0.21613)
194.06725 5.93 152 (1.2583)
196.08290 8.94 153 54 (1.3645 0.53022)
208.08290 11.38 148 (2.4126)
210.06217 4.95 58 (1.05)
224.07782 7.44 157 (1.5776)
250.09347 13.26 147 141 140 138 (1.5931 0.63945 0.29269 0.28625)
252.10912 7.26 196 170 121 127 (0.65409 0.38923 0.38897 0.10651)
295.06010 4.46 232 (0.94466)
313.07066 6.87 47 (1.4562)
315.08631 5.95 48 (1.261)
341.06558 6.62 8 (1.4031)
343.08123 8.61 7 (1.8246)
366.06083 5.53 36 (1.1716)
438.10442 5.12 273 66 (0.76181 0.32392)
450.09319 5.05 18 (1.0706)
464.12007 4.04 68 42 23 (0.7833 0.055049 0.017668)
475.08844 4.47 40 15 17 (0.67722 0.23079 0.040769)
476.12007 8.31 82 80 107 97 (1.0498 0.28301 0.21883 0.2113)
477.10409 4.88 83 85 93 (0.82479 0.1558 0.054673)
492.11499 43.20 6 41 55 37 35 72 31 65 61 26 53 75 16 20 67 60 24 63 77 76 70 78 64 71 (3.5403 1.4031 0.74544 0.61172 0.3775 0.37605 0.29236 0.22814 0.21173 0.20711 0.20155 0.16169 0.15906 0.1443 0.10295 0.10237 0.061768 0.036909 0.036253 0.035877 0.033574 0.030724 0.030124 0.028606)
494.13064 21.01 79 98 94 108 92 84 95 91 87 110 90 89 102 104 106 100 99 111 88 105 112 101 (1.0447 0.5099 0.37985 0.28778 0.26391 0.24818 0.1881 0.17995 0.15651 0.15518 0.15397 0.14493 0.14328 0.097676 0.087502 0.084237 0.081173 0.071003 0.06395 0.05216 0.041726 0.019053)
590.15177 4.08 240 1 178 179 193 180 260 122 119 125 128 126 123 129 (0.25249 0.2312 0.21556 0.14586 0.0081325 0.0055957 0.0026181 0.0010497 0.00076397 0.00045054 0.00034798 0.00026469 0.00016504 0.00015059)

0 608.1623330721 COC1=CC2=C(C3=C1C(=O)C1=C(C=CC=C1O)O3)C1C(O2)OC([N+]2=CN(C3CC(O)C(CO)O3)C3=C2C(=O)NC(N)=N3)C1O
1 590.1517683881 COC1=CC2=C(C3=C1C(=O)C1C(O)CCCC1O3)C1=C(O2)OC(N2CN(C3C=C(O)C(=C=O)O3)C3=NC([NH3+])=NC=C32)=C1O
2 119.0702706321 OC1CCOC1C[OH2+]
3 117.0546205681 OC1CCOC1=C[OH2+]
4 490.0993388921 COC1=CC2=C(C3=C1C(=O)C1=C(C=CCC1O)O3)C1=C(O2)OC(N2C=NC3=NC([NH3+])=NC(O)=C32)=C1O
5 152.0566862321 [NH3+]C1=NC(=O)C2=NCNC2=N1
6 492.1149889561 COC1=CC2=C(C3=C1C(=O)C1=C(CCCC1O)O3)C1=C(O2)OC(N2C=NC3=NC([NH3+])=NC(O)=C32)=C1O
7 343.0812292401 C[OH+]C1=CC2=C(C3=C1C(=O)C1=C(CCCC1O)O3)C1=C(OC=C1O)O2
8 341.0655791761 C[OH+]C1=CC2=C(C3=C1C(=O)C1=C(C=CCC1O)O3)C1=C(OC=C1O)O2
9 339.0499291121 C[OH+]C1=CC2=C(C3=C1C(=O)C1=C(C=CC=C1O)O3)C1=C(OC=C1O)O2
10 150.0410361681 [NH3+]C1=NC(=O)C2=NC=NC2=N1
11 154.0723362961 [NH3+]C1=NC(=O)C2NCNC2=N1
12 476.0836888281 [NH3+]C1=NC(O)=C2C(=N1)N=CN2C1=C(O)C2=C(OC3=C2C2=C(C(=O)C4=C(C=CCC4O)O2)C(O)=C3)O1
13 474.1044242721 COC1=CC2=C(C3=C1C(=O)C1=C(C=CCC1)O3)C1=C(O2)OC(N2C=NC3=NC([NH3+])=NC(O)=C32)=C1O
14 474.1044242721 COC1=CC2=C(C3=C(OC(N4C=NC5=NC([NH3+])=NC(O)=C54)=C3)O2)C2=C1C(=O)C1=C(C=CCC1O)O2
15 475.0884398601 COC1=CC2=C(C3=C1C(=O)C1=C(C=CCC1O)O3)C1=C(O2)OC(N2C=NC3=NC=NC([OH2+])=C32)=C1O
16 492.1149889561 COC1=CC2=C(C3=C1C(=O)C1=C(CCCC1O)O3)C1=C(O2)OC(N2C=NC(=NC(=N)[NH3+])C2=C=O)=C1O Intermediate Fragment 
17 475.0884398601 COC1=CC2=C(C3=C1C(=O)C1=C(C=CC=C1O)O3)C1=C(O2)OC(N2C=NC([NH+]=CN)=C2C=O)=C1O
18 450.0931908921 COC1=CC2=C(C3=C1C(=O)C1=C(CCCC1O)O3)C1=C(O2)OC(N2C=NC(=[NH2+])C2=C=O)=C1O
19 433.0666417961 COC1=CC2=C(C3=C1C(=O)C1=C(C=CC=C1O)O3)C1=C(O2)OC(N2C=NC=C2C=[OH+])=C1O
20 492.1149889561 COC1=CC2=C(C3=C1C(=O)C1=C(C=CCC1O)O3)C1=C(O2)OC(N2C=NC(=NC([NH3+])=NC=O)C2)=C1O Intermediate Fragment 
21 449.1091753041 COC1=CC2=C(C3=C1C(=O)C1=C(C=CCC1O)O3)C1=C(O2)OC(N2C=NC([NH+]=CN)=C2)=C1O
22 447.0935252401 COC1=CC2=C(C3=C1C(=O)C1=C(C=CC=C1O)O3)C1=C(O2)OC(N2C=NC([NH+]=CN)=C2)=C1O
23 464.1200743361 COC1=CC2=C(C3=C1C(=O)C1=C(C=CCC1O)O3)C1=C(O2)OC(N2C=NC(=NC(N)=[NH2+])C2)=C1O
24 492.1149889561 COC1=CC2=C(C3=C1C(=O)C1=C(C=CCC1O)O3)C1=C(O2)OC(N2C=NC=C2C(=O)N=C(N)[NH3+])=C1O Intermediate Fragment 
25 407.0873772401 C[OH+]C1=CC2=C(C3=C1C(=O)C1=C(C=CCC1O)O3)C1=C(O2)OC(N2C=CN=C2)=C1O
26 492.1149889561 COC1=CC2=C(C3=C1C(=O)C1=C(C=CCC1O)O3)C1=C(O2)OC(N2C=NC(=N)C2=C(O)N=C[NH3+])=C1O Intermediate Fragment 
27 465.1040899241 COC1=CC2=C(C3=C1C(=O)C1=C(C=CCC1O)O3)C1=C(O2)OC(N2C=NC(=N)C2=C([NH3+])O)=C1O
28 422.0982762721 COC1=CC2=C(C3=C1C(=O)C1=C(C=CCC1O)O3)C1=C(O2)OC(N2C=NC(=[NH2+])C2)=C1O
29 446.0618907641 COC1=CC2=C(C3=C1C(=O)C1=C(C=CC=C1O)O3)C1=C(O2)OC(N2C=NC(=[NH2+])C2=C=O)=C1O
30 448.0775408281 COC1=CC2=C(C3=C1C(=O)C1=C(C=CCC1O)O3)C1=C(O2)OC(N2C=NC(=[NH2+])C2=C=O)=C1O
31 492.1149889561 C=NC1=NC([NH3+])=NC(O)=C1N=C1OC2OC3=C(C4=C(C(=O)C5=C(C=CCC5O)O4)C(OC)=C3)C2=C1O Intermediate Fragment 
32 137.0457872001 C#[N+]C1=NC(N)=NC(O)=C1
33 139.0614372641 C=[NH+]C1=NC(N)=NC(O)=C1
34 465.1040899241 COC1=CC2=C(C3=C1C(=O)C1=C(C=CCC1O)O3)C1=C(O)C(=[NH+]C3=C(O)N=C(N)N=C3)OC1O2
35 492.1149889561 COC1=CC2=C(C3=C1C(=O)C1=C(CCCC1O)O3)C1=C(O2)OC(N=C=NC2=NC([NH3+])=NC(O)=C2)=C1O Intermediate Fragment 
36 366.0608281441 C=[NH+]C1=C(O)C2=C(OC3=C2C2=C(C(=O)C4=C(C=CC=C4O)O2)C(OC)=C3)O1
37 492.1149889561 COC1=CC2=C(C3=C1C(=O)C1=C(C=CC=C1O)O3)C1=C(O2)OC(N(C)C2=C(O)N=C([NH3+])N=C2N)=C1O Intermediate Fragment 
38 127.0614372641 NC1=NC(O)=CC([NH3+])=N1
39 129.0770873281 NC1=NC(O)CC([NH3+])=N1
40 475.0884398601 C=[N+](C1=C(O)N=C(N)N=C1)C1=C(O)C2=C(OC3=C2C2=C(C(=O)C4=C(C=CC=C4O)O2)C(OC)=C3)O1
41 492.1149889561 COC1=CC2=C(C(=CO)C(OCN3C=NC4=NC([NH3+])=NC(O)=C43)O2)C2=C1C(=O)C1=C(C=CC=C1O)O2 Intermediate Fragment 
42 464.1200743361 COC1=CC2=C(C=C(OCN3C=NC4=NC([NH3+])=NC(O)=C43)O2)C2=C1C(=O)C1=C(C=CCC1O)O2
43 462.1044242721 COC1=CC2=C(C=C(OCN3C=NC4=NC([NH3+])=NC(O)=C43)O2)C2=C1C(=O)C1=C(C=CC=C1O)O2
44 182.0672509161 [NH3+]C1=NC(O)=C2C(=N1)N=CN2CO
45 180.0516008521 [NH3+]C1=NC(O)=C2C(=N1)N=CN2C=O
46 311.0550144921 C[OH+]C1=CC2=C(C(=C=O)CO2)C2=C1C(=O)C1=C(C=CC=C1O)O2
47 313.0706645561 C[OH+]C1=CC2=C(C(=CO)CO2)C2=C1C(=O)C1=C(C=CC=C1O)O2
48 315.0863146201 C[OH+]C1=CC2=C(C(=CO)CO2)C2=C1C(=O)C1=C(C=CCC1O)O2
49 170.1036364241 CN1CNC2=NC([NH3+])=NC(O)C21
50 168.0879863601 CN1CNC2=NC([NH3+])=NC(O)=C21
51 166.0723362961 CN1C=NC2=NC([NH3+])=NC(O)=C21
52 164.0566862321 [CH2+]N1C=NC2=NC(N)=NC(O)=C21
53 492.1149889561 COC1=CC2=C(C3=C1C(=O)C1=C(C=CCC1O)O3)C(C(O)=CN1C=NC3=NC([NH3+])=NC(O)=C31)=C(O)O2 Intermediate Fragment 
54 196.0829009801 [NH3+]C1=NC(O)=C2C(=N1)N=CN2CCO
55 492.1149889561 COC1=CC2=C(C(C(O)=C(O)N3C=NC4=NC([NH3+])=NC(O)=C43)=CO2)C2=C1C(=O)C1=C(C=CCC1O)O2 Intermediate Fragment 
56 178.0359507881 NC1=NC(O)=C2C(=N1)N=CN2C#[O+]
57 208.0465154721 [NH3+]C1=NC(O)=C2C(=N1)N=CN2C(=O)C=O
58 210.0621655361 [NH3+]C1=NC(O)=C2C(=N1)N=CN2C(O)C=O
59 212.0778156001 [NH3+]C1=NC(O)=C2C(=N1)N=CN2C(O)CO
60 492.1149889561 COC1=CC2=C(C=C(OC(=CO)N3C=NC4=NC([NH3+])=NC(O)=C43)O2)C2=C1C(=O)C1=C(C=CCC1O)O2 Intermediate Fragment 
61 492.1149889561 COC1=C2C(=O)C3=C(C=CCC3O)OC2=C(C2=COC(N3C=NC4=NC([NH3+])=NC(O)=C43)=C2O)C(=O)C1 Intermediate Fragment 
62 257.0444498081 C=[O+]C1=C2C(=O)C3=C(C=CC=C3O)OC2=CC(=O)C1
63 492.1149889561 COC1=CC(OC2=CC(O)=C(N3C=NC4=NC([NH3+])=NC(O)=C43)O2)=CC2=C1C(=O)C1=C(C=CCC1O)O2 Intermediate Fragment 
64 492.1149889561 C=C(OC)C1=C(C2=COC3=C2C(O)=C(N2C=NC4=NC([NH3+])=NC(O)=C42)O3)OC2=C(C1=O)C(O)CC=C2 Intermediate Fragment 
65 492.1149889561 COC=CC1=C(C2=CC(=O)C3=C(C=CCC3O)O2)C2=C(O1)OC(N1C=NC3=NC([NH3+])=NC(O)=C31)=C2O Intermediate Fragment 
66 438.1044242721 [NH3+]C1=NC(O)=C2C(=N1)N=CN2C1=C(O)C2=C(OC=C2C2=CC(=O)C3=C(CCCC3O)O2)O1
67 492.1149889561 COC1=CC2=C(C(OC3=CC(O)CC=C3)=C1C=O)C1=C(O2)OC(N2C=NC3=NC([NH3+])=NC(O)=C32)=C1O Intermediate Fragment 
68 464.1200743361 COC1=CC2=C(C(OC3=CC(O)CC=C3)=C1)C1=C(O2)OC(N2C=NC3=NC([NH3+])=NC(O)=C32)=C1O
69 382.0782095241 COC1=CC2=C(C=C1C=O)C1=C(O2)OC(N2C=NC3=NC([NH3+])=NC(O)=C32)=C1O
70 492.1149889561 COC1=CC2=C(C(O)=C1C(=O)C1=CC=CCC1O)C1=C(O2)OC(N2C=NC3=NC([NH3+])=NC(O)=C32)=C1O Intermediate Fragment 
71 492.1149889561 COC1=CC2=C(C=C1C(=O)C1=C(O)C=CCC1O)C1=C(O2)OC(N2C=NC3=NC([NH3+])=NC(O)=C32)=C1O Intermediate Fragment 
72 492.1149889561 COC1=CC2=C(C(OC3=CCCC(O)C3=C=O)=C1)C1=C(O2)OC(N2C=NC3=NC([NH3+])=NC(O)=C32)=C1O Intermediate Fragment 
73 462.1044242721 COC1=CC2=C(C(OC3=CC(O)=CC=C3)=C1)C1=C(O2)OC(N2C=NC3=NC([NH3+])=NC(O)=C32)=C1O
74 356.0989449681 COC1C=CC2=C(C1)OC1=C2C(O)=C(N2C=NC3=NC([NH3+])=NC(O)=C32)O1
75 492.1149889561 C=CC(O)C1=C(C)OC2=C(C1=O)C(OC)=CC1=C2C2=C(O1)OC(N1C=NC3=NC([NH3+])=NC(O)=C31)=C2O Intermediate Fragment 
76 492.1149889561 C=CC1=C(C(C)O)C(=O)C2=C(O1)C1=C(C=C2OC)OC2=C1C(O)=C(N1C=NC3=NC([NH3+])=NC(O)=C31)O2 Intermediate Fragment 
77 492.1149889561 COC1=CC2=C(C3=C1C(=O)C=C(C=CCCO)O3)C1=C(O2)OC(N2C=NC3=NC([NH3+])=NC(O)=C32)=C1O Intermediate Fragment 
78 492.1149889561 C=CCC(O)C1=COC2=C(C1=O)C(OC)=CC1=C2C2=C(O1)OC(N1C=NC3=NC([NH3+])=NC(O)=C31)=C2O Intermediate Fragment 
79 494.1306390201 COC1=CC2=C(C3=C1C(=O)C1C(O)CCCC1O3)C1=C(O2)OC(N2C=NC3=NC([NH3+])=NC(O)=C32)=C1O
80 476.1200743361 COC1=CC2=C(C3=C1C(=O)C1=C(CCCC1O)O3)C1=C(O2)OC(N2C=NC3=NC([NH3+])=NC=C32)=C1O
81 478.0993388921 [NH3+]C1=NC(O)=C2C(=N1)N=CN2C1=C(O)C2=C(OC3=C2C2=C(C(=O)C4=C(CCCC4O)O2)C(O)=C3)O1
82 476.1200743361 COC1=CC2=C(C3=C(OC(N4C=NC5=NC([NH3+])=NC(O)=C54)=C3)O2)C2=C1C(=O)C1=C(CCCC1O)O2
83 477.1040899241 COC1=CC2=C(C3=C1C(=O)C1=C(CCCC1O)O3)C1=C(O2)OC(N2C=NC3=NC=NC([OH2+])=C32)=C1O
84 494.1306390201 COC1=CC2=C(C3=C1C(=O)C1C(O)CCCC1O3)C1=C(O2)OC(N2C=NC(=NC(=N)[NH3+])C2=C=O)=C1O Intermediate Fragment 
85 477.1040899241 COC1=CC2=C(C3=C1C(=O)C1=C(C=CCC1O)O3)C1=C(O2)OC(N2C=NC([NH+]=CN)=C2C=O)=C1O
86 435.0822918601 COC1=CC2=C(C3=C1C(=O)C1=C(C=CCC1O)O3)C1=C(O2)OC(N2C=NC=C2C=[OH+])=C1O
87 494.1306390201 COC1=CC2=C(C3=C1C(=O)C1=C(CCCC1O)O3)C1=C(O2)OC(N2C=NC(=NC([NH3+])=NC=O)C2)=C1O Intermediate Fragment 
88 494.1306390201 COC1=CC2=C(C3=C1C(=O)C1=C(CCCC1O)O3)C1=C(O2)OC(N2C=NC=C2C(=O)N=C(N)[NH3+])=C1O Intermediate Fragment 
89 494.1306390201 COC1=CC2=C(C3=C1C(=O)C1=C(CCCC1O)O3)C1=C(O2)OC(N2C=NC(=N)C2=C(O)N=C[NH3+])=C1O Intermediate Fragment 
90 494.1306390201 C=NC1=NC([NH3+])=NC(O)=C1N=C1OC2OC3=C(C4=C(C(=O)C5=C(CCCC5O)O4)C(OC)=C3)C2=C1O Intermediate Fragment 
91 494.1306390201 COC1=CC2=C(C3=C1C(=O)C1C(O)CCCC1O3)C1=C(O2)OC(N=C=NC2=NC([NH3+])=NC(O)=C2)=C1O Intermediate Fragment 
92 494.1306390201 COC1=CC2=C(C3=C1C(=O)C1=C(C=CCC1O)O3)C1=C(O2)OC(N(C)C2=C(O)N=C([NH3+])N=C2N)=C1O Intermediate Fragment 
93 477.1040899241 COC1=CC2=C(C3=C1C(=O)C1=C(C=CC=C1O)O3)C1=C(O2)OC([NH+](C)C2=C(O)N=C(N)N=C2)=C1O
94 494.1306390201 COC1=CC2=C(C(=CO)C(OCN3C=NC4=NC([NH3+])=NC(O)=C43)O2)C2=C1C(=O)C1=C(C=CCC1O)O2 Intermediate Fragment 
95 494.1306390201 COC1=CC2=C(C3=C1C(=O)C1=C(CCCC1O)O3)C(C(O)=CN1C=NC3=NC([NH3+])=NC(O)=C31)=C(O)O2 Intermediate Fragment 
96 329.0655791761 COC1=CC2=C(C(=CO)C(=[OH+])O2)C2=C1C(=O)C1=C(C=CCC1O)O2
97 476.1200743361 COC1=CC2=C(C(C(O)=CN3C=NC4=NC([NH3+])=NC(O)=C43)=CO2)C2=C1C(=O)C1=C(C=CCC1O)O2
98 494.1306390201 COC1=CC2=C(C(C(O)=C(O)N3C=NC4=NC([NH3+])=NC(O)=C43)=CO2)C2=C1C(=O)C1=C(CCCC1O)O2 Intermediate Fragment 
99 494.1306390201 COC1=CC2=C(C=C(OC(=CO)N3C=NC4=NC([NH3+])=NC(O)=C43)O2)C2=C1C(=O)C1=C(CCCC1O)O2 Intermediate Fragment 
100 494.1306390201 COC1=C2C(=O)C3=C(CCCC3O)OC2=C(C2=COC(N3C=NC4=NC([NH3+])=NC(O)=C43)=C2O)C(=O)C1 Intermediate Fragment 
101 494.1306390201 COC1=CC(OC2=CC(O)=C(N3C=NC4=NC([NH3+])=NC(O)=C43)O2)=CC2=C1C(=O)C1=C(CCCC1O)O2 Intermediate Fragment 
102 494.1306390201 COC=CC1=C(C2=CC(=O)C3=C(CCCC3O)O2)C2=C(O1)OC(N1C=NC3=NC([NH3+])=NC(O)=C31)=C2O Intermediate Fragment 
103 450.1044242721 CC1=C(C2=CC(=O)C3=C(C=CCC3O)O2)C2=C(O1)OC(N1C=NC3=NC([NH3+])=NC(O)=C31)=C2O
104 494.1306390201 COC1=CC2=C(C(OC3=CC(O)CCC3)=C1C=O)C1=C(O2)OC(N2C=NC3=NC([NH3+])=NC(O)=C32)=C1O Intermediate Fragment 
105 494.1306390201 COC1=CC2=C(C(O)=C1C(=O)C1=CCCCC1O)C1=C(O2)OC(N2C=NC3=NC([NH3+])=NC(O)=C32)=C1O Intermediate Fragment 
106 494.1306390201 COC1=CC2=C(C=C1C(=O)C1=C(O)CCCC1O)C1=C(O2)OC(N2C=NC3=NC([NH3+])=NC(O)=C32)=C1O Intermediate Fragment 
107 476.1200743361 COC1=CC2=C(C=C1C(=O)C1=CC=CCC1O)C1=C(O2)OC(N2C=NC3=NC([NH3+])=NC(O)=C32)=C1O
108 494.1306390201 COC1=CC2=C(C(OC3CCCC(O)C3=C=O)=C1)C1=C(O2)OC(N2C=NC3=NC([NH3+])=NC(O)=C32)=C1O Intermediate Fragment 
109 466.1357244001 COC1=CC2=C(C(OC3=CC(O)CCC3)=C1)C1=C(O2)OC(N2C=NC3=NC([NH3+])=NC(O)=C32)=C1O
110 494.1306390201 CCC(O)C1=C(C)OC2=C(C1=O)C(OC)=CC1=C2C2=C(O1)OC(N1C=NC3=NC([NH3+])=NC(O)=C31)=C2O Intermediate Fragment 
111 494.1306390201 CCC1=C(C(C)O)C(=O)C2=C(O1)C1=C(C=C2OC)OC2=C1C(O)=C(N1C=NC3=NC([NH3+])=NC(O)=C31)O2 Intermediate Fragment 
112 494.1306390201 CCCC(O)C1=COC2=C(C1=O)C(OC)=CC1=C2C2=C(O1)OC(N1C=NC3=NC([NH3+])=NC(O)=C31)=C2O Intermediate Fragment 
113 496.1462890841 COC1=CC2=C(C3=C1C(O)C1C(O)CCCC1O3)C1=C(O2)OC(N2C=NC3=NC([NH3+])=NC(O)=C32)=C1O
114 498.1619391481 COC1CC2=C(C3=C1C(O)C1C(O)CCCC1O3)C1=C(O2)OC(N2C=NC3=NC([NH3+])=NC(O)=C32)=C1O
115 576.1361183241 COC1=CC2=C(C3=C1C(=O)C1=C(C=CCC1O)O3)C1=C(O2)OC(N2CN(C3CC(O)=CO3)C3=NC([NH3+])=NC(O)=C32)=C1O
116 578.1517683881 COC1=CC2=C(C3=C1C(=O)C1=C(CCCC1O)O3)C1=C(O2)OC(N2CN(C3CC(O)=CO3)C3=NC([NH3+])=NC(O)=C32)=C1O
117 578.1517683881 COC1=CC2=C(C3=C1C(=O)C1=C(CCCC1O)O3)C1=C(O2)OC(N2CN(CCC(O)=C=O)C3=NC([NH3+])=NC(O)=C32)=C1O Intermediate Fragment 
118 580.1674184521 COC1=CC2=C(C3=C1C(=O)C1C(O)CCCC1O3)C1=C(O2)OC(N2CN(C3CC(O)=CO3)C3=NC([NH3+])=NC(O)=C32)=C1O
119 590.1517683881 C=C1OC(N2CN(C3=C(O)C4=C(OC5=C4C4=C(C(=O)C6=C(CCCC6O)O4)C(OC)=C5)O3)C3=C(O)N=C([NH3+])N=C32)C=C1O
120 572.1412037041 C=C1C=CC(N2CN(C3=C(O)C4=C(OC5=C4C4=C(C(=O)C6=C(C=CCC6O)O4)C(OC)=C5)O3)C3=C(O)N=C([NH3+])N=C32)O1
121 252.1091157281 CC1OC(N2C=NC3=C(O)N=C([NH3+])N=C32)CC1O
122 590.1517683881 COC1=CC2=C(C3=C1C(=O)C1=C(C=CCC1O)O3)C1=C(O2)OC(N2CN(CC=C(O)C(C)=O)C3=NC([NH3+])=NC(O)=C32)=C1O Intermediate Fragment 
123 590.1517683881 C#COC(C=C=O)N1CN(C2=C(O)C3=C(OC4=C3C3=C(C(=O)C5C(O)CCCC5O3)C(OC)=C4)O2)C2=C(O)N=C([NH3+])N=C21 Intermediate Fragment 
124 548.1412037041 COC1=CC2=C(C3=C1C(=O)C1=C(CCCC1O)O3)C1=C(O2)OC(N2CN(CC#CO)C3=NC([NH3+])=NC(O)=C32)=C1O
125 590.1517683881 C=C1OC(N2CN(C(O)=C(O)C3=COC4=C3C3=C(C(=O)C5=C(C=CCC5O)O3)C(OC)=C4)C3=C(O)N=C([NH3+])N=C32)C=C1O Intermediate Fragment 
126 590.1517683881 COC1=CC2=C(C3=C1C(=O)C1C(O)CCCC1O3)C1=C(O2)OC(N2CN(C3C=CC(=C=O)O3)C3=NC([NH3+])=NC(O)=C32)=C1O
127 252.1091157281 [NH3+]C1=NC(O)=C2N=CN(C3CCC(CO)O3)C2=N1
128 590.1517683881 COC1=CC2=C(C3=C1C(=O)C1=C(CCCC1O)O3)C1=C(O2)OC(N2CN(CC=CC(=O)C=O)C3=NC([NH3+])=NC(O)=C32)=C1O Intermediate Fragment 
129 590.1517683881 COC1=CC2=C(C(C(O)=C(O)N3CN(C4C=CC(=C=O)O4)C4=NC([NH3+])=NC(O)=C43)=CO2)C2=C1C(=O)C1=C(CCCC1O)O2 Intermediate Fragment 
130 337.0342790481 C=[O+]C1=CC2=C(C3=C1C(=O)C1=C(C=CC=C1O)O3)C1=C(OC=C1O)O2
131 260.0414300921 [NH3+]C1=NC(O)=C2N=CN(C3=CC(=O)C(=C=O)O3)C2=N1
132 262.0570801561 [NH3+]C1=NC(O)=C2N=CN(C3CC(=O)C(=C=O)O3)C2=N1
133 264.0727302201 [NH3+]C1=NC(O)=C2N=CN(C3CC(O)C(=C=O)O3)C2=N1
134 266.0883802841 [NH3+]C1=NC(O)=C2N=CN(C3CC(O)C(=CO)O3)C2=N1
135 248.0778156001 C=C1OC(N2C=NC3=C(O)N=C([NH3+])N=C32)C=C1O
136 266.0883802841 [NH3+]C1=NC(O)=C2N=CN(CCC(O)C(=O)C=O)C2=N1 Intermediate Fragment 
137 268.1040303481 [NH3+]C1=NC(O)=C2N=CN(C3CC(O)C(CO)O3)C2=N1
138 250.0934656641 [NH3+]C1=NC=C2N=CN(C3CC(O)C(=CO)O3)C2=N1
139 158.1036364241 [NH3+]C1=NC(O)C2NCNC2N1
140 250.0934656641 C=C1OC(N2C=NC3=C(O)N=C([NH3+])N=C32)CC1O
141 250.0934656641 [NH3+]C1=NC(O)=C2N=CN(C3CCC(=CO)O3)C2=N1
142 268.1040303481 N=C([NH3+])N=C1C(=C=O)N=CN1C1CC(O)C(CO)O1 Intermediate Fragment 
143 268.1040303481 [NH3+]C(=NC=O)N=C1C=NCN1C1CC(O)C(=CO)O1 Intermediate Fragment 
144 268.1040303481 N=CN(C1=NC([NH3+])=NC(O)=C1)C1CC(O)C(=CO)O1 Intermediate Fragment 
145 268.1040303481 C=NC1=C(O)N=C([NH3+])N=C1N=C1CC(O)C(CO)O1 Intermediate Fragment 
146 268.1040303481 [NH3+]C1=NC(O)=C2N=CN(CCC(O)C(=O)CO)C2=N1 Intermediate Fragment 
147 250.0934656641 [NH3+]C1=NC(O)=C2N=CN(CCC(O)C#CO)C2=N1
148 208.0829009801 [NH3+]C1=NC(O)=C2N=CN(CC=CO)C2=N1
149 206.0672509161 [NH3+]C1=NC(O)=C2N=CN(CC#CO)C2=N1
150 180.0879863601 CCN1C=NC2=C(O)N=C([NH3+])N=C21
151 268.1040303481 CC(OC(=CO)CO)N1C=NC2=C(O)N=C([NH3+])N=C21 Intermediate Fragment 
152 194.0672509161 CC(=O)N1C=NC2=C(O)N=C([NH3+])N=C21
153 196.0829009801 CC(O)N1C=NC2=C(O)N=C([NH3+])N=C21
154 268.1040303481 [NH3+]C1=NC(O)=C2N=CN(C(CCO)OC=CO)C2=N1 Intermediate Fragment 
155 210.0985510441 [NH3+]C1=NC(O)=C2N=CN(CCCO)C2=N1
156 212.1142011081 [NH3+]C1=NC(O)=C2NCN(CCCO)C2=N1
157 224.0778156001 [NH3+]C1=NC(O)=C2N=CN(C(=O)CCO)C2=N1
158 226.0934656641 [NH3+]C1=NC(O)=C2N=CN(C(O)CCO)C2=N1
159 268.1040303481 [NH3+]C1=NC(O)=C2N=CN(C(=O)CC(O)CCO)C2=N1 Intermediate Fragment 
160 222.0621655361 [NH3+]C1=NC(O)=C2N=CN(C(=O)C=CO)C2=N1
161 47.0491412641 CC[OH2+]
162 200.1142011081 CC(O)N1CNC2C1=NC([NH3+])=NC2O
163 198.0985510441 CC(O)N1CNC2=C(O)N=C([NH3+])N=C21
164 73.0284058201 OCC#C[OH2+]
165 75.0440558841 OCC=C[OH2+]
166 180.0516008521 [NH3+]C1=NC(O)=C2N=CN(C=O)C2=N1
167 89.0597059481 CC(O)C=C[OH2+]
168 266.0883802841 [NH3+]C1=NC(O)=C2N=CN(C(=O)CC(O)C=CO)C2=N1
169 270.1196804121 [NH3+]C1=NC(O)=C2NCN(C3CC(O)C(CO)O3)C2=N1
170 252.1091157281 [NH3+]C1=NC=C2N=CN(C3CC(O)C(CO)O3)C2=N1
171 270.1196804121 CC(OC(CO)CO)N1C=NC2=C(O)N=C([NH3+])N=C21 Intermediate Fragment 
172 270.1196804121 [NH3+]C1=NC(O)=C2N=CN(C(O)CC(O)CCO)C2=N1 Intermediate Fragment 
173 272.1353304761 [NH3+]C1=NC(O)C2NCN(C3CC(O)C(CO)O3)C2=N1
174 576.1361183241 [NH3+]C1=NC(O)=C2C(=N1)N(C1C=C(O)C(=C=O)O1)CN2C1=C(O)C2=C(OC3=C2C2=C(C=C3)C(=O)C3C(O)CCCC3O2)O1
175 578.1517683881 [NH3+]C1=NC(O)=C2C(=N1)N(C1C=C(O)C(=C=O)O1)CN2C1=C(O)C2=C(OC3=C2C2=C(C=C3)C(O)C3C(O)CCCC3O2)O1
176 580.1674184521 [NH3+]C1=NC(O)=C2C(=N1)N(C1C=C(O)C(=C=O)O1)CN2C1=C(O)C2=C(OC3=C2C2=C(CC3)C(O)C3C(O)CCCC3O2)O1
177 592.1310329441 [NH3+]C1=NC(O)=C2C(=N1)N(C1C=C(O)C(=C=O)O1)CN2C1=C(O)C2=C(OC3=C2C2=C(C(=O)C4C(O)CCCC4O2)C(O)=C3)O1
178 590.1517683881 COC1=CC2=C(C3=C1C=C1C(O)CCCC1O3)C1=C(O2)OC(N2CN(C3C=C(O)C(=C=O)O3)C3=NC([NH3+])=NC(O)=C32)=C1O
179 590.1517683881 COC1=CC2=C(C3=C1C(=O)C1CCCCC1O3)C1=C(O2)OC(N2CN(C3C=C(O)C(=C=O)O3)C3=NC([NH3+])=NC(O)=C32)=C1O
180 590.1517683881 COC1=CC2=C(C3=C(OC(N4CN(C5C=C(O)C(=C=O)O5)C5=NC([NH3+])=NC(O)=C54)=C3)O2)C2=C1C(=O)C1C(O)CCCC1O2
181 591.1357839761 COC1=CC2=C(C3=C1C(=O)C1C(O)CCCC1O3)C1=C(O2)OC(N2CN(C3C=C(O)C(=C=O)O3)C3=NC=NC([OH2+])=C32)=C1O
182 608.1623330721 COC1=CC2=C(C3=C1C(O)C1C(O)CCCC1O3)C1=C(O2)OC(N2CN(C3C=C(O)C(=C=O)O3)C(=NC(=N)[NH3+])C2=C=O)=C1O Intermediate Fragment 
183 566.1405350081 COC1=CC2=C(C3=C1C(O)C1C(O)CCCC1O3)C1=C(O2)OC(N2CN(C3C=C(O)C(=C=O)O3)C(=[NH2+])C2=C=O)=C1O
184 549.1139859121 COC1=CC2=C(C3=C1C(=O)C1=C(CCCC1O)O3)C1=C(O2)OC(N2CN(C3C=C(O)C(=C=O)O3)C=C2C=[OH+])=C1O
185 608.1623330721 COC1=CC2=C(C3=C1C(=O)C1C(O)CCCC1O3)C1=C(O2)OC(N2CC(=NC([NH3+])=NC=O)N(C3C=C(O)C(=C=O)O3)C2)=C1O Intermediate Fragment 
186 608.1623330721 COC1=CC2=C(C3=C1C(=O)C1C(O)CCCC1O3)C1=C(O2)OC(N2CN(C3C=C(O)C(=C=O)O3)C=C2C(=O)N=C(N)[NH3+])=C1O Intermediate Fragment 
187 523.1347213561 COC1=CC2=C(C3=C1C(=O)C1C(O)CCCC1O3)C1=C(O2)OC(N2C=CN(C3C=C(O)C(=C=[OH+])O3)C2)=C1O
188 608.1623330721 COC1=CC2=C(C3=C1C(=O)C1C(O)CCCC1O3)C1=C(O2)OC(N2CN(C3C=C(O)C(=C=O)O3)C(=N)C2=C(O)N=C[NH3+])=C1O Intermediate Fragment 
189 564.1248849441 COC1=CC2=C(C3=C1C(=O)C1C(O)CCCC1O3)C1=C(O2)OC(N2CN(C3C=C(O)C(=C=O)O3)C(=[NH2+])C2=C=O)=C1O
190 608.1623330721 COC1=CC2=C(C3=C1C(O)C1C(O)CCCC1O3)C1=C(O2)OC(N=CN(C2=NC([NH3+])=NC(O)=C2)C2C=C(O)C(=C=O)O2)=C1O Intermediate Fragment 
191 608.1623330721 COC1=CC2=C(C3=C1C(O)C1C(O)CCCC1O3)C1=C(O2)OC(N(C)C2=C(O)N=C([NH3+])N=C2N=C2C=C(O)C(=C=O)O2)=C1O Intermediate Fragment 
192 608.1623330721 COC1=CC2=C(C3=C1C(=O)C1C(O)CCCC1O3)C1=C(O2)OC(N2CN(CC=C(O)C(=O)C=O)C3=NC([NH3+])=NC(O)=C32)=C1O Intermediate Fragment 
193 590.1517683881 COC1=CC2=C(C3=C1C(=O)C1=C(CCCC1O)O3)C1=C(O2)OC(N2CN(CC=C(O)C#CO)C3=NC([NH3+])=NC(O)=C32)=C1O
194 572.1412037041 C#CC(O)=CCN1CN(C2=C(O)C3=C(OC4=C3C3=C(C(=O)C5=C(C=CCC5O)O3)C(OC)=C4)O2)C2=C(O)N=C([NH3+])N=C21
195 572.1412037041 COC1=CC2=C(C3=C1C(=O)C1=C(CCCC1O)O3)C1=C(O2)OC(N2CN(CC#CC#CO)C3=NC([NH3+])=NC(O)=C32)=C1O
196 252.1091157281 [NH3+]C1=NC(O)=C2N=CN(CCC(O)C=CO)C2=N1
197 254.1247657921 [NH3+]C1=NC(O)=C2N=CN(CCC(O)CCO)C2=N1
198 552.1725038321 COC1=CC2=C(C3=C1C(O)C1C(O)CCCC1O3)C1=C(O2)OC(N2CN(CC#CO)C3=NC([NH3+])=NC(O)=C32)=C1O
199 550.1568537681 COC1=CC2=C(C3=C1C(=O)C1C(O)CCCC1O3)C1=C(O2)OC(N2CN(CC#CO)C3=NC([NH3+])=NC(O)=C32)=C1O
200 546.1255536401 COC1=CC2=C(C3=C1C(=O)C1=C(C=CCC1O)O3)C1=C(O2)OC(N2CN(CC#CO)C3=NC([NH3+])=NC(O)=C32)=C1O
201 524.1775892121 CCN1CN(C2=C(O)C3=C(OC4=C3C3=C(C(=O)C5C(O)CCCC5O3)C(OC)=C4)O2)C2=C(O)N=C([NH3+])N=C21
202 522.1619391481 CCN1CN(C2=C(O)C3=C(OC4=C3C3=C(C(=O)C5=C(CCCC5O)O3)C(OC)=C4)O2)C2=C(O)N=C([NH3+])N=C21
203 520.1462890841 CCN1CN(C2=C(O)C3=C(OC4=C3C3=C(C(=O)C5=C(C=CCC5O)O3)C(OC)=C4)O2)C2=C(O)N=C([NH3+])N=C21
204 518.1306390201 CCN1CN(C2=C(O)C3=C(OC4=C3C3=C(C(=O)C5=C(C=CC=C5O)O3)C(OC)=C4)O2)C2=C(O)N=C([NH3+])N=C21
205 516.1149889561 C=CN1CN(C2=C(O)C3=C(OC4=C3C3=C(C(=O)C5=C(C=CC=C5O)O3)C(OC)=C4)O2)C2=C(O)N=C([NH3+])N=C21
206 178.0723362961 C=CN1C=NC2=C(O)N=C([NH3+])N=C21
207 608.1623330721 C=C(O)C(=C=O)OCN1CN(C2=C(O)C3=C(OC4=C3C3=C(C(=O)C5C(O)CCCC5O3)C(OC)=C4)O2)C2=C(O)N=C([NH3+])N=C21 Intermediate Fragment 
208 608.1623330721 COC1=CC2=C(C3=C1C(=O)C1C(O)CCCC1O3)C1=C(O2)OC(N2CN(C(C)OC(=C=O)C=O)C3=NC([NH3+])=NC(O)=C32)=C1O Intermediate Fragment 
209 536.1412037041 COC1=CC2=C(C3=C1C(=O)C1=C(CCCC1O)O3)C1=C(O2)OC(N2CN(C(C)=O)C3=NC([NH3+])=NC(O)=C32)=C1O
210 608.1623330721 COC1=CC2=C(C3=C1C(O)C1C(O)CCCC1O3)C1=C(O2)OC(N2CN(C(C=C=O)OC#CO)C3=NC([NH3+])=NC(O)=C32)=C1O Intermediate Fragment 
211 566.1517683881 COC1=CC2=C(C3=C1C(O)C1C(O)CCCC1O3)C1=C(O2)OC(N2CN(C(=O)C#CO)C3=NC([NH3+])=NC(O)=C32)=C1O
212 608.1623330721 COC1=CC2=C(C3=C1C(O)C1C(O)CCCC1O3)C1=C(O2)OC(N2CN(C(=O)C=C(O)C#CO)C3=NC([NH3+])=NC(O)=C32)=C1O Intermediate Fragment 
213 564.1361183241 COC1=CC2=C(C3=C1C(=O)C1C(O)CCCC1O3)C1=C(O2)OC(N2CN(C(=O)C#CO)C3=NC([NH3+])=NC(O)=C32)=C1O
214 562.1204682601 COC1=CC2=C(C3=C1C(=O)C1=C(CCCC1O)O3)C1=C(O2)OC(N2CN(C(=O)C#CO)C3=NC([NH3+])=NC(O)=C32)=C1O
215 540.1725038321 COC1=CC2=C(C3=C1C(O)C1C(O)CCCC1O3)C1=C(O2)OC(N2CN(C(C)=O)C3=NC([NH3+])=NC(O)=C32)=C1O
216 538.1568537681 COC1=CC2=C(C3=C1C(=O)C1C(O)CCCC1O3)C1=C(O2)OC(N2CN(C(C)=O)C3=NC([NH3+])=NC(O)=C32)=C1O
217 534.1255536401 COC1=CC2=C(C3=C1C(=O)C1=C(C=CCC1O)O3)C1=C(O2)OC(N2CN(C(C)=O)C3=NC([NH3+])=NC(O)=C32)=C1O
218 57.0334912001 C#CC[OH2+]
219 77.0597059481 OCCC[OH2+]
220 59.0491412641 C=CC[OH2+]
221 524.1412037041 COC1=CC2=C(C3=C1C(=O)C1C(O)CCCC1O3)C1=C(O2)OC(N2CN(C=O)C3=NC([NH3+])=NC(O)=C32)=C1O
222 522.1255536401 COC1=CC2=C(C3=C1C(=O)C1=C(CCCC1O)O3)C1=C(O2)OC(N2CN(C=O)C3=NC([NH3+])=NC(O)=C32)=C1O
223 520.1099035761 COC1=CC2=C(C3=C1C(=O)C1=C(C=CCC1O)O3)C1=C(O2)OC(N2CN(C=O)C3=NC([NH3+])=NC(O)=C32)=C1O
224 518.0942535121 COC1=CC2=C(C3=C1C(=O)C1=C(C=CC=C1O)O3)C1=C(O2)OC(N2CN(C=O)C3=NC([NH3+])=NC(O)=C32)=C1O
225 608.1623330721 COC1=CC2=C(C(=CO)C(OCN3CN(C4C=C(O)C(=C=O)O4)C4=NC([NH3+])=NC(O)=C43)O2)C2=C1C(=O)C1=C(CCCC1O)O2 Intermediate Fragment 
226 286.1509805401 CN1CN(C2CC(O)C(CO)O2)C2=NC([NH3+])=NC(O)C21
227 282.1196804121 CN1CN(C2CC(O)C(=CO)O2)C2=NC([NH3+])=NC(O)=C21
228 282.1196804121 CN1CN(C(=O)CC(O)C=CO)C2=NC([NH3+])=NC(O)=C21 Intermediate Fragment 
229 280.1040303481 CN1CN(C2CC(O)C(=C=O)O2)C2=NC([NH3+])=NC(O)=C21
230 608.1623330721 COC1=CC2=C(C3=C1C(=O)C1C(O)CCCC1O3)C(C(O)=CN1CN(C3C=C(O)C(=C=O)O3)C3=NC([NH3+])=NC(O)=C31)=C(O)O2 Intermediate Fragment 
231 608.1623330721 COC1=CC2=C(C(C(O)=C(O)N3CN(C4C=C(O)C(=C=O)O4)C4=NC([NH3+])=NC(O)=C43)=CO2)C2=C1C(=O)C1C(O)CCCC1O2 Intermediate Fragment 
232 295.0600998721 C=[O+]C1=CC2=C(C(=C)CO2)C2=C1C(=O)C1=C(C=CC=C1O)O2
233 298.1145950321 [NH3+]C1=NC(O)=C2C(=N1)N(C1CC(O)C(=CO)O1)CN2CO
234 285.0757499361 C[OH+]C1=CC2=C(C=CO2)C2=C1C(=O)C1=C(C=CCC1O)O2
235 283.0600998721 C[OH+]C1=CC2=C(C=CO2)C2=C1C(=O)C1=C(C=CC=C1O)O2
236 281.0444498081 C=[O+]C1=CC2=C(C=CO2)C2=C1C(=O)C1=C(C=CC=C1O)O2
237 320.0625594601 [NH3+]C1=NC(O)=C2C(=N1)N(C1C=C(O)C(=C=O)O1)CN2C(O)=C=O
238 326.1095096521 [NH3+]C1=NC(O)=C2C(=N1)N(C1CC(O)C(=C=O)O1)CN2C(O)CO
239 328.1251597161 [NH3+]C1=NC(O)=C2C(=N1)N(C1CC(O)C(=CO)O1)CN2C(O)CO
240 590.1517683881 COC1=CC2=C(C(C(O)=CN3CN(C4C=C(O)C(=C=O)O4)C4=NC([NH3+])=NC(O)=C43)=CO2)C2=C1C(=O)C1=C(CCCC1O)O2
241 608.1623330721 COC1=CC2=C(C=C(OC(=CO)N3CN(C4C=C(O)C(=C=O)O4)C4=NC([NH3+])=NC(O)=C43)O2)C2=C1C(=O)C1C(O)CCCC1O2 Intermediate Fragment 
242 580.1674184521 COC1=CC2=C(C=C(OCN3CN(C4C=C(O)C(=C=O)O4)C4=NC([NH3+])=NC(O)=C43)O2)C2=C1C(=O)C1C(O)CCCC1O2
243 312.1302450961 [NH3+]C1=NC(O)=C2C(=N1)N(C1CC(O)C(=CO)O1)CN2CCO
244 310.1145950321 [NH3+]C1=NC(O)=C2C(=N1)N(C1CC(O)C(=C=O)O1)CN2CCO
245 299.0550144921 COC1=CC2=C(C=C([OH2+])O2)C2=C1C(=O)C1=C(C=CC=C1O)O2
246 301.0706645561 COC1=CC2=C(C=C([OH2+])O2)C2=C1C(=O)C1=C(C=CCC1O)O2
247 608.1623330721 COC1=C2C(=O)C3C(O)CCCC3OC2=C(C2=COC(N3CN(C4C=C(O)C(=C=O)O4)C4=NC([NH3+])=NC(O)=C43)=C2O)C(=O)C1 Intermediate Fragment 
248 608.1623330721 COC1=CC(OC2=CC(O)=C(N3CN(C4C=C(O)C(=C=O)O4)C4=NC([NH3+])=NC(O)=C43)O2)=CC2=C1C(=O)C1C(O)CCCC1O2 Intermediate Fragment 
249 352.1251597161 [NH3+]C1=NC(O)=C2C(=N1)N(C1CC(O)C(=C=O)O1)CN2C1OCCC1O
250 608.1623330721 COCC1=C(C2=C(C)OC3=C2C(O)=C(N2CN(C4C=C(O)C(=C=O)O4)C4=NC([NH3+])=NC(O)=C42)O3)OC2=C(C1=O)C(O)CCC2 Intermediate Fragment 
251 608.1623330721 C=C(OC)C1=C(C2=COC3=C2C(O)=C(N2CN(C4C=C(O)C(=C=O)O4)C4=NC([NH3+])=NC(O)=C42)O3)OC2CCCC(O)C2C1=O Intermediate Fragment 
252 550.1204682601 [NH3+]C1=NC(O)=C2C(=N1)N(C1C=C(O)C(=C=O)O1)CN2C1=C(O)C2=C(OC=C2C2=CC(=O)C3=C(CCCC3O)O2)O1
253 608.1623330721 COC(=CC1=CC2=C(O1)OC(N1CN(C3C=C(O)C(=C=O)O3)C3=NC([NH3+])=NC(O)=C31)=C2O)C1=COC2CCCC(O)C2C1=O Intermediate Fragment 
254 608.1623330721 COC=CC1=C(C2=CC(=O)C3C(O)CCCC3O2)C2=C(O1)OC(N1CN(C3C=C(O)C(=C=O)O3)C3=NC([NH3+])=NC(O)=C31)=C2O Intermediate Fragment 
255 552.1361183241 [NH3+]C1=NC(O)=C2C(=N1)N(C1C=C(O)C(=C=O)O1)CN2C1=C(O)C2=C(OC=C2C2=CC(=O)C3C(O)CCCC3O2)O1
256 608.1623330721 COC1=CC2=C(C(OC3CCCC(O)C3)=C1C=O)C1=C(O2)OC(N2CN(C3C=C(O)C(=C=O)O3)C3=NC([NH3+])=NC(O)=C32)=C1O Intermediate Fragment 
257 498.1255536401 COC1CC2=C(C=C1CO)C1=C(O2)OC(N2CN(C3C=C(O)C(=C=O)O3)C3=NC([NH3+])=NC(O)=C32)=C1O
258 608.1623330721 COC1=CC2=C(C(O)=C1C(=O)C1CCCCC1O)C1=C(O2)OC(N2CN(C3C=C(O)C(=C=O)O3)C3=NC([NH3+])=NC(O)=C32)=C1O Intermediate Fragment 
259 608.1623330721 COC1=CC2=C(C=C1C(=O)C1C(O)CCCC1O)C1=C(O2)OC(N2CN(C3C=C(O)C(=C=O)O3)C3=NC([NH3+])=NC(O)=C32)=C1O Intermediate Fragment 
260 590.1517683881 COC1=CC2=C(C=C1C(=O)C1=CCCCC1O)C1=C(O2)OC(N2CN(C3C=C(O)C(=C=O)O3)C3=NC([NH3+])=NC(O)=C32)=C1O
261 478.1357244001 COC1=CC2=C(C=C1C(=O)C1=CCCCC1O)C1=C(O2)OC(N2C=NC3=NC([NH3+])=NC(O)=C32)=C1O
262 608.1623330721 COC1=CC2=C(C(OC3CCCC(O)C3C=O)=C1)C1=C(O2)OC(N2CN(C3C=C(O)C(=C=O)O3)C3=NC([NH3+])=NC(O)=C32)=C1O Intermediate Fragment 
263 580.1674184521 COC1=CC2=C(C(OC3CCCC(O)C3)=C1)C1=C(O2)OC(N2CN(C3C=C(O)C(=C=O)O3)C3=NC([NH3+])=NC(O)=C32)=C1O
264 470.1306390201 COC1CCC2=C(C1)OC1=C2C(O)=C(N2CN(C3C=C(O)C(=C=O)O3)C3=NC([NH3+])=NC(O)=C32)O1
265 608.1623330721 CCC(O)C1C(=O)C2=C(OC1C)C1=C(C=C2OC)OC2=C1C(O)=C(N1CN(C3C=C(O)C(=C=O)O3)C3=NC([NH3+])=NC(O)=C31)O2 Intermediate Fragment 
266 582.1466830081 COC1=CC2=C(C3=C1C(O)C(CO)C(C)O3)C1=C(O2)OC(N2CN(C3C=C(O)C(=C=O)O3)C3=NC([NH3+])=NC(O)=C32)=C1O
267 578.1153828801 COC1=CC2=C(C3=C1C(=O)C(CO)=C(C)O3)C1=C(O2)OC(N2CN(C3C=C(O)C(=C=O)O3)C3=NC([NH3+])=NC(O)=C32)=C1O
268 556.1674184521 COC1CC2=C(C3=C(O2)OC(N2CN(C4C=C(O)C(=C=O)O4)C4=NC([NH3+])=NC(O)=C42)=C3O)C2OC(C)CC(O)C12
269 556.1674184521 COC1CC2=C(C3=C(O2)OC(N2CN(C(=O)C=C(O)C#CO)C4=NC([NH3+])=NC(O)=C42)=C3O)C2OC(C)CC(O)C12 Intermediate Fragment 
270 554.1517683881 COC1CC2=C(C3=C1C(O)CC(C)O3)C1=C(O2)OC(N2CN(C3C=C(O)C(=C=O)O3)C3=NC([NH3+])=NC(O)=C32)=C1O
271 552.1361183241 COC1=CC2=C(C3=C1C(O)CC(C)O3)C1=C(O2)OC(N2CN(C3C=C(O)C(=C=O)O3)C3=NC([NH3+])=NC(O)=C32)=C1O
272 550.1204682601 COC1=CC2=C(C3=C1C(=O)CC(C)O3)C1=C(O2)OC(N2CN(C3C=C(O)C(=C=O)O3)C3=NC([NH3+])=NC(O)=C32)=C1O
273 438.1044242721 COC1=CC2=C(C3=C1C(=O)CC(C)O3)C1=C(O2)OC(N2C=NC3=NC([NH3+])=NC(O)=C32)=C1O
274 548.1048181961 COC1=CC2=C(C3=C1C(=O)C=C(C)O3)C1=C(O2)OC(N2CN(C3C=C(O)C(=C=O)O3)C3=NC([NH3+])=NC(O)=C32)=C1O
275 608.1623330721 CCC1OC2=C(C(=O)C1C(C)O)C(OC)=CC1=C2C2=C(O1)OC(N1CN(C3C=C(O)C(=C=O)O3)C3=NC([NH3+])=NC(O)=C31)=C2O Intermediate Fragment 
276 608.1623330721 CCCC1OC2=C(C(=O)C1CO)C(OC)=CC1=C2C2=C(O1)OC(N1CN(C3C=C(O)C(=C=O)O3)C3=NC([NH3+])=NC(O)=C31)=C2O Intermediate Fragment 
277 580.1674184521 CCCC1CC(O)C2=C(O1)C1=C(C=C2OC)OC2=C1C(O)=C(N1CN(C3C=C(O)C(=C=O)O3)C3=NC([NH3+])=NC(O)=C31)O2
278 608.1623330721 COC1=CC2=C(C3=C1C(=O)CC(CCCCO)O3)C1=C(O2)OC(N2CN(C3C=C(O)C(=C=O)O3)C3=NC([NH3+])=NC(O)=C32)=C1O Intermediate Fragment 
279 576.1361183241 CCCC1=CC(=O)C2=C(O1)C1=C(C=C2OC)OC2=C1C(O)=C(N1CN(C3C=C(O)C(=C=O)O3)C3=NC([NH3+])=NC(O)=C31)O2
280 578.1517683881 CCCC1CC(=O)C2=C(O1)C1=C(C=C2OC)OC2=C1C(O)=C(N1CN(C3C=C(O)C(=C=O)O3)C3=NC([NH3+])=NC(O)=C31)O2
281 608.1623330721 CCCC(O)C1COC2=C(C1=O)C(OC)=CC1=C2C2=C(O1)OC(N1CN(C3C=C(O)C(=C=O)O3)C3=NC([NH3+])=NC(O)=C31)=C2O Intermediate Fragment 
282 606.1466830081 COC1=CC2=C(C3=C1C(=O)C1C(O)CCCC1O3)C1=C(O2)OC(N2CN(C3C=C(O)C(=C=O)O3)C3=NC([NH3+])=NC(O)=C32)=C1O
