<svg width="891" height="170" viewBox="0 0 891 170" fill="none" xmlns="http://www.w3.org/2000/svg">
<path d="M6.05682 161.783L25.5987 8.40894H129.822L109.688 161.783H6.05682Z" fill="#9747FF"/>
<path fill-rule="evenodd" clip-rule="evenodd" d="M90.7385 84.8C90.7385 97.882 80.1334 108.487 67.0513 108.487C53.9693 108.487 43.3642 97.882 43.3642 84.8C43.3642 71.7179 53.9693 61.1128 67.0513 61.1128C80.1334 61.1128 90.7385 71.7179 90.7385 84.8ZM78.8949 84.8C78.8949 91.341 73.5923 96.6436 67.0513 96.6436C60.5103 96.6436 55.2077 91.341 55.2077 84.8C55.2077 78.259 60.5103 72.9564 67.0513 72.9564C73.5923 72.9564 78.8949 78.259 78.8949 84.8Z" fill="white"/>
<path fill-rule="evenodd" clip-rule="evenodd" d="M19.2976 5.01973C19.5142 3.23617 21.0281 1.89496 22.8248 1.89496H131.733C133.866 1.89496 135.518 3.75972 135.261 5.87633L115.989 164.58C115.773 166.364 114.259 167.705 112.462 167.705H3.55357C1.42142 167.705 -0.230611 165.84 0.026405 163.724L19.2976 5.01973ZM29.9165 15.8217C30.0609 14.6327 31.0702 13.7385 32.2679 13.7385H119.702C121.123 13.7385 122.224 14.9817 122.053 16.3928L105.371 153.778C105.226 154.967 104.217 155.861 103.019 155.861H15.5854C14.164 155.861 13.0626 154.618 13.234 153.207L29.9165 15.8217Z" fill="white"/>
<path d="M247.311 1.89497C247.942 1.89497 248.416 2.13184 248.732 2.60558C249.206 3.07933 249.363 3.63203 249.206 4.26368L248.495 10.6592C248.179 12.2384 247.311 13.0279 245.889 13.0279H215.333C214.859 13.0279 214.464 13.3438 214.149 13.9754L195.673 165.336C195.357 166.915 194.488 167.705 193.067 167.705H185.487C183.908 167.705 183.276 166.915 183.592 165.336L202.068 13.9754C202.068 13.3438 201.831 13.0279 201.357 13.0279H172.459C171.828 13.0279 171.275 12.7911 170.801 12.3173C170.485 11.8436 170.406 11.2909 170.564 10.6592L171.275 4.26368C171.591 2.68453 172.459 1.89497 173.88 1.89497H247.311Z" fill="white"/>
<path d="M280.771 169.6C270.664 169.6 262.531 166.6 256.373 160.599C250.372 154.44 247.372 146.229 247.372 135.964C247.372 134.701 247.53 132.648 247.845 129.806L258.978 40.0313C260.4 28.0298 265.058 18.397 272.954 11.133C280.849 3.71099 290.403 0 301.615 0C311.88 0 320.012 3.07933 326.013 9.23799C332.172 15.3966 335.251 23.6082 335.251 33.8726C335.251 35.1359 335.093 37.1888 334.777 40.0313L323.881 129.806C322.302 141.649 317.486 151.282 309.432 158.704C301.536 165.968 291.982 169.6 280.771 169.6ZM282.192 158.467C289.93 158.467 296.483 155.861 301.852 150.65C307.221 145.439 310.458 138.649 311.564 130.279L322.697 39.5575C322.855 38.4521 322.934 36.873 322.934 34.8201C322.934 27.714 320.881 22.029 316.775 17.7654C312.669 13.3438 307.142 11.133 300.194 11.133C292.614 11.133 286.14 13.8175 280.771 19.1866C275.401 24.3978 272.243 31.1881 271.296 39.5575L260.163 130.279C260.005 131.385 259.926 132.964 259.926 135.017C259.926 142.123 261.9 147.808 265.848 152.072C269.953 156.335 275.401 158.467 282.192 158.467Z" fill="white"/>
<path d="M353.603 167.705C352.182 167.705 351.471 166.915 351.471 165.336L371.368 4.26368C371.684 2.68453 372.553 1.89497 373.974 1.89497H381.554C383.133 1.89497 383.765 2.68453 383.449 4.26368L373.5 85.5106C373.5 85.9844 373.658 86.3002 373.974 86.4581C374.29 86.4581 374.527 86.2212 374.685 85.7475L432.718 3.55307C433.823 2.44767 434.85 1.89497 435.797 1.89497H444.562C445.351 1.89497 445.904 2.21079 446.22 2.84245C446.536 3.3162 446.378 3.94786 445.746 4.73743L401.688 67.7453C401.372 68.0611 401.214 68.5348 401.214 69.1665L429.876 164.863V165.573C429.876 166.205 429.639 166.758 429.165 167.231C428.691 167.547 428.139 167.705 427.507 167.705H418.743C417.479 167.705 416.769 167.073 416.611 165.81L391.739 80.5363C391.581 79.9047 391.187 79.9047 390.555 80.5363L371.368 105.882C371.052 106.197 370.895 106.592 370.895 107.066L363.788 165.336C363.473 166.915 362.604 167.705 361.183 167.705H353.603Z" fill="white"/>
<path d="M542.084 10.6592C541.926 11.2909 541.61 11.8436 541.137 12.3173C540.663 12.7911 540.11 13.0279 539.479 13.0279H484.998C484.524 13.0279 484.13 13.3438 483.814 13.9754L475.997 78.1676C475.997 78.4834 476.076 78.7203 476.234 78.8782C476.392 79.0361 476.55 79.1151 476.708 79.1151H511.765C513.344 79.1151 513.975 79.9047 513.66 81.4838L512.949 87.8793C512.633 89.4585 511.765 90.248 510.343 90.248H475.523C475.05 90.248 474.655 90.5639 474.339 91.1955L466.522 155.625C466.522 156.256 466.759 156.572 467.233 156.572H521.713C523.134 156.572 523.845 157.362 523.845 158.941L522.898 165.336C522.898 165.968 522.661 166.521 522.187 166.994C521.713 167.468 521.082 167.705 520.292 167.705H455.152C453.731 167.705 453.021 166.915 453.021 165.336L472.918 4.26368C473.234 2.68453 474.102 1.89497 475.523 1.89497H540.663C541.453 1.89497 542.005 2.13184 542.321 2.60558C542.795 3.07933 542.953 3.63203 542.795 4.26368L542.084 10.6592Z" fill="white"/>
<path d="M634.953 4.26368C634.953 3.63203 635.19 3.07933 635.663 2.60558C636.137 2.13184 636.769 1.89497 637.558 1.89497H644.901C645.533 1.89497 646.007 2.13184 646.322 2.60558C646.796 3.07933 646.954 3.63203 646.796 4.26368L627.136 165.336C626.978 165.968 626.662 166.521 626.188 166.994C625.715 167.468 625.162 167.705 624.53 167.705H615.529C614.108 167.705 613.318 167.073 613.16 165.81L580.472 33.162C580.472 32.6883 580.314 32.5304 579.998 32.6883C579.683 32.6883 579.446 32.9251 579.288 33.3989L563.417 165.336C563.102 166.915 562.233 167.705 560.812 167.705H553.232C551.811 167.705 551.1 166.915 551.1 165.336L570.997 4.26368C571.313 2.68453 572.182 1.89497 573.603 1.89497H582.367C583.63 1.89497 584.341 2.52662 584.499 3.78994L617.661 135.727C617.661 136.201 617.819 136.438 618.135 136.438C618.451 136.28 618.687 135.964 618.845 135.491L634.953 4.26368Z" fill="white"/>
<path d="M665.191 167.705C663.77 167.705 663.059 166.915 663.059 165.336L682.956 4.26368C683.272 2.68453 684.141 1.89497 685.562 1.89497H693.142C694.721 1.89497 695.352 2.68453 695.037 4.26368L675.376 165.336C675.06 166.915 674.192 167.705 672.771 167.705H665.191Z" fill="white"/>
<path d="M703.588 167.705C702.009 167.705 701.377 166.915 701.693 165.336L702.641 157.993C702.641 156.888 702.877 155.94 703.351 155.151L778.439 14.2123C778.755 13.8965 778.834 13.6596 778.676 13.5017C778.518 13.1858 778.282 13.0279 777.966 13.0279H722.538C721.906 13.0279 721.353 12.7911 720.88 12.3173C720.564 11.8436 720.485 11.2909 720.643 10.6592L721.353 4.26368C721.669 2.68453 722.538 1.89497 723.959 1.89497H790.994C791.783 1.89497 792.336 2.13184 792.652 2.60558C793.126 3.07933 793.283 3.63203 793.125 4.26368L792.178 11.6067C792.178 12.2384 791.941 13.1858 791.467 14.4492L716.379 155.388C716.221 155.704 716.221 156.019 716.379 156.335C716.537 156.493 716.695 156.572 716.853 156.572H772.044C773.465 156.572 774.176 157.362 774.176 158.941L773.228 165.336C773.228 165.968 772.991 166.521 772.518 166.994C772.044 167.468 771.412 167.705 770.623 167.705H703.588Z" fill="white"/>
<path d="M890.221 10.6592C890.063 11.2909 889.747 11.8436 889.273 12.3173C888.799 12.7911 888.247 13.0279 887.615 13.0279H833.135C832.661 13.0279 832.266 13.3438 831.95 13.9754L824.133 78.1676C824.133 78.4834 824.212 78.7203 824.37 78.8782C824.528 79.0361 824.686 79.1151 824.844 79.1151H859.901C861.48 79.1151 862.112 79.9047 861.796 81.4838L861.085 87.8793C860.77 89.4585 859.901 90.248 858.48 90.248H823.66C823.186 90.248 822.791 90.5639 822.475 91.1955L814.659 155.625C814.659 156.256 814.895 156.572 815.369 156.572H869.85C871.271 156.572 871.982 157.362 871.982 158.941L871.034 165.336C871.034 165.968 870.797 166.521 870.323 166.994C869.85 167.468 869.218 167.705 868.428 167.705H803.289C801.868 167.705 801.157 166.915 801.157 165.336L821.054 4.26368C821.37 2.68453 822.238 1.89497 823.66 1.89497H888.799C889.589 1.89497 890.142 2.13184 890.457 2.60558C890.931 3.07933 891.089 3.63203 890.931 4.26368L890.221 10.6592Z" fill="white"/>
</svg>
