{
    "preguntas":[ 
        {   
            "numero": 1,
            "pregunta":"Parce: ¿Usted podría crear su propio lenguaje de código?",
            "directa":false,
            "opcionA":
                {
                "texto":"Nel, lo que hay es lo que está y lo que sirve.",
                "inclinacion":"false",
                "multiplicador":1
            },
            "opcionB":{
                "texto":"Obvio, es mera tarea, pero hace la experiencia más personalizada y única.",
                "inclinacion":"true",
                "multiplicador":1
            }
        },
        {   
            "numero": 2,
            "pregunta":"Socio, párleme a ver: ¿Qué tienen en común estas empresas? (Polygonus, Indie level y Rock Star Studios) ",
            "directa":false,
            "opcionA":
                {
                "texto":"Son empresas que contratan talento joven.",
                "inclinacion":"false",
                "multiplicador":1
            },
            "opcionB":{
                "texto":"Son empresas del Valle de Aburrá que diseñan videojuegos.",
                "inclinacion":"true",
                "multiplicador":1
            }
        },
        {   
            "numero": 3,
            "pregunta":"Chárleme, ¿qué tienen en común estos cracs?",
            "directa":false,
            "opcionA":
                {
                "texto":"Que todos tuvieron oportunidades económicas para estudiar algo relacionado con tecnología.",
                "inclinacion":"false",
                "multiplicador":1
            },
            "opcionB":{
                "texto":"Todos se enfrentaron al reto de aprender cosas nuevas, siempre dispuestos y con mente abierta, en un mercado diferente y nuevo en el país.",
                "inclinacion":"true",
                "multiplicador":1
            }
        },
        {   
            "numero": 4,
            "pregunta":"La escuela Código C13 es una...",
            "directa":false,
            "opcionA":
                {
                "texto":"Escuela liderada por Son Batá, forma jóvenes en habilidades de desarrollo y software.",
                "inclinacion":"true",
                "multiplicador":1
            },
            "opcionB":{
                "texto":"Es un colectivo de gamers liderado por la junta de acción comunal que trata sobre temas de tecnología.",
                "inclinacion":"false",
                "multiplicador":1
            }
        },
        {   
            "numero": 5,
            "pregunta":"Parcerito, vamos a retarlo: ¿a qué le suena el término coverflow?",
            "directa":false,
            "opcionA":
                {
                "texto":"Un parche de programadores para camellar y aprender en conjunto.",
                "inclinacion":"true",
                "multiplicador":1
            },
            "opcionB":{
                "texto":"Un programa para generar código.",
                "inclinacion":"false",
                "multiplicador":1
            }
        },
        {   
            "numero": 6,
            "pregunta":"Socio, usted sabe ¿qué es una tendencia Triple A?",
            "directa":false,
            "opcionA":
                {
                "texto":"Una tendencia gráfica que busca ser lo más hiperrealista posible.",
                "inclinacion":"true",
                "multiplicador":1
            },
            "opcionB":{
                "texto":"Son empresas del Valle de Aburrá que diseñan videojuegos.",
                "inclinacion":"false",
                "multiplicador":1
            }
        },
        {   
            "numero": 7,
            "pregunta":"¿Por qué es clave crear una buena narrativa al desarrollar un videojuego?",
            "directa":false,
            "opcionA":
                {
                "texto":"La idea es generar una inmersión y así conectar al usuario con la historia.",
                "inclinacion":"true",
                "multiplicador":1
            },
            "opcionB":{
                "texto":"Para que tenga muchas herramientas, como gafas RV, celulares y tablets, y así potenciarla.",
                "inclinacion":"false",
                "multiplicador":1
            }
        },
        {   
            "numero": 8,
            "pregunta":"¿Con qué fin las 6 mujeres programaron la primera computadora?",
            "directa":false,
            "opcionA":
                {
                "texto":"Para facilitar los procesos de comunicación durante la guerra fría.",
                "inclinacion":"false",
                "multiplicador":1
            },
            "opcionB":{
                "texto":"La primera computadora fue programada para calcular ataques en la segunda guerra mundial.",
                "inclinacion":"true",
                "multiplicador":1
            }
        }

    ]
}