{
    "guion":[ 
        {   
            "id":0,
            "personaje": "Tibomilo",
            "texto":"Pana, ¿usted sigue insistiendo?",
            "accion":"null",
            "numero":0       
        },
        {   
            "id":1,
            "personaje": "Tibomilo",
            "texto":"Me recuerda a estos parceros que duraron 48 horas camellando.",
            "accion":"null",
            "numero":0       
        },
        {   
            "id":2,
            "personaje": "Tibomilo",
            "texto":"¿Usted aguantaría ese trote?",
            "accion":"null",
            "numero":0       
        },
        {   
            "id":3,
            "personaje": "Tibomilo",
            "texto":"null",
            "accion":"Noticia",
            "numero":7       
        },
        {
            "id":4,
            "personaje": "Tibomilo",
            "texto":"null",
            "accion":"PreguntaNoticia",
            "numero":7
        },
        {   
            "id":5,
            "personaje": "Tibomilo",
            "texto":"Oe, ¿muy entusiasmado con la creación de videojuegos? Ponga esa cabecita a andar...",
            "accion":"null",
            "numero":0       
        },
        {   
            "id":6,
            "personaje": "Tibomilo",
            "texto":"null",
            "accion":"PreguntaQuiz",
            "numero":7       
        },
        {   
            "id":7,
            "personaje": "Tibomilo",
            "texto":"Panita, ya probó que es bueno para tirar números. Usted tiene cara de desarrollador backend.",
            "accion":"null",
            "numero":0       
        },
        {   
            "id":8,
            "personaje": "Tibomilo",
            "texto":"Este crack pone a funcionar lo que el usuario no ve. Es un teso tirando código.",
            "accion":"null",
            "numero":0       
        },
        {   
            "id":9,
            "personaje": "Tibomilo",
            "texto":"null",
            "accion":"PreguntaPerfil",
            "numero":7       
        },
        {   
            "id":10,
            "personaje": "Tibomilo",
            "texto":"Y si llegó hasta aquí, el parche pinta bien. Fijo, nos volveremos a ver.",
            "accion":"null",
            "numero":0       
        },
        {   
            "id":11,
            "personaje": "Tibomilo",
            "texto":"null",
            "accion":"Codigo",
            "numero":7       
        }
    ]
}   
           