{
    "guion":[ 
        {   
            "id":0,
            "personaje": "Kendry",
            "texto":"Parce, ¿entonces qué? Soy Kendry. Bienvenido por aquí. Supongo que quiere aprender sobre desarrollo digital.",
            "accion":"null",
            "numero":0       
        },
        {   
            "id":1,
            "personaje": "Kendry",
            "texto":"Le voy a tirar unas pregunticas para ver qué tan preparado está.",
            "accion":"null",
            "numero":0       
        },
        {   
            "id":2,
            "personaje": "Kendry",
            "texto":"null",
            "accion":"PreguntaQuiz",
            "numero":1       
        },
        {   
            "id":3,
            "personaje": "Kendry",
            "texto":"Listo, parce. Si sobrevivió a este quiz, véase esta noticia sobre el parche de los desarrolladores y después hablamos.",
            "accion":"null",
            "numero":0       
        },
        {
            "id":4,
            "personaje": "Kendry",
            "texto":"null",
            "accion":"Noticia",
            "numero":1
        },
        {   
            "id":5,
            "personaje": "Kendry",
            "texto":"null",
            "accion":"PreguntaNoticia",
            "numero":1       
        },
        {   
            "id":6,
            "personaje": "Kendry",
            "texto":"¿Cómo se va sintiendo, parce? Para hacerle el cuento corto, yo llevo varios años dándole al desarrollo interactivo.",
            "accion":"null",
            "numero":0       
        },
        {   
            "id":7,
            "personaje": "Kendry",
            "texto":"null",
            "accion":"PreguntaPerfil",
            "numero":1       
        },
        {   
            "id":8,
            "personaje": "Kendry",
            "texto":"Ya se va encaminando. Pille el mapa y escoja otro parche pa' ver si esto es lo suyo.",
            "accion":"null",
            "numero":0       
        },
        {   
            "id":9,
            "personaje": "Kendry",
            "texto":"¡Casi se me olvida! Guárdese esta línea de código, que va a necesitar pa'completar el Código Parche.",
            "accion":"null",
            "numero":0       
        },
        {   
            "id":10,
            "personaje": "Kendry",
            "texto":"null",
            "accion":"Codigo",
            "numero":1       
        }
    ]
}   
           