{
    "dockerComposeFile": [
        "docker-compose.yml"
    ],
    "service": "playground",
    "workspaceFolder": "/work",
    "extensions": [
        "rust-lang.rust",
        "vadimcn.vscode-lldb"
    ]
}
