Package             Version
------------------- ----------
anyio               3.3.0
appnope             0.1.2
argon2-cffi         21.1.0
attrs               21.2.0
Babel               2.9.1
backcall            0.2.0
bleach              4.1.0
certifi             2021.5.30
cffi                1.14.6
charset-normalizer  2.0.4
cycler              0.10.0
Cython              0.29.24
debugpy             1.4.1
decorator           5.0.9
defusedxml          0.7.1
entrypoints         0.3
fenics-basix        0.3.1.dev0
fenics-dolfinx      0.3.1.dev0
fenics-ffcx         0.3.1.dev0
fenics-ufl          2021.1.0
idna                3.2
ipykernel           6.3.0
ipython             7.27.0
ipython-genutils    0.2.0
jedi                0.18.0
Jinja2              3.0.1
json5               0.9.6
jsonschema          3.2.0
jupyter-client      7.0.2
jupyter-core        4.7.1
jupyter-server      1.10.2
jupyterlab          3.1.9
jupyterlab-pygments 0.1.2
jupyterlab-server   2.7.2
kiwisolver          1.3.2
MarkupSafe          2.0.1
matplotlib          3.4.3
matplotlib-inline   0.1.2
mistune             0.8.4
mpi4py              3.1.1
nbclassic           0.3.1
nbclient            0.5.4
nbconvert           6.1.0
nbformat            5.1.3
nest-asyncio        1.5.1
ninja               1.10.2
notebook            6.4.3
numpy               1.21.2
packaging           21.0
pandocfilters       1.4.3
parso               0.8.2
petsc4py            3.15.2
pexpect             4.8.0
pickleshare         0.7.5
Pillow              8.3.1
pip                 21.2.4
prometheus-client   0.11.0
prompt-toolkit      3.0.20
ptyprocess          0.7.0
pybind11            2.7.1
pycparser           2.20
Pygments            2.10.0
pyparsing           2.4.7
pyrsistent          0.18.0
python-dateutil     2.8.2
pytz                2021.1
pyzmq               22.2.1
requests            2.26.0
requests-unixsocket 0.2.0
scipy               1.7.1
Send2Trash          1.8.0
setuptools          57.0.0
six                 1.16.0
slepc4py            3.15.1
sniffio             1.2.0
terminado           0.11.1
testpath            0.5.0
tornado             6.1
traitlets           5.0.5
urllib3             1.26.6
wcwidth             0.2.5
webencodings        0.5.1
websocket-client    1.2.1
