<svg width="41" height="46" viewBox="0 0 41 46" fill="none" xmlns="http://www.w3.org/2000/svg">
<path d="M40.4009 20.8303C40.4031 20.5019 40.3975 20.1746 40.3842 19.8506C40.1847 15.0301 38.2379 10.6505 35.151 7.3179C31.6384 3.5268 26.6482 1.09124 21.0729 0.9083C20.9012 0.90279 20.7296 0.899484 20.5569 0.898382C20.3842 0.89728 20.2125 0.898382 20.0398 0.900586C9.23132 1.08794 0.48557 9.76999 0.40199 20.5228C0.339584 28.4213 4.96989 35.275 11.7153 38.4964C14.2974 39.7296 17.1881 40.4316 20.246 40.4547L20.2047 45.7292C31.6875 43.1735 40.3051 33.0731 40.4009 20.9328C40.4009 20.9152 40.4009 20.8975 40.4009 20.8799C40.3998 20.8634 40.4009 20.8468 40.4009 20.8303ZM31.7242 24.1784C30.154 28.0191 25.6151 31.2305 20.3184 31.1897C15.0206 31.1489 10.534 27.8681 9.02405 24.0031C8.77219 23.3595 9.15443 22.6509 9.81638 22.4349C16.2175 20.3476 24.5888 20.4126 30.9564 22.5969C31.615 22.825 31.985 23.5392 31.7242 24.1784Z" fill="url(#paint0_linear)"/>
<defs>
<linearGradient id="paint0_linear" x1="20.4879" y1="9.70992" x2="20.0427" y2="67.6133" gradientUnits="userSpaceOnUse">
<stop stop-color="#FF9300"/>
<stop offset="1" stop-color="#FF2F00"/>
</linearGradient>
</defs>
</svg>
