<svg width="151" height="30" viewBox="0 0 151 30" fill="none" xmlns="http://www.w3.org/2000/svg">
<path d="M5.22901 27.1756H0L3.24427 6.87023H8.47328L7.21374 14.7328H18.3588L19.6183 6.87023H24.8473L21.6031 27.1756H16.374L17.6336 19.4275H6.48855L5.22901 27.1756Z" fill="white"/>
<path d="M26.9084 6.87023H33.5878L38.3206 13.3588L45.0382 6.87023H51.7176L40.0763 18.3206L38.6641 27.1756H33.4351L34.8473 18.3206L26.9084 6.87023Z" fill="white"/>
<path d="M68.2824 15.3053C68.5878 15.3053 68.7786 15.1908 68.8168 14.9237L69.313 11.9466C69.313 11.8702 69.2748 11.7557 69.1985 11.6794C69.1221 11.6031 69.0076 11.5649 68.8931 11.5649H53.0534L53.8168 6.87023H72.7481C73.0534 6.87023 73.3206 6.94656 73.5878 7.1374C73.855 7.32824 74.1221 7.55725 74.313 7.82443C74.5038 8.0916 74.6947 8.43511 74.771 8.74046C74.8855 9.08397 74.9237 9.38931 74.8855 9.69465L73.855 16.145C73.7405 16.8321 73.5496 17.4427 73.2824 17.9389C73.0153 18.4351 72.7099 18.855 72.3282 19.1603C71.9466 19.4656 71.5649 19.6947 71.145 19.8092C70.7252 19.9618 70.3053 20.0382 69.8855 20.0382H56.9466L55.8015 27.1756H50.5725L52.4809 15.3053H68.2824Z" fill="white"/>
<path d="M74.9237 27.1756L78.168 6.87023H97.3664L96.6412 11.5649H82.6718L82.1374 14.771H89.4657L88.7405 19.4656H81.4122L80.916 22.5191H94.8855L94.1603 27.2137H74.9237V27.1756Z" fill="white"/>
<path d="M149.466 5.03817L146.45 23.3969C146.336 23.9695 146.145 24.5038 145.84 24.9618C145.534 25.4198 145.153 25.8015 144.733 26.1069C144.313 26.4122 143.817 26.6412 143.321 26.7939C142.824 26.9466 142.328 27.0229 141.87 27.0229H128.359C127.863 27.0229 127.366 26.9466 126.908 26.7939C126.45 26.6412 126.069 26.4504 125.725 26.145C125.382 25.8397 125.153 25.4962 125 25.0382C124.847 24.5802 124.809 24.0458 124.924 23.3588L127.595 6.67939H132.824L130.305 22.3282H141.412L144.16 5.57252L145.343 0L141.679 4.54198H101.298C100.343 4.54198 99.5801 5.30534 99.5801 6.25954V6.83206H122.137C122.405 6.83206 122.672 6.9084 122.939 7.09924C123.206 7.29008 123.473 7.51908 123.702 7.82443C123.931 8.12977 124.084 8.43511 124.198 8.77863C124.313 9.12214 124.351 9.42748 124.275 9.73282L123.359 15.5344C123.13 16.8702 122.672 17.8244 121.947 18.4351C121.26 19.0076 120.496 19.313 119.656 19.3511H106.947C106.832 19.3511 106.718 19.3893 106.603 19.4656C106.489 19.542 106.412 19.6565 106.412 19.7328L106.069 22.0611C105.992 22.3282 106.145 22.4427 106.45 22.4427H122.252L121.527 27.1374H102.595C102.29 27.1374 102.023 27.0611 101.756 26.8702C101.489 26.6794 101.221 26.4504 101.031 26.1832C100.84 25.916 100.649 25.6107 100.573 25.2672C100.458 24.9237 100.458 24.6183 100.496 24.313L101.412 18.4733C101.527 17.7481 101.718 17.1756 101.985 16.6794C102.252 16.2214 102.557 15.8015 102.939 15.4962C103.321 15.1908 103.702 14.9618 104.122 14.8473C104.542 14.7328 104.962 14.6565 105.382 14.6565H117.863C118.168 14.6565 118.321 14.542 118.397 14.2748L118.779 11.9466C118.779 11.8702 118.74 11.7557 118.664 11.6794C118.588 11.6031 118.473 11.5649 118.359 11.5649L99.6183 11.4885V27.6336C99.6183 28.5878 100.382 29.3511 101.336 29.3511H148.321C149.275 29.3511 150.038 28.5878 150.038 27.6336V6.25954C150 5.80153 149.809 5.34351 149.466 5.03817Z" fill="#ED1C24"/>
</svg>
