<svg role="presentation" focusable="false" viewBox="2 2 16 16" class="ki fe ff ur us">
  <g>
    <path d="M2.72113 2.05149L18.0756 9.61746C18.3233 9.73952 18.4252 10.0393 18.3031 10.287C18.2544 10.3858 18.1744 10.4658 18.0756 10.5145L2.72144 18.0803C2.47374 18.2023 2.17399 18.1005 2.05193 17.8528C1.99856 17.7445 1.98619 17.6205 2.0171 17.5038L3.53835 11.7591C3.58866 11.5691 3.7456 11.4262 3.93946 11.3939L10.8204 10.2466C10.9047 10.2325 10.9744 10.1769 11.0079 10.1012L11.0259 10.0411C11.0454 9.92436 10.9805 9.81305 10.8759 9.76934L10.8204 9.7534L3.90061 8.6001C3.70668 8.56778 3.54969 8.4248 3.49942 8.23473L2.01676 2.62789C1.94612 2.36093 2.10528 2.08726 2.37224 2.01663C2.48893 1.98576 2.61285 1.99814 2.72113 2.05149Z" />
  </g>
</svg>
