<svg viewBox="-2 -2 24 24">
  <path
    d="M8 2a2 2 0 0 0-2 2v10c0 1.1.9 2 2 2h6a2 2 0 0 0 2-2V4a2 2 0 0 0-2-2H8ZM7 4a1 1 0 0 1 1-1h6a1 1 0 0 1 1 1v10a1 1 0 0 1-1 1H8a1 1 0 0 1-1-1V4ZM4 6a2 2 0 0 1 1-1.73V14.5A2.5 2.5 0 0 0 7.5 17h6.23A2 2 0 0 1 12 18H7.5A3.5 3.5 0 0 1 4 14.5V6Z"
    fill="currentColor"
  />
</svg>
