<svg viewBox="-2 -2 24 24">
  <path
    d="M10 2C14.4183 2 18 5.58172 18 10C18 14.4183 14.4183 18 10 18C8.72679 18 7.49591 17.7018 6.38669 17.1393L6.266 17.075L2.62109 17.9851C2.31127 18.0625 2.02622 17.8369 2.00131 17.5438L2.00114 17.4624L2.01493 17.3787L2.925 13.735L2.86169 13.6153C2.4066 12.7186 2.12433 11.7422 2.03275 10.7283L2.00738 10.3463L2 10C2 5.58172 5.58172 2 10 2ZM10.5 11H7.5L7.41012 11.0081C7.17688 11.0504 7 11.2545 7 11.5C7 11.7455 7.17688 11.9496 7.41012 11.9919L7.5 12H10.5L10.5899 11.9919C10.8231 11.9496 11 11.7455 11 11.5C11 11.2545 10.8231 11.0504 10.5899 11.0081L10.5 11ZM12.5 8H7.5L7.41012 8.00806C7.17688 8.05039 7 8.25454 7 8.5C7 8.74546 7.17688 8.94961 7.41012 8.99194L7.5 9H12.5L12.5899 8.99194C12.8231 8.94961 13 8.74546 13 8.5C13 8.25454 12.8231 8.05039 12.5899 8.00806L12.5 8Z"
  />
</svg>
