<svg role="presentation" focusable="false" viewBox="2 2 16 16">
  <path
    d="M3.37371 10.1678C3.19025 9.96143 2.87421 9.94284 2.66782 10.1263C2.46143 10.3098 2.44284 10.6258 2.6263 10.8322L6.6263 15.3322C6.81743 15.5472 7.15013 15.557 7.35356 15.3536L17.8536 4.85355C18.0488 4.65829 18.0488 4.34171 17.8536 4.14645C17.6583 3.95118 17.3417 3.95118 17.1465 4.14645L7.02141 14.2715L3.37371 10.1678Z"
  />
</svg>
