<svg
  xmlns="http://www.w3.org/2000/svg"
  xmlns:xlink="http://www.w3.org/1999/xlink"
  viewBox="0,0,256,256"
  width="16px"
  height="16px"
  fill-rule="nonzero"
  fill="none"
>
  <g
    fill="none"
    fill-rule="nonzero"
    stroke="none"
    stroke-width="1"
    stroke-linecap="butt"
    stroke-linejoin="miter"
    stroke-miterlimit="10"
    stroke-dasharray=""
    stroke-dashoffset="0"
    font-family="none"
    font-weight="none"
    font-size="none"
    text-anchor="none"
    style="mix-blend-mode: normal"
  >
    <g transform="scale(5.33333,5.33333)">
      <path
        d="M44,24c0,11.045 -8.955,20 -20,20c-11.045,0 -20,-8.955 -20,-20c0,-11.045 8.955,-20 20,-20c11.045,0 20,8.955 20,20z"
        fill="#7eb537"
      ></path>
      <path
        d="M34.602,14.602l-13.602,13.597l-5.602,-5.598l-2.797,2.797l8.399,8.403l16.398,-16.402z"
        fill="#ffffff"
      ></path>
    </g>
  </g>
</svg>
