<svg
  xmlns="http://www.w3.org/2000/svg"
  xmlns:xlink="http://www.w3.org/1999/xlink"
  viewBox="0 0 32 32"
  xml:space="preserve"
>
  <circle class="st0" cx="24" cy="22" r="7" />
  <line class="st0" x1="24" y1="19" x2="24" y2="25" />
  <line class="st0" x1="21" y1="22" x2="27" y2="22" />
  <polygon class="st0" points="14,4 1,12 14,20 27,12 " />
  <polyline class="st0" points="4.3,18 1,20 14,28 18,25.6 " />
</svg>
