<svg
  id="no-result"
  viewBox="0 0 160 146"
  xmlns="http://www.w3.org/2000/svg"
>
  <g
    fill-rule="nonzero"
    fill="none"
  >
    <path
      d="M81.363 145.862c-.715 0-1.427.016-2.136.046a1.798 1.798 0 11-.077-3.593h.054a67.405 67.405 0 0013.58-1.452 1.8 1.8 0 11.766 3.516 71 71 0 01-12.187 1.483zm-11.874-.626c-.104.009-.21.009-.314 0a69.905 69.905 0 01-13.986-3.433 1.8 1.8 0 111.217-3.386 66.287 66.287 0 0013.26 3.264 1.797 1.797 0 01-.185 3.578l.008-.023zm33.156-3.57a1.796 1.796 0 01-.689-3.486 66.438 66.438 0 0012.249-6.016 1.808 1.808 0 012.761 1.466c.023.644-.3 1.25-.847 1.592a70.122 70.122 0 01-12.915 6.344c-.179.07-.367.112-.559.123v-.023zm-55.763-3.738a1.794 1.794 0 01-.903-.206 70.552 70.552 0 01-11.95-8.011 1.795 1.795 0 01-.238-2.53 1.801 1.801 0 012.534-.237 66.9 66.9 0 0011.346 7.59 1.795 1.795 0 01-.766 3.386l-.023.008zm-18.717-14.562a1.8 1.8 0 01-1.401-.588 70.33 70.33 0 01-8.506-11.596 1.796 1.796 0 011.543-2.709 1.802 1.802 0 011.566.89 66.752 66.752 0 008.068 11 1.794 1.794 0 01-1.27 3.003zm110.17-11.879a1.8 1.8 0 01-1.605-.868 1.794 1.794 0 01-.018-1.822 66.284 66.284 0 005.527-12.483 1.803 1.803 0 013.43 1.109 69.851 69.851 0 01-5.834 13.14 1.8 1.8 0 01-1.5.924zM15.54 103.293a1.8 1.8 0 01-1.761-1.124 69.74 69.74 0 01-3.981-13.805 1.797 1.797 0 01.608-1.693 1.803 1.803 0 012.937 1.051 66.182 66.182 0 003.827 13.094 1.794 1.794 0 01-1.607 2.477h-.023zm130.825-14.126a1.8 1.8 0 01-1.838-2.102 66.878 66.878 0 00.927-13.606v-.153a1.799 1.799 0 011.734-1.862 1.8 1.8 0 011.864 1.732v.153c.17 4.8-.15 9.605-.957 14.34a1.798 1.798 0 01-1.73 1.49v.008zM10.58 80.063a1.77 1.77 0 01-1.86-1.697v-.076a70.48 70.48 0 01.941-14.264 1.801 1.801 0 013.552.604 66.923 66.923 0 00-.895 13.53 1.828 1.828 0 01-1.738 1.903zm135.64-14.76a1.798 1.798 0 01-1.83-1.476 66.121 66.121 0 00-3.827-13.086 1.81 1.81 0 01.999-2.358 1.814 1.814 0 012.361.997 69.748 69.748 0 014.02 13.805 1.794 1.794 0 01-1.447 2.095l-.276.023zM13.833 56.565a1.794 1.794 0 01-1.776-2.293 69.882 69.882 0 015.819-13.147 1.802 1.802 0 013.13 1.78 66.284 66.284 0 00-5.519 12.476 1.799 1.799 0 01-1.654 1.184zm124.134-13.484a1.8 1.8 0 01-1.615-.886 66.722 66.722 0 00-8.084-10.992 1.795 1.795 0 01.872-3.1 1.8 1.8 0 011.77.684 70.33 70.33 0 018.52 11.58 1.794 1.794 0 01-1.486 2.707l.023.007zm-113.002-7.43a1.794 1.794 0 01-1.485-2.905 70.7 70.7 0 019.952-10.372 1.8 1.8 0 013.084.995 1.795 1.795 0 01-.788 1.741 67.127 67.127 0 00-9.408 9.846 1.8 1.8 0 01-1.355.696zM122.58 25.02c-.44.015-.871-.132-1.21-.413a66.977 66.977 0 00-11.353-7.59 1.797 1.797 0 01-.75-2.431 1.803 1.803 0 012.434-.75 70.607 70.607 0 0111.958 7.996 1.795 1.795 0 01-1.087 3.18l.008.008zm-80-5.275a1.795 1.795 0 01-1.026-3.317 70.084 70.084 0 0112.915-6.36 1.796 1.796 0 111.248 3.371 66.468 66.468 0 00-12.25 6.031 1.793 1.793 0 01-.887.275zm59.36-6.474a1.802 1.802 0 01-.665-.107 66.433 66.433 0 00-13.237-3.226 1.796 1.796 0 01-1.177-2.883 1.802 1.802 0 011.667-.679 69.99 69.99 0 0113.987 3.41 1.796 1.796 0 01-.544 3.493l-.03-.008zm-37.358-2.446a1.797 1.797 0 01-.436-3.554c4.705-.99 9.499-1.503 14.308-1.53a1.798 1.798 0 11.077 3.593h-.054a67.29 67.29 0 00-13.581 1.468 1.817 1.817 0 01-.314.023z"
      opacity=".3"
      fill="#B3BAC5"
    />
    <path
      d="M146.833 26.9a.398.398 0 01-.299-.429 1.3 1.3 0 01.046-.344c.037-.237.085-.471.145-.703a5.814 5.814 0 011.256-2.362 6.684 6.684 0 012.603-1.728l1.898-.764a3.25 3.25 0 002.106-2.224c.098-.377.129-.768.091-1.155a2.673 2.673 0 00-.36-1.116 3.12 3.12 0 00-.864-.932 4.068 4.068 0 00-1.386-.627 3.335 3.335 0 00-1.6-.069c-.456.1-.886.292-1.263.566a3.487 3.487 0 00-.919 1.04c-.248.409-.436.851-.559 1.314-.035.143-.066.275-.092.398a.612.612 0 01-.765.466l-2.948-.917a.604.604 0 01-.436-.635c0-.092.013-.183.038-.275.046-.26.1-.515.161-.764a7.303 7.303 0 011.171-2.454 6.787 6.787 0 012.044-1.858 7.449 7.449 0 012.772-.947 8.564 8.564 0 013.406.26 9.63 9.63 0 013.216 1.444 7.91 7.91 0 012.051 2.102c.49.75.809 1.598.934 2.485.124.857.074 1.73-.145 2.568a6.373 6.373 0 01-1.776 3.142 9.113 9.113 0 01-3.024 1.826l-1.6.604a3.92 3.92 0 00-1.684 1.055 4.377 4.377 0 00-.888 1.521.398.398 0 01-.483.253l-2.847-.742zm-2.343 4.486c.173-.699.624-1.298 1.248-1.659a2.576 2.576 0 012.051-.29 2.729 2.729 0 011.945 3.325 2.569 2.569 0 01-1.263 1.636 2.66 2.66 0 01-2.06.267 2.679 2.679 0 01-1.921-3.286v.007zM14.936 17.061a.397.397 0 01-.268-.443.9.9 0 01.069-.344c.055-.232.121-.462.199-.688a5.816 5.816 0 011.416-2.293 6.686 6.686 0 012.718-1.529l1.944-.642a3.252 3.252 0 002.251-2.087c.123-.37.18-.757.168-1.146a2.672 2.672 0 00-.283-1.14 3.12 3.12 0 00-.765-.985 4.067 4.067 0 00-1.34-.719 3.38 3.38 0 00-2.94.306c-.39.252-.726.58-.987.963a5.004 5.004 0 00-.758 1.666.612.612 0 01-.82.428l-2.855-1.1a.604.604 0 01-.39-.665c0-.092.02-.184.061-.276.061-.254.133-.51.214-.764a7.305 7.305 0 011.34-2.37 6.789 6.789 0 012.167-1.704A7.45 7.45 0 0118.9.764a8.563 8.563 0 013.377.49 9.628 9.628 0 013.115 1.658 7.907 7.907 0 011.907 2.24c.437.78.699 1.646.765 2.538a6.488 6.488 0 01-.321 2.553 6.374 6.374 0 01-1.99 3.012 9.115 9.115 0 01-3.14 1.62l-1.638.49a3.921 3.921 0 00-1.753.94 4.206 4.206 0 00-.559.665c-.168.24-.312.496-.429.764a.398.398 0 01-.497.222l-2.802-.895zm-2.641 4.342a2.654 2.654 0 011.355-1.575 2.576 2.576 0 012.067-.152 2.728 2.728 0 011.715 3.447 2.57 2.57 0 01-1.37 1.529 2.66 2.66 0 01-2.075.13 2.674 2.674 0 01-1.692-3.379zM10.25 138.646a.398.398 0 01-.49-.175l-.16-.314a7.126 7.126 0 01-.283-.657 5.809 5.809 0 01-.33-2.653 6.667 6.667 0 011.141-2.912l1.11-1.72c.653-.88.817-2.03.437-3.057a3.309 3.309 0 00-.59-1.002 2.679 2.679 0 00-.934-.71 3.127 3.127 0 00-1.248-.268 4.07 4.07 0 00-1.53.283 3.33 3.33 0 00-1.356.863 3.37 3.37 0 00-.658 1.223 3.48 3.48 0 00-.169 1.369 5 5 0 00.299 1.399c.051.137.102.262.153.374a.61.61 0 01-.367.833l-2.91.948a.605.605 0 01-.72-.275l-.114-.252a8.287 8.287 0 01-.298-.704 7.298 7.298 0 01-.467-2.69c.014-.929.22-1.845.604-2.69a7.43 7.43 0 011.692-2.363 8.554 8.554 0 012.94-1.735 9.636 9.636 0 013.46-.665 7.926 7.926 0 012.894.543 6.124 6.124 0 012.19 1.528 6.496 6.496 0 011.385 2.194 6.366 6.366 0 01.352 3.593 9.09 9.09 0 01-1.424 3.233l-.964 1.414a3.91 3.91 0 00-.766 1.827c-.03.288-.03.577 0 .864.026.298.083.593.169.88.018.19-.1.366-.284.42l-2.763 1.054zm.66 5.023a2.649 2.649 0 01.068-2.08 2.57 2.57 0 011.531-1.414 2.734 2.734 0 013.506 1.613c.26.67.227 1.42-.092 2.064-.299.654-.851 1.16-1.53 1.399a2.683 2.683 0 01-3.46-1.59l-.024.008z"
      opacity=".3"
      fill="#C1C7D0"
    />
    <path
      d="M115.108 102.88l-5.474-5.297-7.372 7.644 5.474 5.297a10.27 10.27 0 012.84 4.961 10.27 10.27 0 002.84 4.961l22.201 21.48a8.49 8.49 0 0011.996-.191 8.463 8.463 0 00-.191-11.978l-22.2-21.48a10.294 10.294 0 00-5.061-2.675 10.294 10.294 0 01-5.053-2.722z"
      fill="#CFD4DB"
    />
    <path
      d="M119.946 105.487a10.294 10.294 0 01-4.83-2.622l-1.67-1.613a5.32 5.32 0 00-5.157-1.276 5.3 5.3 0 00-2.214 8.92l1.669 1.613a10.27 10.27 0 012.778 4.732 44.71 44.71 0 009.424-9.754z"
      fill="#DFE1E5"
      style="mix-blend-mode: multiply"
    />
    <path
      d="M78.852 120.01c-24.332.175-44.259-19.261-44.654-43.554-.394-24.292 18.89-44.364 43.214-44.978a44.086 44.086 0 0131.556 12.46c12.881 12.455 16.982 31.43 10.39 48.08-6.592 16.65-22.578 27.698-40.506 27.992zM77.55 42.042c-16.104.26-29.78 11.844-32.666 27.666-2.886 15.822 5.823 31.476 20.802 37.388 14.978 5.913 32.053.438 40.783-13.077 8.73-13.515 6.684-31.305-4.888-42.49a33.566 33.566 0 00-24.03-9.487z"
      fill="url(#na)"
    />
    <path
      d="M91.805 65.906l-4.088-3.99a1.532 1.532 0 00-2.167 0l-7.464 7.644-7.655-7.506a1.532 1.532 0 00-2.167 0l-4.019 4.082a1.528 1.528 0 000 2.163l7.655 7.483-7.494 7.644a1.528 1.528 0 000 2.164l4.088 4.013a1.532 1.532 0 002.166 0l7.495-7.644 7.656 7.483a1.532 1.532 0 002.166 0l4.02-4.082a1.528 1.528 0 000-2.163l-7.656-7.483 7.494-7.644a1.528 1.528 0 00-.03-2.164z"
      fill="#C1C7D0"
    />
  </g>
</svg>
