<svg
  xmlns="http://www.w3.org/2000/svg"
  enable-background="new 0 0 24 24"
  height="24"
  viewBox="0 0 24 24"
  width="24"
>
  <g>
    <path
      fill="currentColor"
      d="M16.56,8.94L7.62,0L6.21,1.41l2.38,2.38L3.44,8.94c-0.59,0.59-0.59,1.54,0,2.12l5.5,5.5C9.23,16.85,9.62,17,10,17 s0.77-0.15,1.06-0.44l5.5-5.5C17.15,10.48,17.15,9.53,16.56,8.94z M5.21,10L10,5.21L14.79,10H5.21z M19,11.5c0,0-2,2.17-2,3.5 c0,1.1,0.9,2,2,2s2-0.9,2-2C21,13.67,19,11.5,19,11.5z M2,20h20v4H2V20z"
    />
  </g>
</svg>
