<svg
  class="fui-Icon-filled CallToolbarInChatHeader__icon ___12fm75w f1w7gpdv fez10in fg4l7m0"
  fill="currentColor"
  aria-hidden="true"
  viewBox="0 0 20 20"
  xmlns="http://www.w3.org/2000/svg"
>
  <path
    d="M13 6.5A2.5 2.5 0 0 0 10.5 4h-6A2.5 2.5 0 0 0 2 6.5v7A2.5 2.5 0 0 0 4.5 16h6a2.5 2.5 0 0 0 2.5-2.5v-7Zm1 1.43v4.15l2.76 2.35a.75.75 0 0 0 1.24-.57V6.2a.75.75 0 0 0-1.23-.57L14 7.93Z"
    fill="currentColor"
  ></path>
</svg>
