<svg
  aria-hidden="true"
  width="24"
  height="24"
  viewBox="0 0 24 24"
  xmlns="http://www.w3.org/2000/svg"
>
  <path
    d="M9.04 19h5.92a3 3 0 0 1-5.92 0ZM12 2a7.5 7.5 0 0 1 7.5 7.5v4l1.42 3.16a.95.95 0 0 1-.87 1.34H3.95a.95.95 0 0 1-.86-1.34L4.5 13.5V9.24A7.5 7.5 0 0 1 12 2Z"
    fill="currentColor"
  ></path>
</svg>
