{
  "$schema": "https://docs.renovatebot.com/renovate-schema.json",
  "lockFileMaintenance": {
    "enabled": true,
    "schedule": "at any time"
  },
  "rebaseWhen": "behind-base-branch",
  "labels": [
    "auto-update",
    "{{manager}}"
  ],
  "packageRules": [
    {
      "matchUpdateTypes": [
        "lockFileMaintenance"
      ],
      "labels": [
        "auto-update",
        "lock-file-update"
      ]
    },
    {
      "matchUpdateTypes": [
        "major"
      ],
      "addLabels": [
        "major"
      ]
    },
    {
      "matchUpdateTypes": [
        "minor"
      ],
      "addLabels": [
        "minor"
      ]
    },
    {
      "matchUpdateTypes": [
        "patch"
      ],
      "addLabels": [
        "patch"
      ]
    }
  ]
}
