digraph manager_compiler_graph {
bwttKernel[shape=plaintext, label=<<TABLE  BORDER="1" CELLPADDING="1" CELLSPACING="1"><TR><TD BGCOLOR="white" BORDER="0" PORT="inputs" ROWSPAN="1" COLSPAN="1"><TABLE  BORDER="1" CELLPADDING="1" CELLSPACING="4"><TR><TD BGCOLOR="white" BORDER="1" PORT="si" ROWSPAN="1" COLSPAN="1">si<BR/>clk=STREAM (100MHz)<BR/>width=32<BR/>PULL el=1 ael=2</TD><TD BGCOLOR="white" BORDER="1" PORT="so" ROWSPAN="1" COLSPAN="1">so<BR/>clk=STREAM (100MHz)<BR/>width=32<BR/>PULL el=1 ael=2</TD></TR></TABLE></TD></TR><TR><TD BGCOLOR="white" BORDER="0" PORT="node_info" ROWSPAN="1" COLSPAN="1">Kernel : bwttKernel</TD></TR><TR><TD BGCOLOR="white" BORDER="0" PORT="outputs" ROWSPAN="1" COLSPAN="1"><TABLE  BORDER="1" CELLPADDING="1" CELLSPACING="4"><TR><TD BGCOLOR="white" BORDER="1" PORT="px" ROWSPAN="1" COLSPAN="1">px<BR/>clk=STREAM (100MHz)<BR/>width=32<BR/>PUSH 5</TD><TD BGCOLOR="white" BORDER="1" PORT="bx" ROWSPAN="1" COLSPAN="1">bx<BR/>clk=STREAM (100MHz)<BR/>width=32<BR/>PUSH 5</TD><TD BGCOLOR="white" BORDER="1" PORT="py" ROWSPAN="1" COLSPAN="1">py<BR/>clk=STREAM (100MHz)<BR/>width=32<BR/>PUSH 5</TD><TD BGCOLOR="white" BORDER="1" PORT="by" ROWSPAN="1" COLSPAN="1">by<BR/>clk=STREAM (100MHz)<BR/>width=32<BR/>PUSH 5</TD><TD BGCOLOR="white" BORDER="1" PORT="siRho" ROWSPAN="1" COLSPAN="1">siRho<BR/>clk=STREAM (100MHz)<BR/>width=32<BR/>PUSH 5</TD><TD BGCOLOR="white" BORDER="1" PORT="soRho" ROWSPAN="1" COLSPAN="1">soRho<BR/>clk=STREAM (100MHz)<BR/>width=32<BR/>PUSH 5</TD></TR></TABLE></TD></TR></TABLE>>];
secondKernel[shape=plaintext, label=<<TABLE  BORDER="1" CELLPADDING="1" CELLSPACING="1"><TR><TD BGCOLOR="white" BORDER="0" PORT="inputs" ROWSPAN="1" COLSPAN="1"><TABLE  BORDER="1" CELLPADDING="1" CELLSPACING="4"><TR><TD BGCOLOR="white" BORDER="1" PORT="px" ROWSPAN="1" COLSPAN="1">px<BR/>clk=STREAM (100MHz)<BR/>width=32<BR/>PULL el=1 ael=2</TD><TD BGCOLOR="white" BORDER="1" PORT="bx" ROWSPAN="1" COLSPAN="1">bx<BR/>clk=STREAM (100MHz)<BR/>width=32<BR/>PULL el=1 ael=2</TD><TD BGCOLOR="white" BORDER="1" PORT="py" ROWSPAN="1" COLSPAN="1">py<BR/>clk=STREAM (100MHz)<BR/>width=32<BR/>PULL el=1 ael=2</TD><TD BGCOLOR="white" BORDER="1" PORT="by" ROWSPAN="1" COLSPAN="1">by<BR/>clk=STREAM (100MHz)<BR/>width=32<BR/>PULL el=1 ael=2</TD><TD BGCOLOR="white" BORDER="1" PORT="siRho" ROWSPAN="1" COLSPAN="1">siRho<BR/>clk=STREAM (100MHz)<BR/>width=32<BR/>PULL el=1 ael=2</TD><TD BGCOLOR="white" BORDER="1" PORT="soRho" ROWSPAN="1" COLSPAN="1">soRho<BR/>clk=STREAM (100MHz)<BR/>width=32<BR/>PULL el=1 ael=2</TD></TR></TABLE></TD></TR><TR><TD BGCOLOR="white" BORDER="0" PORT="node_info" ROWSPAN="1" COLSPAN="1">Kernel : secondKernel</TD></TR><TR><TD BGCOLOR="white" BORDER="0" PORT="outputs" ROWSPAN="1" COLSPAN="1"><TABLE  BORDER="1" CELLPADDING="1" CELLSPACING="4"><TR><TD BGCOLOR="white" BORDER="1" PORT="output" ROWSPAN="1" COLSPAN="1">output<BR/>clk=STREAM (100MHz)<BR/>width=16<BR/>PUSH 5</TD></TR></TABLE></TD></TR></TABLE>>];
so[shape=plaintext, label=<<TABLE  BORDER="1" CELLPADDING="1" CELLSPACING="1"><TR><TD BGCOLOR="white" BORDER="0" PORT="node_info" ROWSPAN="1" COLSPAN="1">PCIe_From_Host_fwd : so</TD></TR><TR><TD BGCOLOR="white" BORDER="0" PORT="outputs" ROWSPAN="1" COLSPAN="1"><TABLE  BORDER="1" CELLPADDING="1" CELLSPACING="4"><TR><TD BGCOLOR="white" BORDER="1" PORT="so" ROWSPAN="1" COLSPAN="1">so<BR/>clk=STREAM (100MHz)<BR/>width=128<BR/>PULL el=1 ael=8</TD></TR></TABLE></TD></TR></TABLE>>];
si[shape=plaintext, label=<<TABLE  BORDER="1" CELLPADDING="1" CELLSPACING="1"><TR><TD BGCOLOR="white" BORDER="0" PORT="node_info" ROWSPAN="1" COLSPAN="1">PCIe_From_Host_fwd : si</TD></TR><TR><TD BGCOLOR="white" BORDER="0" PORT="outputs" ROWSPAN="1" COLSPAN="1"><TABLE  BORDER="1" CELLPADDING="1" CELLSPACING="4"><TR><TD BGCOLOR="white" BORDER="1" PORT="si" ROWSPAN="1" COLSPAN="1">si<BR/>clk=STREAM (100MHz)<BR/>width=128<BR/>PULL el=1 ael=8</TD></TR></TABLE></TD></TR></TABLE>>];
output[shape=plaintext, label=<<TABLE  BORDER="1" CELLPADDING="1" CELLSPACING="1"><TR><TD BGCOLOR="white" BORDER="0" PORT="inputs" ROWSPAN="1" COLSPAN="1"><TABLE  BORDER="1" CELLPADDING="1" CELLSPACING="4"><TR><TD BGCOLOR="white" BORDER="1" PORT="output" ROWSPAN="1" COLSPAN="1">output<BR/>clk=STREAM (100MHz)<BR/>width=128<BR/>PUSH 64</TD></TR></TABLE></TD></TR><TR><TD BGCOLOR="white" BORDER="0" PORT="node_info" ROWSPAN="1" COLSPAN="1">PCIe_To_Host_fwd : output</TD></TR></TABLE>>];
so -> bwttKernel [headport="so" tailport="so" label="{D{data:1}}"]
si -> bwttKernel [headport="si" tailport="si" label="{D{data:1}}"]
bwttKernel -> secondKernel [headport="px" tailport="px" label="{D{data:1}}"]
bwttKernel -> secondKernel [headport="bx" tailport="bx" label="{D{data:1}}"]
bwttKernel -> secondKernel [headport="py" tailport="py" label="{D{data:1}}"]
bwttKernel -> secondKernel [headport="by" tailport="by" label="{D{data:1}}"]
bwttKernel -> secondKernel [headport="soRho" tailport="soRho" label="{D{data:1}}"]
bwttKernel -> secondKernel [headport="siRho" tailport="siRho" label="{D{data:1}}"]
secondKernel -> output [headport="output" tailport="output" label="{D{data:1}}"]
}
