2,NodeCounterV1,3
4,NodeEq,3
7,NodeAnd,4
8,NodeInput,4
29,NodeCast,3
57,NodeMappedRom,7
32,NodeMul,9
11,NodeAnd,12
12,NodeInput,12
33,NodeAdd,17
55,NodeMappedRom,21
30,NodeCast,23
34,NodeSub,29
38,NodeMul,41
15,NodeAnd,4
16,NodeInput,4
35,NodeMul,9
19,NodeAnd,12
20,NodeInput,12
36,NodeAdd,17
56,NodeMappedRom,21
31,NodeCast,23
37,NodeSub,29
39,NodeMul,41
40,NodeAdd,49
42,NodeLt,61
23,NodeAnd,4
24,NodeInput,4
43,NodeLt,9
44,NodeAnd,63
27,NodeAnd,4
28,NodeInput,4
45,NodeGt,9
46,NodeAnd,64
49,NodeMux,65
54,NodeOutput,66
60,NodeCounterV1,3
61,NodeStreamOffset,3
63,NodeOutputMappedReg,4
66,NodeCounterV1,0
69,NodeEq,0
67,NodeFlush,1
