Welcome to the CBC MILP Solver 
Version: 2.8.9 
Build Date: Oct 25 2014 

command line - cbc secondKernel_schedule_C.mps.gz -threads 4 -solve -printi csv -solu secondKernel_schedule_C.csv (default strategy 1)
At line 1 NAME           CxSchedule
At line 2 ROWS
At line 116 COLUMNS
At line 286 RHS
At line 344 BOUNDS
At line 429 ENDATA
Problem CxSchedule has 112 rows, 84 columns and 276 elements
Coin0008I CxSchedule read with 0 errors
threads was changed from 0 to 4
Continuous objective value is 293 - 0.00 seconds
Cgl0003I 0 fixed, 117 tightened bounds, 0 strengthened rows, 0 substitutions
Cgl0003I 0 fixed, 62 tightened bounds, 0 strengthened rows, 0 substitutions
Cgl0003I 0 fixed, 44 tightened bounds, 0 strengthened rows, 0 substitutions
Cgl0003I 0 fixed, 16 tightened bounds, 0 strengthened rows, 0 substitutions
Cgl0003I 0 fixed, 1 tightened bounds, 0 strengthened rows, 0 substitutions
Cgl0004I processed model has 108 rows, 81 columns (81 integer) and 266 elements
Cutoff increment increased from 1e-05 to 0.9999
Cbc0012I Integer solution of 293 found by DiveCoefficient after 0 iterations and 0 nodes (0.00 seconds)
Cbc0030I Thread 0 used 0 times,  waiting to start 0.00080442429, 0 cpu time, 0 locks, 0 locked, 0 waiting for locks
Cbc0030I Thread 1 used 0 times,  waiting to start 0.00077438354, 0 cpu time, 0 locks, 0 locked, 0 waiting for locks
Cbc0030I Thread 2 used 0 times,  waiting to start 0.00064492226, 0 cpu time, 0 locks, 0 locked, 0 waiting for locks
Cbc0030I Thread 3 used 0 times,  waiting to start 0.00058364868, 0 cpu time, 0 locks, 0 locked, 0 waiting for locks
Cbc0030I Main thread 0 waiting for threads,  1 locks, 3.8146973e-06 locked, 2.3841858e-07 waiting for locks
Cbc0001I Search completed - best objective 293, took 0 iterations and 0 nodes (0.00 seconds)
Cbc0035I Maximum depth 0, 0 variables fixed on reduced cost
Cuts at root node changed objective from 293 to 293
Probing was tried 0 times and created 0 cuts of which 0 were active after adding rounds of cuts (0.000 seconds)
Gomory was tried 0 times and created 0 cuts of which 0 were active after adding rounds of cuts (0.000 seconds)
Knapsack was tried 0 times and created 0 cuts of which 0 were active after adding rounds of cuts (0.000 seconds)
Clique was tried 0 times and created 0 cuts of which 0 were active after adding rounds of cuts (0.000 seconds)
MixedIntegerRounding2 was tried 0 times and created 0 cuts of which 0 were active after adding rounds of cuts (0.000 seconds)
FlowCover was tried 0 times and created 0 cuts of which 0 were active after adding rounds of cuts (0.000 seconds)
TwoMirCuts was tried 0 times and created 0 cuts of which 0 were active after adding rounds of cuts (0.000 seconds)

Result - Optimal solution found

Objective value:                293.00000000
Enumerated nodes:               0
Total iterations:               0
Time (CPU seconds):             0.01
Time (Wallclock seconds):       0.01

Option for printingOptions changed from normal to csv
Total time (CPU seconds):       0.01   (Wallclock seconds):       0.01

