Mon 16:44: PROGRESS: MaxCompiler version: 2014.1.1
Mon 16:44: PROGRESS: Build "bwtt" start time: Mon Jan 02 16:44:04 GMT 2017
Mon 16:44: PROGRESS: Main build process running as user yangma on host MaxelerBox.neuroscience
Mon 16:44: INFO    : Loading build properties from bundled MaxCompiler_build.conf...
Mon 16:44: INFO    : Loading default build properties from /opt/maxeler/MaxCompiler_build.conf
Mon 16:44: INFO    : User build properties not found in file: /home/yangma/.MaxCompiler_build_user.conf
Mon 16:44: INFO    : No user-specified external build property file has been specified.
Mon 16:44: INFO    : (Set environment variable MAXCOMPILER_BUILD_CONF_FILE to assign one)
Mon 16:44: INFO    : Loading additional parameters from MAXCOMPILER_BUILD_CONF environment variable
Mon 16:44: PROGRESS: Build location: /home/yangma/workspace/BWTT/RunRules/DFE/maxfiles/bwtt_VECTIS_DFE
Mon 16:44: PROGRESS: Detailed build log available in "_build.log"
Mon 16:44: INFO    : Created build manager bwtt (bwtt_VECTIS_DFE Mon Jan 02 16:44:04 GMT 2017). (16:44:04 02/01/17)
Mon 16:44: INFO    : Working in dir: /home/yangma/workspace/BWTT/RunRules/DFE/maxfiles/bwtt_VECTIS_DFE
Mon 16:44: INFO    : Java class path (2 paths):
Mon 16:44: INFO    : 	/home/yangma/workspace/BWTT/EngineCode/bin
Mon 16:44: INFO    : 	/opt/maxeler/maxcompiler-2014.1.1/lib/MaxCompiler.jar
Mon 16:44: INFO    : Java process started by 'main' method in class 'bwtt.bwttManager'.
Mon 16:44: INFO    : build.arbitrated_core_cache parameter is blank, not using core-cache
Mon 16:44: INFO    : Checking license files in directory: /home/yangma/Lics/
Mon 16:44: INFO    : All license signatures valid.
Mon 16:44: INFO    : Backing-up source-files (old source files in build directory will be removed first)...
Mon 16:44: INFO    : Source directories: /home/yangma/workspace/BWTT/EngineCode/src:
Mon 16:44: INFO    : Not deleting directory (does not exist): src
Mon 16:44: INFO    : Copying source-files took 1.66663 ms
Mon 16:44: PROGRESS: Instantiating manager
Mon 16:44: PROGRESS: Instantiating kernel "bwttKernel"
Mon 16:44: WARNING : Floating-point casts ignore set rounding mode and use TONEAREVEN rounding only.
Mon 16:44: PROGRESS: Compiling manager (CPU I/O Only)
Mon 16:44: INFO    : Manager Configuration:
Mon 16:44: INFO    : 	ManagerConfiguration.allowNonMultipleTransitions = false                                                         [Init: false]
Mon 16:44: INFO    : 	ManagerConfiguration.board = MAX3424A                                                                            [Init: null, init: MAX3424A]
Mon 16:44: INFO    : 	ManagerConfiguration.build.buildEffort = MEDIUM                                                                  [Init: MEDIUM]
Mon 16:44: INFO    : 	ManagerConfiguration.build.enableChipScopeInserter = false                                                       [Init: false]
Mon 16:44: INFO    : 	ManagerConfiguration.build.enableTimingAnalysis = true                                                           [Init: true]
Mon 16:44: INFO    : 	ManagerConfiguration.build.level = FULL_BUILD                                                                    [Init: FULL_BUILD]
Mon 16:44: INFO    : 	ManagerConfiguration.build.mpprContinueAfterMeetingTiming = false                                                [Init: false]
Mon 16:44: INFO    : 	ManagerConfiguration.build.mpprCtMax = 1                                                                         [Init: 1]
Mon 16:44: INFO    : 	ManagerConfiguration.build.mpprCtMin = 1                                                                         [Init: 1]
Mon 16:44: INFO    : 	ManagerConfiguration.build.mpprParallelism = 1                                                                   [Init: 1]
Mon 16:44: INFO    : 	ManagerConfiguration.build.mpprRetryMissesThrshld = 0                                                            [Init: 0]
Mon 16:44: INFO    : 	ManagerConfiguration.build.optGoal = BALANCED                                                                    [Init: BALANCED]
Mon 16:44: INFO    : 	ManagerConfiguration.build.physSynthAsyncPipelining = AUTO                                                       [Init: AUTO]
Mon 16:44: INFO    : 	ManagerConfiguration.build.physSynthCombLogic = AUTO                                                             [Init: AUTO]
Mon 16:44: INFO    : 	ManagerConfiguration.build.physSynthCombLogicForArea = AUTO                                                      [Init: AUTO]
Mon 16:44: INFO    : 	ManagerConfiguration.build.physSynthEffort = AUTO                                                                [Init: AUTO]
Mon 16:44: INFO    : 	ManagerConfiguration.build.physSynthRegDuplication = AUTO                                                        [Init: AUTO]
Mon 16:44: INFO    : 	ManagerConfiguration.build.physSynthRetiming = AUTO                                                              [Init: AUTO]
Mon 16:44: INFO    : 	ManagerConfiguration.build.physicalSynthesis = false                                                             [Init: false]
Mon 16:44: INFO    : 	ManagerConfiguration.buildTarget = DFE                                                                           [Init: null, init: DFE]
Mon 16:44: INFO    : 	ManagerConfiguration.debug.chipscopeCaptureDepth = 4096                                                          [Init: 4096]
Mon 16:44: INFO    : 	ManagerConfiguration.debug.fifoUnderOverFlowRegs = false                                                         [Init: false]
Mon 16:44: INFO    : 	ManagerConfiguration.debug.memCtlDebugRegs = true                                                                [Init: true]
Mon 16:44: INFO    : 	ManagerConfiguration.debug.memCtlExtraDebugRegs = false                                                          [Init: false]
Mon 16:44: INFO    : 	ManagerConfiguration.debug.memMarginingSupport = false                                                           [Init: false]
Mon 16:44: INFO    : 	ManagerConfiguration.debug.memPhyDebugRegister = NONE                                                            [Init: NONE]
Mon 16:44: INFO    : 	ManagerConfiguration.debug.memPllLockDebugRegs = true                                                            [Init: true]
Mon 16:44: INFO    : 	ManagerConfiguration.debug.streamStatus = false                                                                  [Init: false]
Mon 16:44: INFO    : 	ManagerConfiguration.debug.streamStatusChecksums = false                                                         [Init: false]
Mon 16:44: INFO    : 	ManagerConfiguration.dram.addressGeneratorsInSlowClock = false                                                   [Init: false]
Mon 16:44: INFO    : 	ManagerConfiguration.dram.arbitrationMode = ROUND_ROBIN                                                          [Init: ROUND_ROBIN]
Mon 16:44: INFO    : 	ManagerConfiguration.dram.burstSize = 8                                                                          [Init: 8]
Mon 16:44: INFO    : 	ManagerConfiguration.dram.cmdFifoInReg = false                                                                   [Init: false]
Mon 16:44: INFO    : 	ManagerConfiguration.dram.cmdFifoLutRam = false                                                                  [Init: false]
Mon 16:44: INFO    : 	ManagerConfiguration.dram.cmdFifoRegInRam = true                                                                 [Init: true]
Mon 16:44: INFO    : 	ManagerConfiguration.dram.cmdFifoSize = 31                                                                       [Init: 31]
Mon 16:44: INFO    : 	ManagerConfiguration.dram.commandEchoModeEnabled = false                                                         [Init: false]
Mon 16:44: INFO    : 	ManagerConfiguration.dram.commandEchoModeFifoDepth = 512                                                         [Init: 512]
Mon 16:44: INFO    : 	ManagerConfiguration.dram.commandEchoModeStreamAlmostEmptyLatency = 792                                          [Init: 792]
Mon 16:44: INFO    : 	ManagerConfiguration.dram.commandEchoModeStreamAlmostEmptyLatency = 8                                            [Init: 8]
Mon 16:44: INFO    : 	ManagerConfiguration.dram.commandEchoModeStreamStallLatency = 8                                                  [Init: 8]
Mon 16:44: INFO    : 	ManagerConfiguration.dram.dataFifoDepth = 512                                                                    [Init: 512]
Mon 16:44: INFO    : 	ManagerConfiguration.dram.dataFifoLutRam = false                                                                 [Init: false]
Mon 16:44: INFO    : 	ManagerConfiguration.dram.dataFifoWidth = 792                                                                    [Init: 792]
Mon 16:44: INFO    : 	ManagerConfiguration.dram.eccMode = false                                                                        [Init: false]
Mon 16:44: INFO    : 	ManagerConfiguration.dram.fabricDataFifoReg = true                                                               [Init: true]
Mon 16:44: INFO    : 	ManagerConfiguration.dram.fabricRdDataFifoReg = false                                                            [Init: false]
Mon 16:44: INFO    : 	ManagerConfiguration.dram.flagSupport = false                                                                    [Init: false]
Mon 16:44: INFO    : 	ManagerConfiguration.dram.highPrioStream = false                                                                 [Init: false]
Mon 16:44: INFO    : 	ManagerConfiguration.dram.max2CompatMode = false                                                                 [Init: false]
Mon 16:44: INFO    : 	ManagerConfiguration.dram.max4m_MAIA_MCP_UseRefClk = false                                                       [Init: false]
Mon 16:44: INFO    : 	ManagerConfiguration.dram.max4qrateMode = false                                                                  [Init: false]
Mon 16:44: INFO    : 	ManagerConfiguration.dram.memCmdIncSize = 8                                                                      [Init: 8]
Mon 16:44: INFO    : 	ManagerConfiguration.dram.memCmdStartAddrSize = 32                                                               [Init: 32]
Mon 16:44: INFO    : 	ManagerConfiguration.dram.onCardMemFreq = 303.0                                                                  [Init: 0.0, change: 303.0]
Mon 16:44: INFO    : 	ManagerConfiguration.dram.parEccDebugStream = false                                                              [Init: false]
Mon 16:44: INFO    : 	ManagerConfiguration.dram.parityEccWidth = 0                                                                     [Init: 0]
Mon 16:44: INFO    : 	ManagerConfiguration.dram.parityMode = false                                                                     [Init: false]
Mon 16:44: INFO    : 	ManagerConfiguration.dram.perdqsPhaseDetect = false                                                              [Init: false]
Mon 16:44: INFO    : 	ManagerConfiguration.dram.performanceMode = true                                                                 [Init: true]
Mon 16:44: INFO    : 	ManagerConfiguration.enableMPCX = false                                                                          [Init: false, init: false]
Mon 16:44: INFO    : 	ManagerConfiguration.maxring.maxringConnections = []                                                             [Init: []]
Mon 16:44: INFO    : 	ManagerConfiguration.maxring.maxringNumLanes = {MAXRING_LITE_B=1, MAXRING_LITE_A=1, MAXRING_A=2, MAXRING_B=2}    [Init: {}]
Mon 16:44: INFO    : 	ManagerConfiguration.multiCycleMappedMemoryBus = false                                                           [Init: false]
Mon 16:44: INFO    : 	ManagerConfiguration.network.qsfpBotMode = QSFP_OFF                                                              [Init: QSFP_OFF]
Mon 16:44: INFO    : 	ManagerConfiguration.network.qsfpMidMode = QSFP_OFF                                                              [Init: QSFP_OFF]
Mon 16:44: INFO    : 	ManagerConfiguration.network.qsfpTopMode = QSFP_OFF                                                              [Init: QSFP_OFF]
Mon 16:44: INFO    : 	ManagerConfiguration.pcie.numPCIeLanes = 0                                                                       [Init: 0]
Mon 16:44: INFO    : 	ManagerConfiguration.pcie.pcieFastClock = false                                                                  [Init: false]
Mon 16:44: INFO    : 	ManagerConfiguration.pcie.streamFromHostMaxNum = 8                                                               [Init: 0, change: 8]
Mon 16:44: INFO    : 	ManagerConfiguration.pcie.streamToHostMaxNum = 8                                                                 [Init: 0, change: 8]
Mon 16:44: INFO    : 	ManagerConfiguration.persona.boardModel = MAX3424A                                                               [Init: null, change: MAX3424A]
Mon 16:44: INFO    : 	ManagerConfiguration.persona.ddr3Enable = false                                                                  [Init: false]
Mon 16:44: INFO    : 	ManagerConfiguration.persona.ddr3Frq = 303.0                                                                     [Init: 400.0, change: 303.0]
Mon 16:44: INFO    : 	ManagerConfiguration.persona.ddr3Qmode = false                                                                   [Init: false]
Mon 16:44: INFO    : 	ManagerConfiguration.persona.disableMultiplePersona = true                                                       [Init: true]
Mon 16:44: INFO    : 	ManagerConfiguration.persona.dynamic_scaling = false                                                             [Init: false]
Mon 16:44: INFO    : 	ManagerConfiguration.persona.maxRingLocal = false                                                                [Init: false]
Mon 16:44: INFO    : 	ManagerConfiguration.persona.maxRingOptical = false                                                              [Init: false]
Mon 16:44: INFO    : 	ManagerConfiguration.persona.maxringDataRate = 2500.0                                                            [Init: 2500.0]
Mon 16:44: INFO    : 	ManagerConfiguration.persona.maxringOpticalDataRate = 10000.0                                                    [Init: 10000.0]
Mon 16:44: INFO    : 	ManagerConfiguration.persona.mode = InitMode                                                                     [Init: InitMode]
Mon 16:44: INFO    : 	ManagerConfiguration.persona.networkPTP = OFF                                                                    [Init: OFF]
Mon 16:44: INFO    : 	ManagerConfiguration.persona.networkQSFP_BOT = QSFP_OFF                                                          [Init: QSFP_OFF]
Mon 16:44: INFO    : 	ManagerConfiguration.persona.networkQSFP_MID = QSFP_OFF                                                          [Init: QSFP_OFF]
Mon 16:44: INFO    : 	ManagerConfiguration.persona.networkQSFP_TOP = QSFP_OFF                                                          [Init: QSFP_OFF]
Mon 16:44: INFO    : 	ManagerConfiguration.persona.panMaxRingA = false                                                                 [Init: false]
Mon 16:44: INFO    : 	ManagerConfiguration.persona.panMaxRingB = false                                                                 [Init: false]
Mon 16:44: INFO    : 	ManagerConfiguration.persona.personaInterfaceVersion = 1                                                         [Init: 1]
Mon 16:44: INFO    : 	ManagerConfiguration.persona.qdr2Enable = false                                                                  [Init: false]
Mon 16:44: INFO    : 	ManagerConfiguration.persona.qdr2Frq = 550.0                                                                     [Init: 550.0]
Mon 16:44: INFO    : 	ManagerConfiguration.persona.streamClks = 1                                                                      [Init: 1]
Mon 16:44: INFO    : 	ManagerConfiguration.persona.streamFrq = [100.0]                                                                 [Init: [150.0], change: [100.0]]
Mon 16:44: INFO    : 	ManagerConfiguration.persona.streamPs = [0]                                                                      [Init: [0]]
Mon 16:44: INFO    : 	ManagerConfiguration.persona.usePCIeGen1 = false                                                                 [Init: false]
Mon 16:44: INFO    : 	ManagerConfiguration.simulation.nativeFloatingPoint = false                                                      [Init: false]
Mon 16:44: INFO    : 	ManagerConfiguration.streamClockFrq = 100                                                                        [Init: 100]
Mon 16:44: INFO    : 	ManagerConfiguration.useLegacyStreamFIFOs = false                                                                [Init: false]
Mon 16:44: INFO    : 
Mon 16:44: INFO    :  -- 
Mon 16:44: INFO    : Running manager compiler graph-pass: GenerateMXGInfo
Mon 16:44: INFO    : Running manager compiler graph-pass: ScheduleStallLatency
Mon 16:44: INFO    : Running manager compiler graph-pass: ClockWidthAssignment
Mon 16:44: INFO    : Running manager compiler graph-pass: InsertDualAspectLogic
Mon 16:44: INFO    : Running manager compiler graph-pass: ClockWidthAssignment
Mon 16:44: INFO    : Running manager compiler graph-pass: InsertPullPushAdapter
Mon 16:44: INFO    : Running manager compiler graph-pass: ClockWidthAssignment
Mon 16:44: INFO    : Running manager compiler graph-pass: InsertStreamFifos
Mon 16:44: INFO    : Running manager compiler graph-pass: ClockWidthAssignment
Mon 16:44: INFO    : Running manager compiler graph-pass: InsertStreamStatus
Mon 16:44: INFO    : Running manager compiler graph-pass: InsertChipscope
Mon 16:44: INFO    : Inserted 0 chipscope manager nodes.
Mon 16:44: INFO    : Running manager compiler graph-pass: ClockWidthAssignment
Mon 16:44: INFO    : Running manager compiler graph-pass: ReportClockAssignments
Mon 16:44: PROGRESS: 
Mon 16:44: PROGRESS: Compiling kernel "bwttKernel"
Mon 16:44: INFO    : Configuration:
Mon 16:44: INFO    : 	KernelConfiguration.additionalInputPipelining = 64                                          [Init: 64]
Mon 16:44: INFO    : 	KernelConfiguration.allowDSPCascading = true                                                [Init: true]
Mon 16:44: INFO    : 	KernelConfiguration.allowInputsOutputsBeforeFlushNode = false                               [Init: false]
Mon 16:44: INFO    : 	KernelConfiguration.allowZeroLatencyNodeHold = false                                        [Init: false]
Mon 16:44: INFO    : 	KernelConfiguration.board = MAX3424A                                                        [Init: MAX2116B, change: MAX3424A]
Mon 16:44: INFO    : 	KernelConfiguration.bramBitsThreshold = 2080                                                [Init: 2080]
Mon 16:44: INFO    : 	KernelConfiguration.buildTarget = HARDWARE                                                  [Init: NONE, change: HARDWARE]
Mon 16:44: INFO    : 	KernelConfiguration.cePipelining = 2                                                        [Init: 2]
Mon 16:44: INFO    : 	KernelConfiguration.clockPhaseBalanceThreshold = 0.1                                        [Init: 0.1]
Mon 16:44: INFO    : 	KernelConfiguration.clockPhasingRetries = 50                                                [Init: 50]
Mon 16:44: INFO    : 	KernelConfiguration.dumpNeighboursString =                                                  [Init: ]
Mon 16:44: INFO    : 	KernelConfiguration.enableCeReplication = true                                              [Init: true]
Mon 16:44: INFO    : 	KernelConfiguration.enableClockPhasePartitioning = false                                    [Init: false]
Mon 16:44: INFO    : 	KernelConfiguration.enableDebugIOControlRegs = true                                         [Init: true]
Mon 16:44: INFO    : 	KernelConfiguration.enableDummyBuild = false                                                [Init: false]
Mon 16:44: INFO    : 	KernelConfiguration.enableKernelProfiler = false                                            [Init: false]
Mon 16:44: INFO    : 	KernelConfiguration.enablePipelinedComputeController = false                                [Init: false]
Mon 16:44: INFO    : 	KernelConfiguration.enableShadowRegister = false                                            [Init: false]
Mon 16:44: INFO    : 	KernelConfiguration.enableSmartKernelControl = false                                        [Init: false]
Mon 16:44: INFO    : 	KernelConfiguration.fifoSrlRegisterStages = 1                                               [Init: 1]
Mon 16:44: INFO    : 	KernelConfiguration.flushOnInputDataCongtiguous = false                                     [Init: false]
Mon 16:44: INFO    : 	KernelConfiguration.hardwareDebugDepth = 512                                                [Init: 512]
Mon 16:44: INFO    : 	KernelConfiguration.hwHierarchyMode = UNSET                                                 [Init: UNSET]
Mon 16:44: INFO    : 	KernelConfiguration.latencyAnnotation = false                                               [Init: false]
Mon 16:44: INFO    : 	KernelConfiguration.latencyAnnotationIOs =                                                  [Init: null]
Mon 16:44: INFO    : 	KernelConfiguration.maxCoalescedFifoWidth = 2147483647                                      [Init: 2147483647]
Mon 16:44: INFO    : 	KernelConfiguration.maxPreAdderFanOut = 1                                                   [Init: 1]
Mon 16:44: INFO    : 	KernelConfiguration.netlistMode = false                                                     [Init: false]
Mon 16:44: INFO    : 	KernelConfiguration.numPhotonStateMachines = 1                                              [Init: 1]
Mon 16:44: INFO    : 	KernelConfiguration.optimizations.ceCounterRegisterDuplication = 1                          [Init: 1]
Mon 16:44: INFO    : 	KernelConfiguration.optimizations.conditionalArithmetic = false                             [Init: true, Init after BuildTarget change: false]
Mon 16:44: INFO    : 	KernelConfiguration.optimizations.counterChainWrapPipelining = 0                            [Init: 0]
Mon 16:44: INFO    : 	KernelConfiguration.optimizations.dspAddChain = OPTIMISE_IGNORE_PREADDER                    [Init: null, Init after BuildTarget change: OPTIMISE_IGNORE_PREADDER]
Mon 16:44: INFO    : 	KernelConfiguration.optimizations.enableActiveFanoutReduction = false                       [Init: false]
Mon 16:44: INFO    : 	KernelConfiguration.optimizations.enableBUFGCE = false                                      [Init: false]
Mon 16:44: INFO    : 	KernelConfiguration.optimizations.enableBetterInputRegistering = false                      [Init: false]
Mon 16:44: INFO    : 	KernelConfiguration.optimizations.enableBetterRegistering = false                           [Init: false]
Mon 16:44: INFO    : 	KernelConfiguration.optimizations.enableFIFOCoalescingAcrossPlacementConstraints = false    [Init: false]
Mon 16:44: INFO    : 	KernelConfiguration.optimizations.enableFifoCoalescing = true                               [Init: true]
Mon 16:44: INFO    : 	KernelConfiguration.optimizations.enableFullPrecisionBinaryOpConstants = false              [Init: false]
Mon 16:44: INFO    : 	KernelConfiguration.optimizations.enableIntegratedRounding = false                          [Init: false]
Mon 16:44: INFO    : 	KernelConfiguration.optimizations.enableMappedMemoryHostReadBack = true                     [Init: true]
Mon 16:44: INFO    : 	KernelConfiguration.optimizations.enableMultiCycleReset = false                             [Init: false]
Mon 16:44: INFO    : 	KernelConfiguration.optimizations.enablePowerTwoFloatMult = true                            [Init: true]
Mon 16:44: INFO    : 	KernelConfiguration.optimizations.enableRedundantNodeDeletion = true                        [Init: true]
Mon 16:44: INFO    : 	KernelConfiguration.optimizations.enableStateMachineRegisterMerging = true                  [Init: true]
Mon 16:44: INFO    : 	KernelConfiguration.optimizations.inputFlushDistanceFactor = 0                              [Init: 0]
Mon 16:44: INFO    : 	KernelConfiguration.optimizations.minimumStaticFIFOSplitDepth = 1                           [Init: 1]
Mon 16:44: INFO    : 	KernelConfiguration.optimizations.optimizationTechnique = DEFAULT                           [Init: DEFAULT]
Mon 16:44: INFO    : 	KernelConfiguration.optimizations.triAdd = false                                            [Init: true, Init after BuildTarget change: false]
Mon 16:44: INFO    : 	KernelConfiguration.partialReconfBlockName =                                                [Init: ]
Mon 16:44: INFO    : 	KernelConfiguration.partialReconfMode = false                                               [Init: false]
Mon 16:44: INFO    : 	KernelConfiguration.partialReconfTemplate = false                                           [Init: false]
Mon 16:44: INFO    : 	KernelConfiguration.replicateNodeCeLog2NumPartitions = 0                                    [Init: 0]
Mon 16:44: INFO    : 	KernelConfiguration.romBRAMBitsThreshold = 2080                                             [Init: 2080]
Mon 16:44: INFO    : 	KernelConfiguration.simulation.ramAddressCollisionBehaviour = EXCEPTION                     [Init: EXCEPTION]
Mon 16:44: INFO    : 	KernelConfiguration.simulation.ramOutOfBoundsAccessBehaviour = EXCEPTION                    [Init: EXCEPTION]
Mon 16:44: INFO    : 	KernelConfiguration.simulation.simProgressMessageFrequency = 0                              [Init: 0]
Mon 16:44: INFO    : 
Mon 16:44: INFO    :  -- 
Mon 16:44: INFO    : Writing current graph to: bwtt-bwttKernel-original.pxg
Mon 16:44: INFO    : Running kernel graph-pass 'GeneratePXG'.
Mon 16:44: INFO    : Graph-pass 'GeneratePXG' took 135.350 ms (1 iterations)
Mon 16:44: INFO    : Running kernel graph-pass 'MarkConstantPass'.
Mon 16:44: INFO    : Graph-pass 'MarkConstantPass' took 1.48466 ms (1 iterations)
Mon 16:44: INFO    : Running kernel graph-pass 'ReachabilityPass'.
Mon 16:44: INFO    : Graph-pass 'ReachabilityPass' took 3.25744 ms (1 iterations)
Mon 16:44: INFO    : Running kernel graph-pass 'FindInputsLeadingToFlush'.
Mon 16:44: INFO    : Graph-pass 'FindInputsLeadingToFlush' took 80.3880 µs (1 iterations)
Mon 16:44: INFO    : Running kernel graph-pass 'CheckForStatefulToFlushViolations'.
Mon 16:44: INFO    : Graph-pass 'CheckForStatefulToFlushViolations' took 227.625 µs (1 iterations)
Mon 16:44: INFO    : Running kernel graph-pass 'CheckForInputToFlushViolations'.
Mon 16:44: INFO    : Graph-pass 'CheckForInputToFlushViolations' took 635.872 µs (1 iterations)
Mon 16:44: INFO    : Not deleting directory (does not exist): neighbours
Mon 16:44: INFO    : Running Photon pre-schedule graph optimisations
Mon 16:44: INFO    : Running kernel graph-pass 'AlignOrEradicatePrintfs'.
Mon 16:44: INFO    : Graph-pass 'AlignOrEradicatePrintfs' took 133.826 µs (1 iterations)
Mon 16:44: INFO    : Running kernel graph-pass 'FoldConstantsPass'.
Mon 16:44: INFO    : Graph-pass 'FoldConstantsPass' took 825.190 µs (1 iterations)
Mon 16:44: INFO    : Running kernel graph-pass 'OptimiseNodesPass'.
Mon 16:44: INFO    : Graph-pass 'OptimiseNodesPass' took 6.17249 ms (2 iterations)
Mon 16:44: INFO    : Running kernel graph-pass 'DeleteRedundantNodes'.
Mon 16:44: INFO    : Graph-pass 'DeleteRedundantNodes' took 5.42957 ms (2 iterations)
Mon 16:44: INFO    : Running kernel graph-pass 'DSPMultiplyAddExtractionPass'.
Mon 16:44: INFO    : Optimized 0 sub-graphs into DSP multiply/add chains (Virtex5 mode).
Mon 16:44: INFO    : Graph-pass 'DSPMultiplyAddExtractionPass' took 12.4725 ms (1 iterations)
Mon 16:44: INFO    : Running kernel graph-pass 'PO2FPMultOptimiser'.
Mon 16:44: INFO    : Graph-pass 'PO2FPMultOptimiser' took 173.233 µs (1 iterations)
Mon 16:44: INFO    : Logging Photon stats to: bwttKernel_photon_stats.csv
Mon 16:44: INFO    : Running kernel graph-pass 'StatsPass'.
Mon 16:44: INFO    : Graph-pass 'StatsPass' took 1.45842 ms (1 iterations)
Mon 16:44: INFO    : Running kernel graph-pass 'CollectNumericExceptions'.
Mon 16:44: INFO    : Graph-pass 'CollectNumericExceptions' took 139.607 µs (1 iterations)
Mon 16:44: INFO    : Running kernel graph-pass 'StreamOffsetDivExpand'.
Mon 16:44: INFO    : Graph-pass 'StreamOffsetDivExpand' took 75.6110 µs (1 iterations)
Mon 16:44: INFO    : Running kernel graph-pass 'FindIllegalLoops'.
Mon 16:44: INFO    : Graph-pass 'FindIllegalLoops' took 664.890 µs (1 iterations)
Mon 16:44: INFO    : Running kernel graph-pass 'MarkConstantPass'.
Mon 16:44: INFO    : Graph-pass 'MarkConstantPass' took 260.917 µs (1 iterations)
Mon 16:44: INFO    : Running kernel graph-pass 'ScheduleVariables'.
Mon 16:44: INFO    : Graph-pass 'ScheduleVariables' took 2.44545 ms (1 iterations)
Mon 16:44: INFO    : Running kernel graph-pass 'SubstituteEqPlaceholders'.
Mon 16:44: INFO    : Graph-pass 'SubstituteEqPlaceholders' took 61.2720 µs (1 iterations)
Mon 16:44: INFO    : Running kernel graph-pass 'ScheduleApplier'.
Mon 16:44: INFO    : Graph-pass 'ScheduleApplier' took 2.27209 ms (1 iterations)
Mon 16:44: INFO    : Running kernel graph-pass 'MarkConstantPass'.
Mon 16:44: INFO    : Graph-pass 'MarkConstantPass' took 246.362 µs (1 iterations)
Mon 16:44: INFO    : Running kernel graph-pass 'ScheduleDumper'.
Mon 16:44: INFO    : Graph-pass 'ScheduleDumper' took 1.55316 ms (1 iterations)
Mon 16:44: INFO    : Running Photon post-schedule graph optimisations (pass 1)
Mon 16:44: INFO    : Running kernel graph-pass 'TapFIFOsPass'.
Mon 16:44: INFO    : Graph-pass 'TapFIFOsPass' took 858.171 µs (1 iterations)
Mon 16:44: INFO    : Running kernel graph-pass 'FoldFIFOsPass'.
Mon 16:44: INFO    : Graph-pass 'FoldFIFOsPass' took 306.289 µs (1 iterations)
Mon 16:44: INFO    : Running kernel graph-pass 'MarkConstantPass'.
Mon 16:44: INFO    : Graph-pass 'MarkConstantPass' took 259.875 µs (1 iterations)
Mon 16:44: INFO    : Running kernel graph-pass 'ValidateFIFOs'.
Mon 16:44: INFO    : Graph-pass 'ValidateFIFOs' took 122.608 µs (1 iterations)
Mon 16:44: INFO    : Running kernel graph-pass 'MarkConstantPass'.
Mon 16:44: INFO    : Graph-pass 'MarkConstantPass' took 267.746 µs (1 iterations)
Mon 16:44: INFO    : Running kernel graph-pass 'ScheduleDumper'.
Mon 16:44: INFO    : Graph-pass 'ScheduleDumper' took 1.71915 ms (1 iterations)
Mon 16:44: INFO    : Running kernel graph-pass 'MarkConstantPass'.
Mon 16:44: INFO    : Graph-pass 'MarkConstantPass' took 250.357 µs (1 iterations)
Mon 16:44: INFO    : Running kernel graph-pass 'ScheduleConstants'.
Mon 16:44: INFO    : Running command: cbc "bwttKernel_schedule_C.mps.gz" -threads 4 -solve  -printi csv -solu "bwttKernel_schedule_C.csv" > "bwttKernel_schedule_C.stdout.log"
Mon 16:44: INFO    : Optimum found: 7429
Mon 16:44: INFO    : Graph-pass 'ScheduleConstants' took 70.6554 ms (1 iterations)
Mon 16:44: INFO    : Running kernel graph-pass 'MarkConstantPass'.
Mon 16:44: INFO    : Graph-pass 'MarkConstantPass' took 258.638 µs (1 iterations)
Mon 16:44: INFO    : Running kernel graph-pass 'ScheduleDumper'.
Mon 16:44: INFO    : Graph-pass 'ScheduleDumper' took 1.56875 ms (1 iterations)
Mon 16:44: INFO    : Running kernel graph-pass 'SubstituteEqPlaceholders'.
Mon 16:44: INFO    : Graph-pass 'SubstituteEqPlaceholders' took 54.2730 µs (1 iterations)
Mon 16:44: INFO    : Running kernel graph-pass 'RemoveDistMeasurementNodes'.
Mon 16:44: INFO    : Graph-pass 'RemoveDistMeasurementNodes' took 10.4510 µs (1 iterations)
Mon 16:44: INFO    : Running kernel graph-pass 'ScheduleApplier'.
Mon 16:44: INFO    : Graph-pass 'ScheduleApplier' took 13.1430 ms (1 iterations)
Mon 16:44: INFO    : Maximum stream latency for kernel 'bwttKernel': 126
Mon 16:44: INFO    : Using user logic for flush.
Mon 16:44: INFO    : Running Photon post-schedule graph optimisations (pass 2)
Mon 16:44: INFO    : Running kernel graph-pass 'TapFIFOsPass'.
Mon 16:44: INFO    : Graph-pass 'TapFIFOsPass' took 7.12665 ms (2 iterations)
Mon 16:44: INFO    : Running kernel graph-pass 'FoldFIFOsPass'.
Mon 16:44: INFO    : Graph-pass 'FoldFIFOsPass' took 569.700 µs (1 iterations)
Mon 16:44: INFO    : Running kernel graph-pass 'MarkConstantPass'.
Mon 16:44: INFO    : Graph-pass 'MarkConstantPass' took 283.972 µs (1 iterations)
Mon 16:44: INFO    : Running kernel graph-pass 'ScheduleAsserter'.
Mon 16:44: INFO    : Graph-pass 'ScheduleAsserter' took 1.12864 ms (1 iterations)
Mon 16:44: INFO    : Running kernel graph-pass 'ReplaceEvalStreamOffsetNodes'.
Mon 16:44: INFO    : Graph-pass 'ReplaceEvalStreamOffsetNodes' took 142.270 µs (1 iterations)
Mon 16:44: INFO    : Running kernel graph-pass 'FIFOCoalesceRespectingPlacementPass'.
Mon 16:44: INFO    : Found 2 FIFOs (with 1 set(s) of constraint) with depth '48'.
Mon 16:44: INFO    : Made coalesced FIFO (id=90) of width 64 and depth '48' from the following FIFOs:
Mon 16:44: INFO    :     id=77 width=32
Mon 16:44: INFO    :     id=81 width=32
Mon 16:44: INFO    : Found 2 FIFOs (with 1 set(s) of constraint) with depth '40'.
Mon 16:44: INFO    : Made coalesced FIFO (id=96) of width 64 and depth '40' from the following FIFOs:
Mon 16:44: INFO    :     id=76 width=32
Mon 16:44: INFO    :     id=84 width=32
Mon 16:44: INFO    : Graph-pass 'FIFOCoalesceRespectingPlacementPass' took 16.8047 ms (1 iterations)
Mon 16:44: INFO    : Running kernel graph-pass 'FIFOReport'.
Mon 16:44: INFO    : Graph-pass 'FIFOReport' took 1.48626 ms (1 iterations)
Mon 16:44: INFO    : Running kernel graph-pass 'StatsPass'.
Mon 16:44: INFO    : Graph-pass 'StatsPass' took 1.33121 ms (1 iterations)
Mon 16:44: INFO    : Running kernel graph-pass 'RemoveUntypedConstants'.
Mon 16:44: WARNING : Warning (CONSTANT_ENCODING):
Mon 16:44: WARNING : Precision loss occurred in some constant values.
Mon 16:44: WARNING : For details see /home/yangma/workspace/BWTT/RunRules/DFE/maxfiles/bwtt_VECTIS_DFE/scratch/bwttKernel_constants_report.txt
Mon 16:44: INFO    : Graph-pass 'RemoveUntypedConstants' took 7.65130 ms (1 iterations)
Mon 16:44: INFO    : Running kernel graph-pass 'VariableSizeMappedRegInserter'.
Mon 16:44: INFO    : Graph-pass 'VariableSizeMappedRegInserter' took 140.888 µs (1 iterations)
Mon 16:44: INFO    : Running kernel graph-pass 'MarkConstantPass'.
Mon 16:44: INFO    : Graph-pass 'MarkConstantPass' took 288.969 µs (1 iterations)
Mon 16:44: INFO    : Running kernel graph-pass 'MakeMaxFileNodeData'.
Mon 16:44: INFO    : Graph-pass 'MakeMaxFileNodeData' took 3.29562 ms (1 iterations)
Mon 16:44: INFO    : Running kernel graph-pass 'MoveFanoutRegsForwards'.
Mon 16:44: INFO    : Graph-pass 'MoveFanoutRegsForwards' took 127.038 µs (1 iterations)
Mon 16:44: INFO    : Optimization report for Kernel 'bwttKernel'.
Mon 16:44: INFO    : Enabled optimizations:
Mon 16:44: INFO    : 	DSP-Multiplication
Mon 16:44: INFO    : 	Power-of-2 Floating Point
Mon 16:44: INFO    : 	Fifo Coalescing
Mon 16:44: INFO    : Creating a preliminary MaxCompilerDesignData.dat. (@ CoreCompile bwttKernel)
Mon 16:44: INFO    : Total compilation of 'bwttKernel' took 419.497 ms.
Mon 16:44: INFO    : Running kernel graph-pass 'WeightBasedCEPartitioner'.
Mon 16:44: INFO    : Partitioning design into 1 CE domain(s) to minimize global signal fanout.
Mon 16:44: INFO    : Graph-pass 'WeightBasedCEPartitioner' took 79.7700 µs (1 iterations)
Mon 16:44: INFO    : Using maximum counter CE delay chain length 7
Mon 16:44: INFO    : CE Partition 0 Clock Phase 0 : Nodes=90 (use fill=8, use flush=4) Fill counters=2 (+4 delay regs) Flush counters=1 (+0 delay regs)
Mon 16:44: INFO    : Running kernel graph-pass 'FindWriteableMappedMemories'.
Mon 16:44: INFO    : Graph-pass 'FindWriteableMappedMemories' took 26.4950 µs (1 iterations)
Mon 16:44: INFO    : Running kernel graph-pass 'MarkConstantPass'.
Mon 16:44: INFO    : Graph-pass 'MarkConstantPass' took 220.921 µs (1 iterations)
Mon 16:44: INFO    : Running kernel graph-pass 'MaxConstantLatency'.
Mon 16:44: INFO    : Graph-pass 'MaxConstantLatency' took 425.877 µs (1 iterations)
Mon 16:44: INFO    : Maximum constant latency: 0
Mon 16:44: INFO    : Running kernel graph-pass 'PhotonMaxDCTopEntity'.
Mon 16:44: INFO    : Running command:  par 2>&1 > ise_version_test
Mon 16:44: INFO    : /bin/bash: par: command not found
Mon 16:44: ERROR   : ----------------------------
Mon 16:44: ERROR   : Exception in thread "main":
Mon 16:44: ERROR   :  
Mon 16:44: ERROR   :   Error in MaxDC pass processing node created via:
Mon 16:44: ERROR   :   com.maxeler.maxcompiler.v2.kernelcompiler.stdlib.memory.Memory.finalizeKernel(Memory.java:111)
Mon 16:44: ERROR   :   com.maxeler.maxcompiler.v2.managers.DFEManager.build(DFEManager.java:359)
Mon 16:44: ERROR   :   bwtt.bwttManager.main(bwttManager.maxj:23)
Mon 16:44: ERROR   :   
Mon 16:44: ERROR   :   -> (WARNING: unlogged MaxelerException) com.maxeler.maxdc.MaxDCException: 
Mon 16:44: ERROR   :   MaxCompiler has detected a problem with the third-party application ISE.
Mon 16:44: ERROR   :   
Mon 16:44: ERROR   :   Problem:
Mon 16:44: ERROR   :   Error running external tool :-
Mon 16:44: ERROR   :   Problem            : Command not found
Mon 16:44: ERROR   :   Command run        :  par 2>&1 > ise_version_test
Mon 16:44: ERROR   :   Directory run in   : 
Mon 16:44: ERROR   :   /home/yangma/workspace/BWTT/RunRules/DFE/maxfiles/bwtt_VECTIS_DFE/scratch
Mon 16:44: ERROR   :   Exit code          : 127
Mon 16:44: ERROR   :   Detailed build log : 
Mon 16:44: ERROR   :   /home/yangma/workspace/BWTT/RunRules/DFE/maxfiles/bwtt_VECTIS_DFE/_build.log
Mon 16:44: ERROR   : 
Mon 16:44: ERROR   : Exception Stack Trace com.maxeler.photon.core.PhotonException: 
Mon 16:44: ERROR   :    at com.maxeler.maxdc.FpgaVendorToolVersion.error(FpgaVendorToolVersion.java:74)
Mon 16:44: ERROR   :    at com.maxeler.maxdc.FpgaVendorToolVersion.<init>(FpgaVendorToolVersion.java:45)
Mon 16:44: ERROR   :    at com.maxeler.maxdc.xilinx.ISEVersion.<init>(ISEVersion.java:206)
Mon 16:44: ERROR   :    at com.maxeler.maxdc.xilinx.ISEVersion.get(ISEVersion.java:28)
Mon 16:44: ERROR   :    at com.maxeler.maxdc.xilinx.coregen.CGBlockMem.make(CGBlockMem.java:50)
Mon 16:44: ERROR   :    at com.maxeler.maxdc.xilinx.platform.XilinxBlockMem.<init>(XilinxBlockMem.java:103)
Mon 16:44: ERROR   :    at com.maxeler.maxdc.xilinx.platform.XilinxPortableComponentFactory.createBlockMem(XilinxPortableComponentFactory.java:42)
Mon 16:44: ERROR   :    at com.maxeler.maxdc.portable.PortableComponentSupplier.makeBlockMem(PortableComponentSupplier.java:41)
Mon 16:44: ERROR   :    at com.maxeler.maxeleros.ip.MappedMemory$MappedMemoryIntRAM.<init>(MappedMemory.java:164)
Mon 16:44: ERROR   :    at com.maxeler.maxeleros.ip.MappedMemory.<init>(MappedMemory.java:612)
Mon 16:44: ERROR   :    at com.maxeler.maxeleros.ip.MappedMemory.makeROM(MappedMemory.java:350)
Mon 16:44: ERROR   :    at com.maxeler.photon.nodes.NodeMappedRom.make(NodeMappedRom.java:146)
Mon 16:44: ERROR   :    at com.maxeler.photon.graph_passes.maxdc_gen.PhotonMaxDCEntity.instantiateNode(PhotonMaxDCEntity.java:1171)
Mon 16:44: ERROR   :    at com.maxeler.photon.graph_passes.maxdc_gen.PhotonMaxDCEntity.makeNode(PhotonMaxDCEntity.java:1488)
Mon 16:44: ERROR   :    at com.maxeler.photon.graph_passes.maxdc_gen.PhotonMaxDCTopEntity.processNode(PhotonMaxDCTopEntity.java:255)
Mon 16:44: ERROR   :    at com.maxeler.photon.core.GraphPassRunner.run(GraphPassRunner.java:432)
Mon 16:44: ERROR   :    at com.maxeler.photon.core.GraphPassRunner.run(GraphPassRunner.java:489)
Mon 16:44: ERROR   :    at com.maxeler.photon.core.PhotonCompileManager.runGraphPass(PhotonCompileManager.java:159)
Mon 16:44: ERROR   :    at com.maxeler.photon.compile_managers.MaxDCCompileManager.buildPhotonSBA(MaxDCCompileManager.java:114)
Mon 16:44: ERROR   :    at com.maxeler.maxeleros.managercompiler.nodes.WrapperNodePhoton.build(WrapperNodePhoton.java:446)
Mon 16:44: ERROR   :    at com.maxeler.maxeleros.managercompiler.core.WrapperDesignEntity.<init>(WrapperDesignEntity.java:81)
Mon 16:44: ERROR   :    at com.maxeler.maxeleros.managercompiler.core.WrapperCompileManager.build(WrapperCompileManager.java:283)
Mon 16:44: ERROR   :    at com.maxeler.maxcompiler.v2.managers.custom.CustomManager.buildInternal(CustomManager.java:915)
Mon 16:44: ERROR   :    at com.maxeler.maxcompiler.v2.managers.custom.CustomManager.realBuild(CustomManager.java:1449)
Mon 16:44: ERROR   :    at com.maxeler.maxcompiler.v2.managers.DFEManager.build(DFEManager.java:359)
Mon 16:44: ERROR   :    at com.maxeler.maxcompiler.v2.managers.standard.Manager.makeFullManager(Manager.java:1096)
Mon 16:44: ERROR   :    at com.maxeler.maxcompiler.v2.managers.standard.Manager.realBuild(Manager.java:465)
Mon 16:44: ERROR   :    at com.maxeler.maxcompiler.v2.managers.DFEManager.build(DFEManager.java:359)
Mon 16:44: ERROR   :    at bwtt.bwttManager.main(bwttManager.maxj:23)
Mon 16:44: ERROR   : ----------------------------
