
Pre-schedule statistics


Total nodes: 65

Node class;Type;Length;Num
NodeAdd;{HWFloat:8, 24};0;3
NodeAnd;{HWOffsetFix:1, 0, UNSIGNED};0;8
NodeCast;{HWFloat:8, 24};0;2
NodeCast;{HWOffsetFix:10, 0, UNSIGNED};0;1
NodeConstantDouble;HWUntypedConst;0;5
NodeConstantRawBits;{HWOffsetFix:1, 0, UNSIGNED};0;1
NodeConstantRawBits;{HWOffsetFix:16, 0, UNSIGNED};0;2
NodeConstantRawBits;{HWOffsetFix:49, 0, UNSIGNED};0;2
NodeCounterV1;{HWOffsetFix:32, 0, UNSIGNED};0;1
NodeCounterV1;{HWOffsetFix:48, 0, UNSIGNED};0;2
NodeEq;{HWOffsetFix:1, 0, UNSIGNED};0;2
NodeGt;{HWOffsetFix:1, 0, UNSIGNED};0;1
NodeInput;{HWFloat:8, 24};0;6
NodeInputMappedReg;{HWOffsetFix:1, 0, UNSIGNED};0;7
NodeInputMappedReg;{HWOffsetFix:32, 0, UNSIGNED};0;1
NodeInputMappedReg;{HWOffsetFix:48, 0, UNSIGNED};0;1
NodeLt;{HWOffsetFix:1, 0, UNSIGNED};0;2
NodeMappedRom;{HWFloat:8, 24};1000;1
NodeMappedRom;{HWOffsetFix:32, 0, TWOSCOMPLEMENT};1000;2
NodeMul;{HWFloat:8, 24};0;4
NodeMux;{HWOffsetFix:16, 0, UNSIGNED};0;1
NodeNot;{HWOffsetFix:1, 0, UNSIGNED};0;7
NodeStreamOffset;{HWOffsetFix:48, 0, UNSIGNED};0;1
NodeSub;{HWFloat:8, 24};0;2

Final statistics


Total nodes: 70

Node class;Type;Length;Num
NodeAdd;{HWFloat:8, 24};0;3
NodeAnd;{HWOffsetFix:1, 0, UNSIGNED};0;8
NodeCast;{HWFloat:8, 24};0;2
NodeCast;{HWOffsetFix:10, 0, UNSIGNED};0;1
NodeConstantDouble;HWUntypedConst;0;5
NodeConstantRawBits;{HWOffsetFix:1, 0, UNSIGNED};0;1
NodeConstantRawBits;{HWOffsetFix:16, 0, UNSIGNED};0;2
NodeConstantRawBits;{HWOffsetFix:49, 0, UNSIGNED};0;2
NodeCounterV1;{HWOffsetFix:32, 0, UNSIGNED};0;1
NodeCounterV1;{HWOffsetFix:48, 0, UNSIGNED};0;2
NodeEq;{HWOffsetFix:1, 0, UNSIGNED};0;2
NodeFIFO;{HWOffsetFix:1, 0, UNSIGNED};52;1
NodeFIFO;{HWOffsetFix:1, 0, UNSIGNED};53;1
NodeFIFO;{HWOffsetFix:1, 0, UNSIGNED};8;1
NodeFIFO;{HWOffsetFix:10, 0, UNSIGNED};14;1
NodeFIFO;{HWOffsetFix:10, 0, UNSIGNED};4;1
NodeGt;{HWOffsetFix:1, 0, UNSIGNED};0;1
NodeInput;{HWFloat:8, 24};0;6
NodeInputMappedReg;{HWOffsetFix:1, 0, UNSIGNED};0;7
NodeInputMappedReg;{HWOffsetFix:32, 0, UNSIGNED};0;1
NodeInputMappedReg;{HWOffsetFix:48, 0, UNSIGNED};0;1
NodeLt;{HWOffsetFix:1, 0, UNSIGNED};0;2
NodeMappedRom;{HWFloat:8, 24};1000;1
NodeMappedRom;{HWOffsetFix:32, 0, TWOSCOMPLEMENT};1000;2
NodeMul;{HWFloat:8, 24};0;4
NodeMux;{HWOffsetFix:16, 0, UNSIGNED};0;1
NodeNot;{HWOffsetFix:1, 0, UNSIGNED};0;7
NodeStreamOffset;{HWOffsetFix:48, 0, UNSIGNED};0;1
NodeSub;{HWFloat:8, 24};0;2
