2,NodeCounterV1,0
4,NodeEq,0
11,NodeAnd,0
12,NodeInput,0
13,NodeCast,0
7,NodeAnd,0
8,NodeInput,0
16,NodeCast,0
55,NodeMappedRom,0
17,NodeCast,0
14,NodeCast,0
19,NodeSub,0
59,NodeMappedRom,0
20,NodeSub,0
21,NodeDiv,0
29,NodeCast,0
60,NodeMappedRom,0
32,NodeMul,0
22,NodeMul,0
23,NodeSub,0
33,NodeAdd,0
56,NodeMappedRom,0
30,NodeCast,0
34,NodeSub,0
38,NodeMul,0
57,NodeMappedRom,0
18,NodeCast,0
15,NodeCast,0
24,NodeSub,0
26,NodeDiv,0
35,NodeMul,0
27,NodeMul,0
28,NodeSub,0
36,NodeAdd,0
58,NodeMappedRom,0
31,NodeCast,0
37,NodeSub,0
39,NodeMul,0
40,NodeAdd,0
42,NodeLt,0
43,NodeLt,0
44,NodeAnd,0
45,NodeGt,0
46,NodeAnd,0
49,NodeMux,0
54,NodeOutput,0
63,NodeCounterV1,0
64,NodeStreamOffset,0
66,NodeOutputMappedReg,0
69,NodeCounterV1,0
72,NodeEq,0
70,NodeFlush,0
