digraph bwttKernel_final{
	NodeConstantRawBits105 [shape=box, label="1.0\nID: 105"];
	NodeInputMappedReg0 [shape=box, peripheries=2, label="tokensIndex\nID: 0"];
	NodeCounterV12 [shape=hexagon, label="cnt\nID: 2"];
	NodeConstantRawBits104 [shape=box, label="0.0\nID: 104"];
	NodeEq4 [label="==\nID: 4"];
	NodeInput12 [shape=invhouse, label="so\nID: 12"];
	NodeCast13 [label="{HWOffsetFix:10, 0, UNSIGNED}\nID: 13"];
	NodeInput8 [shape=invhouse, label="si\nID: 8"];
	NodeCast16 [label="{HWOffsetFix:10, 0, UNSIGNED}\nID: 16"];
	NodeMappedRom55 [label="MappedRom 'replicated_mem_0_mappedRomX':\n{HWOffsetFix:32, 0, TWOSCOMPLEMENT} x 1000\nID: 55"];
	NodeCast17 [label="{HWFloat:8, 24}\nID: 17"];
	NodeCast14 [label="{HWFloat:8, 24}\nID: 14"];
	NodeSub19 [label="-\nID: 19"];
	NodeFIFO73 [shape=plaintext, label=<<TABLE BORDER="0" CELLSPACING="0" CELLBORDER="1"> <TR><TD></TD></TR><TR><TD>6</TD></TR><TR><TD>ID: 73</TD></TR> <TR><TD></TD></TR> </TABLE>>];
	NodeFIFO74 [shape=plaintext, label=<<TABLE BORDER="0" CELLSPACING="0" CELLBORDER="1"> <TR><TD></TD></TR><TR><TD>6</TD></TR><TR><TD>ID: 74</TD></TR> <TR><TD></TD></TR> </TABLE>>];
	NodeMappedRom59 [label="MappedRom 'replicated_mem_0_mappedRomRho':\n{HWFloat:8, 24} x 1000\nID: 59"];
	NodeSub20 [label="-\nID: 20"];
	NodeDiv21 [label="/\nID: 21"];
	NodeCast29 [label="{HWOffsetFix:10, 0, UNSIGNED}\nID: 29"];
	NodeFIFO75 [shape=plaintext, label=<<TABLE BORDER="0" CELLSPACING="0" CELLBORDER="1"> <TR><TD></TD></TR><TR><TD>52</TD></TR><TR><TD>ID: 75</TD></TR> <TR><TD></TD></TR> </TABLE>>];
	NodeMappedRom60 [label="MappedRom 'replicated_mem_1_mappedRomRho':\n{HWFloat:8, 24} x 1000\nID: 60"];
	NodeMul32 [label="*\nID: 32"];
	NodeFIFO78 [shape=plaintext, label=<<TABLE BORDER="0" CELLSPACING="0" CELLBORDER="1"> <TR><TD></TD></TR><TR><TD>12</TD></TR><TR><TD>ID: 78</TD></TR> <TR><TD></TD></TR> </TABLE>>];
	NodeMappedRom57 [label="MappedRom 'replicated_mem_0_mappedRomY':\n{HWOffsetFix:32, 0, TWOSCOMPLEMENT} x 1000\nID: 57"];
	NodeCast15 [label="{HWFloat:8, 24}\nID: 15"];
	NodeCat89 [label="@\nID: 89"];
	NodeFIFO90 [shape=plaintext, label=<<TABLE BORDER="0" CELLSPACING="0" CELLBORDER="1"> <TR><TD></TD></TR><TR><TD>48</TD></TR><TR><TD>ID: 90</TD></TR> <TR><TD></TD></TR> </TABLE>>];
	NodeSlice91 [label="[63:32]\nID: 91"];
	NodeReinterpret92 [label="<{HWFloat:8, 24}>\nID: 92"];
	NodeCat95 [label="@\nID: 95"];
	NodeFIFO96 [shape=plaintext, label=<<TABLE BORDER="0" CELLSPACING="0" CELLBORDER="1"> <TR><TD></TD></TR><TR><TD>40</TD></TR><TR><TD>ID: 96</TD></TR> <TR><TD></TD></TR> </TABLE>>];
	NodeSlice97 [label="[63:32]\nID: 97"];
	NodeReinterpret98 [label="<{HWFloat:8, 24}>\nID: 98"];
	NodeMul22 [label="*\nID: 22"];
	NodeSub23 [label="-\nID: 23"];
	NodeAdd33 [label="+\nID: 33"];
	NodeFIFO88 [shape=plaintext, label=<<TABLE BORDER="0" CELLSPACING="0" CELLBORDER="1"> <TR><TD></TD></TR><TR><TD>26</TD></TR><TR><TD>ID: 88</TD></TR> <TR><TD></TD></TR> </TABLE>>];
	NodeMappedRom56 [label="MappedRom 'replicated_mem_1_mappedRomX':\n{HWOffsetFix:32, 0, TWOSCOMPLEMENT} x 1000\nID: 56"];
	NodeCast30 [label="{HWFloat:8, 24}\nID: 30"];
	NodeSub34 [label="-\nID: 34"];
	NodeMul38 [label="*\nID: 38"];
	NodeCast18 [label="{HWFloat:8, 24}\nID: 18"];
	NodeSub24 [label="-\nID: 24"];
	NodeDiv26 [label="/\nID: 26"];
	NodeMul35 [label="*\nID: 35"];
	NodeFIFO82 [shape=plaintext, label=<<TABLE BORDER="0" CELLSPACING="0" CELLBORDER="1"> <TR><TD></TD></TR><TR><TD>12</TD></TR><TR><TD>ID: 82</TD></TR> <TR><TD></TD></TR> </TABLE>>];
	NodeSlice93 [label="[31:0]\nID: 93"];
	NodeReinterpret94 [label="<{HWFloat:8, 24}>\nID: 94"];
	NodeMul27 [label="*\nID: 27"];
	NodeSub28 [label="-\nID: 28"];
	NodeAdd36 [label="+\nID: 36"];
	NodeMappedRom58 [label="MappedRom 'replicated_mem_1_mappedRomY':\n{HWOffsetFix:32, 0, TWOSCOMPLEMENT} x 1000\nID: 58"];
	NodeCast31 [label="{HWFloat:8, 24}\nID: 31"];
	NodeSub37 [label="-\nID: 37"];
	NodeMul39 [label="*\nID: 39"];
	NodeAdd40 [label="+\nID: 40"];
	NodeConstantRawBits103 [shape=box, label="1.2000000476837158\nID: 103"];
	NodeLt42 [label="<\nID: 42"];
	NodeSlice99 [label="[31:0]\nID: 99"];
	NodeReinterpret100 [label="<{HWFloat:8, 24}>\nID: 100"];
	NodeLt43 [label="<\nID: 43"];
	NodeFIFO85 [shape=plaintext, label=<<TABLE BORDER="0" CELLSPACING="0" CELLBORDER="1"> <TR><TD></TD></TR><TR><TD>64</TD></TR><TR><TD>ID: 85</TD></TR> <TR><TD></TD></TR> </TABLE>>];
	NodeAnd44 [label="&\nID: 44"];
	NodeGt45 [label=">\nID: 45"];
	NodeFIFO87 [shape=plaintext, label=<<TABLE BORDER="0" CELLSPACING="0" CELLBORDER="1"> <TR><TD></TD></TR><TR><TD>65</TD></TR><TR><TD>ID: 87</TD></TR> <TR><TD></TD></TR> </TABLE>>];
	NodeAnd46 [label="&\nID: 46"];
	NodeConstantRawBits48 [shape=box, label="0.0\nID: 48"];
	NodeConstantRawBits47 [shape=box, label="1.0\nID: 47"];
	NodeMux49 [shape=invtrapezium, label="MUX\nID: 49", height=0.5];
	NodeOutput54 [shape=house, label="output\nID: 54"];
	NodeConstantRawBits105 -> NodeCounterV12[label="enable" color="/dark28/1" photon_data="EDGE,SrcNode:105,SrcNodePort:value"];
	NodeInputMappedReg0 -> NodeCounterV12[label="max" color="/dark28/2" photon_data="EDGE,SrcNode:0,SrcNodePort:tokensIndex"];
	NodeCounterV12 -> NodeEq4[color="/dark28/3" photon_data="EDGE,SrcNode:2,SrcNodePort:count"];
	NodeConstantRawBits104 -> NodeEq4[color="/dark28/4" photon_data="EDGE,SrcNode:104,SrcNodePort:value"];
	NodeEq4 -> NodeInput8[headport="w" color="/dark28/5" ];
	NodeEq4 -> NodeInput12[headport="w" color="/dark28/6" ];
	NodeInput12 -> NodeCast13[color="/dark28/7" photon_data="EDGE,SrcNode:12,SrcNodePort:data"];
	NodeInput8 -> NodeCast16[color="/dark28/8" photon_data="EDGE,SrcNode:8,SrcNodePort:data"];
	NodeCast13 -> NodeMappedRom55[color="/dark28/1" photon_data="EDGE,SrcNode:13,SrcNodePort:o"];
	NodeCast16 -> NodeMappedRom55[color="/dark28/2" photon_data="EDGE,SrcNode:16,SrcNodePort:o"];
	NodeMappedRom55 -> NodeCast17[color="/dark28/3" photon_data="EDGE,SrcNode:55,SrcNodePort:datab"];
	NodeMappedRom55 -> NodeCast14[color="/dark28/4" photon_data="EDGE,SrcNode:55,SrcNodePort:dataa"];
	NodeCast17 -> NodeSub19[color="/dark28/5" photon_data="EDGE,SrcNode:17,SrcNodePort:o"];
	NodeCast14 -> NodeSub19[color="/dark28/6" photon_data="EDGE,SrcNode:14,SrcNodePort:o"];
	NodeCast13 -> NodeFIFO73[headport="n" color="/dark28/7" photon_data="EDGE,SrcNode:13,SrcNodePort:o"];
	NodeCast16 -> NodeFIFO74[headport="n" color="/dark28/8" photon_data="EDGE,SrcNode:16,SrcNodePort:o"];
	NodeFIFO73 -> NodeMappedRom59[tailport="s" color="/dark28/1" photon_data="EDGE,SrcNode:73,SrcNodePort:output"];
	NodeFIFO74 -> NodeMappedRom59[tailport="s" color="/dark28/2" photon_data="EDGE,SrcNode:74,SrcNodePort:output"];
	NodeMappedRom59 -> NodeSub20[color="/dark28/3" photon_data="EDGE,SrcNode:59,SrcNodePort:datab"];
	NodeMappedRom59 -> NodeSub20[color="/dark28/4" photon_data="EDGE,SrcNode:59,SrcNodePort:dataa"];
	NodeSub19 -> NodeDiv21[color="/dark28/5" photon_data="EDGE,SrcNode:19,SrcNodePort:result"];
	NodeSub20 -> NodeDiv21[color="/dark28/6" photon_data="EDGE,SrcNode:20,SrcNodePort:result"];
	NodeCounterV12 -> NodeCast29[color="/dark28/7" photon_data="EDGE,SrcNode:2,SrcNodePort:count"];
	NodeCast29 -> NodeFIFO75[headport="n" color="/dark28/8" photon_data="EDGE,SrcNode:29,SrcNodePort:o"];
	NodeFIFO75 -> NodeMappedRom60[tailport="s" color="/dark28/1" photon_data="EDGE,SrcNode:75,SrcNodePort:output"];
	NodeDiv21 -> NodeMul32[color="/dark28/2" photon_data="EDGE,SrcNode:21,SrcNodePort:result"];
	NodeMappedRom60 -> NodeMul32[color="/dark28/3" photon_data="EDGE,SrcNode:60,SrcNodePort:dataa"];
	NodeMul32 -> NodeFIFO78[headport="n" color="/dark28/4" photon_data="EDGE,SrcNode:32,SrcNodePort:result"];
	NodeCast13 -> NodeMappedRom57[color="/dark28/5" photon_data="EDGE,SrcNode:13,SrcNodePort:o"];
	NodeCast16 -> NodeMappedRom57[color="/dark28/6" photon_data="EDGE,SrcNode:16,SrcNodePort:o"];
	NodeMappedRom57 -> NodeCast15[color="/dark28/7" photon_data="EDGE,SrcNode:57,SrcNodePort:dataa"];
	NodeCast14 -> NodeCat89[color="/dark28/8" photon_data="EDGE,SrcNode:14,SrcNodePort:o"];
	NodeCast15 -> NodeCat89[color="/dark28/1" photon_data="EDGE,SrcNode:15,SrcNodePort:o"];
	NodeCat89 -> NodeFIFO90[headport="n" color="/dark28/2" photon_data="EDGE,SrcNode:89,SrcNodePort:result"];
	NodeFIFO90 -> NodeSlice91[tailport="s" color="/dark28/3" photon_data="EDGE,SrcNode:90,SrcNodePort:output"];
	NodeSlice91 -> NodeReinterpret92[color="/dark28/4" photon_data="EDGE,SrcNode:91,SrcNodePort:result"];
	NodeMappedRom59 -> NodeCat95[color="/dark28/5" photon_data="EDGE,SrcNode:59,SrcNodePort:dataa"];
	NodeMappedRom59 -> NodeCat95[color="/dark28/6" photon_data="EDGE,SrcNode:59,SrcNodePort:datab"];
	NodeCat95 -> NodeFIFO96[headport="n" color="/dark28/7" photon_data="EDGE,SrcNode:95,SrcNodePort:result"];
	NodeFIFO96 -> NodeSlice97[tailport="s" color="/dark28/8" photon_data="EDGE,SrcNode:96,SrcNodePort:output"];
	NodeSlice97 -> NodeReinterpret98[color="/dark28/1" photon_data="EDGE,SrcNode:97,SrcNodePort:result"];
	NodeDiv21 -> NodeMul22[color="/dark28/2" photon_data="EDGE,SrcNode:21,SrcNodePort:result"];
	NodeReinterpret98 -> NodeMul22[color="/dark28/3" photon_data="EDGE,SrcNode:98,SrcNodePort:output"];
	NodeReinterpret92 -> NodeSub23[color="/dark28/4" photon_data="EDGE,SrcNode:92,SrcNodePort:output"];
	NodeMul22 -> NodeSub23[color="/dark28/5" photon_data="EDGE,SrcNode:22,SrcNodePort:result"];
	NodeFIFO78 -> NodeAdd33[tailport="s" color="/dark28/6" photon_data="EDGE,SrcNode:78,SrcNodePort:output"];
	NodeSub23 -> NodeAdd33[color="/dark28/7" photon_data="EDGE,SrcNode:23,SrcNodePort:result"];
	NodeFIFO75 -> NodeFIFO88[tailport="s" headport="n" color="/dark28/8" photon_data="EDGE,SrcNode:75,SrcNodePort:output"];
	NodeFIFO88 -> NodeMappedRom56[tailport="s" color="/dark28/1" photon_data="EDGE,SrcNode:88,SrcNodePort:output"];
	NodeMappedRom56 -> NodeCast30[color="/dark28/2" photon_data="EDGE,SrcNode:56,SrcNodePort:dataa"];
	NodeAdd33 -> NodeSub34[color="/dark28/3" photon_data="EDGE,SrcNode:33,SrcNodePort:result"];
	NodeCast30 -> NodeSub34[color="/dark28/4" photon_data="EDGE,SrcNode:30,SrcNodePort:o"];
	NodeSub34 -> NodeMul38[color="/dark28/5" photon_data="EDGE,SrcNode:34,SrcNodePort:result"];
	NodeSub34 -> NodeMul38[color="/dark28/6" photon_data="EDGE,SrcNode:34,SrcNodePort:result"];
	NodeMappedRom57 -> NodeCast18[color="/dark28/7" photon_data="EDGE,SrcNode:57,SrcNodePort:datab"];
	NodeCast18 -> NodeSub24[color="/dark28/8" photon_data="EDGE,SrcNode:18,SrcNodePort:o"];
	NodeCast15 -> NodeSub24[color="/dark28/1" photon_data="EDGE,SrcNode:15,SrcNodePort:o"];
	NodeSub24 -> NodeDiv26[color="/dark28/2" photon_data="EDGE,SrcNode:24,SrcNodePort:result"];
	NodeSub20 -> NodeDiv26[color="/dark28/3" photon_data="EDGE,SrcNode:20,SrcNodePort:result"];
	NodeDiv26 -> NodeMul35[color="/dark28/4" photon_data="EDGE,SrcNode:26,SrcNodePort:result"];
	NodeMappedRom60 -> NodeMul35[color="/dark28/5" photon_data="EDGE,SrcNode:60,SrcNodePort:dataa"];
	NodeMul35 -> NodeFIFO82[headport="n" color="/dark28/6" photon_data="EDGE,SrcNode:35,SrcNodePort:result"];
	NodeFIFO90 -> NodeSlice93[tailport="s" color="/dark28/7" photon_data="EDGE,SrcNode:90,SrcNodePort:output"];
	NodeSlice93 -> NodeReinterpret94[color="/dark28/8" photon_data="EDGE,SrcNode:93,SrcNodePort:result"];
	NodeDiv26 -> NodeMul27[color="/dark28/1" photon_data="EDGE,SrcNode:26,SrcNodePort:result"];
	NodeReinterpret98 -> NodeMul27[color="/dark28/2" photon_data="EDGE,SrcNode:98,SrcNodePort:output"];
	NodeReinterpret94 -> NodeSub28[color="/dark28/3" photon_data="EDGE,SrcNode:94,SrcNodePort:output"];
	NodeMul27 -> NodeSub28[color="/dark28/4" photon_data="EDGE,SrcNode:27,SrcNodePort:result"];
	NodeFIFO82 -> NodeAdd36[tailport="s" color="/dark28/5" photon_data="EDGE,SrcNode:82,SrcNodePort:output"];
	NodeSub28 -> NodeAdd36[color="/dark28/6" photon_data="EDGE,SrcNode:28,SrcNodePort:result"];
	NodeFIFO88 -> NodeMappedRom58[tailport="s" color="/dark28/7" photon_data="EDGE,SrcNode:88,SrcNodePort:output"];
	NodeMappedRom58 -> NodeCast31[color="/dark28/8" photon_data="EDGE,SrcNode:58,SrcNodePort:dataa"];
	NodeAdd36 -> NodeSub37[color="/dark28/1" photon_data="EDGE,SrcNode:36,SrcNodePort:result"];
	NodeCast31 -> NodeSub37[color="/dark28/2" photon_data="EDGE,SrcNode:31,SrcNodePort:o"];
	NodeSub37 -> NodeMul39[color="/dark28/3" photon_data="EDGE,SrcNode:37,SrcNodePort:result"];
	NodeSub37 -> NodeMul39[color="/dark28/4" photon_data="EDGE,SrcNode:37,SrcNodePort:result"];
	NodeMul38 -> NodeAdd40[color="/dark28/5" photon_data="EDGE,SrcNode:38,SrcNodePort:result"];
	NodeMul39 -> NodeAdd40[color="/dark28/6" photon_data="EDGE,SrcNode:39,SrcNodePort:result"];
	NodeAdd40 -> NodeLt42[color="/dark28/7" photon_data="EDGE,SrcNode:40,SrcNodePort:result"];
	NodeConstantRawBits103 -> NodeLt42[color="/dark28/8" photon_data="EDGE,SrcNode:103,SrcNodePort:value"];
	NodeFIFO96 -> NodeSlice99[tailport="s" color="/dark28/1" photon_data="EDGE,SrcNode:96,SrcNodePort:output"];
	NodeSlice99 -> NodeReinterpret100[color="/dark28/2" photon_data="EDGE,SrcNode:99,SrcNodePort:result"];
	NodeMappedRom60 -> NodeLt43[color="/dark28/3" photon_data="EDGE,SrcNode:60,SrcNodePort:dataa"];
	NodeReinterpret100 -> NodeLt43[color="/dark28/4" photon_data="EDGE,SrcNode:100,SrcNodePort:output"];
	NodeLt43 -> NodeFIFO85[headport="n" color="/dark28/5" photon_data="EDGE,SrcNode:43,SrcNodePort:result"];
	NodeLt42 -> NodeAnd44[color="/dark28/6" photon_data="EDGE,SrcNode:42,SrcNodePort:result"];
	NodeFIFO85 -> NodeAnd44[tailport="s" color="/dark28/7" photon_data="EDGE,SrcNode:85,SrcNodePort:output"];
	NodeMappedRom60 -> NodeGt45[color="/dark28/8" photon_data="EDGE,SrcNode:60,SrcNodePort:dataa"];
	NodeReinterpret98 -> NodeGt45[color="/dark28/1" photon_data="EDGE,SrcNode:98,SrcNodePort:output"];
	NodeGt45 -> NodeFIFO87[headport="n" color="/dark28/2" photon_data="EDGE,SrcNode:45,SrcNodePort:result"];
	NodeAnd44 -> NodeAnd46[color="/dark28/3" photon_data="EDGE,SrcNode:44,SrcNodePort:result"];
	NodeFIFO87 -> NodeAnd46[tailport="s" color="/dark28/4" photon_data="EDGE,SrcNode:87,SrcNodePort:output"];
	NodeAnd46 -> NodeMux49[headport="w" color="/dark28/5" photon_data="EDGE,SrcNode:46,SrcNodePort:result"];
	NodeConstantRawBits48 -> NodeMux49[color="/dark28/6" photon_data="EDGE,SrcNode:48,SrcNodePort:value"];
	NodeConstantRawBits47 -> NodeMux49[color="/dark28/7" photon_data="EDGE,SrcNode:47,SrcNodePort:value"];
	NodeMux49 -> NodeOutput54[color="/dark28/8" photon_data="EDGE,SrcNode:49,SrcNodePort:result"];
}
