{
    "$schema": "http://schema.management.azure.com/schemas/2015-01-01/deploymentTemplate.json#",
    "contentVersion": "1.0.0.0",
    "parameters": {
        "adminUsername": {
            "type": "string"
        },
        "practiceName": {
            "type": "string"
        },
        "interviewerName": {
            "type": "string"
        }
    },
    "variables": {
        "resourcePrefix": "[parameters('practiceName')]",
        "location": "eastus",
        "publicIpName": "[concat(variables('resourcePrefix'), '-', parameters('adminUsername'), '-ip')]"
    },
    "resources": [
        {
            "name": "[variables('publicIpName')]",
            "type": "Microsoft.Network/publicIpAddresses",
            "apiVersion": "2019-02-01",
            "location": "[variables('location')]",
            "properties": {
                "publicIpAllocationMethod": "Static"
            },
            "sku": {
                "name": "Basic"
            },
            "tags": {
                "Practice": "[parameters('practiceName')]",
                "Interviewer": "[parameters('interviewerName')]",
                "Candidate": "[parameters('adminUsername')]"
            }
        }
    ]
}