{
  "gitsource": [
    {
      "practice": "QA",
      "repository": "qa-dotnet-codebase",
      "vmImage" : "image-win10ent-cad-codetest"
    },
    {
      "practice": "BI",
      "repository": "bi-powerbi-codebase",
      "vmImage" : "image-win10ent-cad-codetest-10302020"
    },
    {
      "practice": "CRM",
      "repository": "crm-dynamics365-codebase",
      "vmImage" : "image-win10ent-cad-codetest-10302020"
    },
    {
      "practice": "Xamarin",
      "repository": "cad-xamarin-codebase",
      "vmImage" : "image-win10ent-cad-codetest-10302020"
    },
    {
      "practice": "CIS",
      "repository": "cis-codebase",
      "vmImage" : "image-win10ent-cad-codetest-11272020"
    }
  ]
}