{
    "_device_id": 1402,
    "auth_name": "UUUUUUUU1402",
    "auth_password": "PXEuWkpFECUUUUUUUUUUUUUUUUUUUUUU",
    "connector": "rest-v2",
    "reports": {
        "default": {
            "message_example": {
                "report": {
                    "power_main_mv": 5000,
                    "power_battery_mv": 3787,
                    "power_charge_cycle": "Standby",
                    "device_board": "uni32_rev4",
                    "device_model": "dev-test",
                    "device_rssi": -72,
                    "device_seqno": 17,
                    "device_wake": "Timer"
                }
            }
        }
    },
    "events": {
        "alarm": {
            "message_example": {
                "event": "alarm",
                "params": {}
            }
        }
    }
}
