{    
    "tag_list": "/etc/bd/bd.json",
    "eeprom": [
        { "path": "/sys/bus/i2c/devices/2-0050/eeprom", "valid_bds": [
                {"name": "board", "start": 0, "size": 1024},
                {"name": "platform", "start": 1024, "size": 512},
                {"name": "settings", "start": 1536, "size": 512} 
            ] 
        }
    ]
}
