{
    "format": "json",
    "compressor": "none",
    "sinks": {
        "sink-http": {
            "legacy": {
                "enable": false,
                "types": [ "legacy-http" ],
                "format": "json",
                "compressor": "gz"
            }
        },
        "sink-socket": {
            "default": {
                "enable": false,
                "types": [ "legacy-socket" ]
            },
            "websocket": {
                "enable": false,
                "types": [ "stream-flows", "stream-stats" ]
            }
        },
        "sink-mqtt": {
            "flows": {
                "enable": false,
                "types": [ "stream-flows" ]
            },
            "stats": {
                "enable": false,
                "types": [ "stream-stats" ]
            }
        }
    }
}
