offline0: i6pc----------- UDP [OR] 20ed:470f:6f73:ce60:60be:8b4f:df37:b080:45658 --> [L] 32fb:f967:681e:e96b:face:b00c:0:74fd:3478
        : RTCP
        : DP: 4

offline0: i6pc-------r--- UDP [OR] 3024:e5ee:ac2f:cd76:5dd6:a7a1:f17f:5c27:60506 --> [L] 3991:72d:336e:65ec:c5bf:a5fa:83ad:23de:6881
        : BitTorrent
        : RID 16: Known Protocol on Non-standard Port
        : RID 46: Unidirectional Traffic
        : DP: 4

offline0: i6pc-------r--- UDP [OR] 2a2f:8509:1cb2:466d:ecbf:69d6:109c:608:62229 --> [L] 3991:72d:336e:65ec:c5bf:a5fa:83ad:23de:6881
        : BitTorrent
        : RID 16: Known Protocol on Non-standard Port
        : RID 46: Unidirectional Traffic
        : DP: 6

offline0: i6pc-------r--- UDP [OR] 2118:ec33:112b:7908:2c80:27ff:fef7:d71f:48415 --> [L] 32fb:f967:681e:e96b:face:b00c:0:74fd:3478
        : WhatsApp/Call.netify.whatsapp
        : RID 46: Unidirectional Traffic
        : DP: 7

offline0: i6pcu------r--- TCP [OR] 2001:db8:1::1:44144 --> [L] 2001:db8:200::1:443
        : HTTP/S.netify.cloudflare
        : V: 0x0303 CS: 0xc02b
        : TLS/CN: sni.cloudflaressl.com
        : TLS/IDN: C=US, O=Cloudflare, Inc., CN=Cloudflare Inc ECC CA-3 TLS/SDN: C=US, ST=California, L=San Francisco, O=Cloudflare, Inc., CN=sni.cloudflaressl.com
        : RID 30: TLS Certificate Expired
        : RID 46: Unidirectional Traffic
        : DP: 3

offline0: i6pcu------r--- TCP [OR] 2001:db8:1::1:44150 --> [L] 2001:db8:200::1:443
        : HTTP/S.netify.cloudflare
        : V: 0x0303 CS: 0xc02b
        : TLS/CN: sni.cloudflaressl.com
        : TLS/IDN: C=US, O=Cloudflare, Inc., CN=Cloudflare Inc ECC CA-3 TLS/SDN: C=US, ST=California, L=San Francisco, O=Cloudflare, Inc., CN=sni.cloudflaressl.com
        : RID 30: TLS Certificate Expired
        : RID 46: Unidirectional Traffic
        : DP: 3

offline0: i6pcu------r--- TCP [OR] 2001:db8:1::1:44192 --> [L] 2001:db8:200::1:443
        : HTTP/S.netify.cloudflare
        : V: 0x0303 CS: 0xc02b
        : TLS/CN: sni.cloudflaressl.com
        : TLS/IDN: C=US, O=Cloudflare, Inc., CN=Cloudflare Inc ECC CA-3 TLS/SDN: C=US, ST=California, L=San Francisco, O=Cloudflare, Inc., CN=sni.cloudflaressl.com
        : RID 30: TLS Certificate Expired
        : RID 46: Unidirectional Traffic
        : DP: 3

offline0: i6pc-------r--- UDP [OR] 3069:c624:1d42:9469:98b1:67ff:fe43:325:56131 --> [L] 32fb:f967:681e:e96b:face:b00c:0:74fd:3478
        : WhatsApp/Call.netify.whatsapp
        : RID 46: Unidirectional Traffic
        : DP: 7

offline0: i6pc--x----r--- UDP [OR] 38b2:46b7:27a4:94c3:c134:948:e069:d71f:1 <-- [L] 3991:72d:336e:65ec:c5bf:a5fa:83ad:23de:6881
        : BitTorrent
        : RID 16: Known Protocol on Non-standard Port
        : RID 46: Unidirectional Traffic
        : DP: 2

offline0: i6pc--x----r--- UDP [OR] 3297:a1af:5121:cfc:360b:2e07:872f:1ea0:43865 --> [L] 32fb:f967:681e:e96b:face:b00c:0:74fd:3478
        : WhatsApp/Call.netify.whatsapp
        : RID 46: Unidirectional Traffic
        : DP: 2

offline0: i6pc-gx----r--- UDP [OR] 2c7f:d7a0:44a9:49e9:e586:fb7f:5b85:9c83:1 <-- [L] 3991:72d:336e:65ec:c5bf:a5fa:83ad:23de:6881
        : Unknown
        : RID 28: Suspicious Entropy
        : RID 46: Unidirectional Traffic
        : DP: 1

offline0: i6pc--x----r--- UDP [OR] 2fda:1f8a:c107:88a4:e509:d2e1:445f:f34c:6881 <-- [L] 3991:72d:336e:65ec:c5bf:a5fa:83ad:23de:6881
        : BitTorrent
        : RID 16: Known Protocol on Non-standard Port
        : RID 46: Unidirectional Traffic
        : DP: 2

