<svg xmlns="http://www.w3.org/2000/svg" width="19.5" height="19.5" viewBox="0 0 19.5 19.5">
    <defs>
        <style>
            .cls-1{fill:#468797}
        </style>
    </defs>
    <g id="Buscar" transform="translate(-12 -964.362)">
        <path id="Trazado_7754" d="M19.7 964.362a7.7 7.7 0 1 0 3.792 14.391L28 983.266a2.052 2.052 0 1 0 2.9-2.9l-4.51-4.516a7.692 7.692 0 0 0-6.69-11.488zm0 1.539a6.157 6.157 0 1 1-6.157 6.157A6.145 6.145 0 0 1 19.7 965.9zm5.788 11.216l4.329 4.329a.516.516 0 0 1-.73.729l-4.329-4.329a7.73 7.73 0 0 0 .727-.729z" class="cls-1" data-name="Trazado 7754"/>
    </g>
</svg>
