{
  "type": "service_account",
  "project_id": "curious-truth-161716",
  "private_key_id": "777e8df0e31dd7063d2e1dd76184e32defda4ec3",
  "private_key": "-----BEGIN PRIVATE KEY-----\nMIIEvgIBADANBgkqhkiG9w0BAQEFAASCBKgwggSkAgEAAoIBAQC0w1Ipv+Z5TmId\nV5GPW4256Y25VbB37RvgwxKHJ7cpqkOvjAxLtqAACJDZms8OVfWmAuWQA4dkxhHn\nOsVcDaNH8sL4Dk1CGs+RbbCvJh8e/yBKfzmEJLhT25mGWsqprNLuqo2XNOx0qMcK\nXwooW59TsMsJK4XqF3s0+DM2x+OkCObo7aYXHnO8eA8wAWGZv0pEh0/RBQmXZCQJ\nI4H0sNY4RYmuNPo9TVEK2iZqDx0IszwU4VQmm5qLxU93np7wjn3lvnfsN0t7WX2j\nUjy0MD7WfWyzXTi0SaNANeYZNafGgezSMYrxShyvIVnvoChf1thss2LHCsgtkMgc\nDpTvrzqfAgMBAAECggEAHRbTmZFeswXIp0Uo0QOgPptVqc4e3GXFVzm9OQ/Mm4Fh\nbBYjAmosvGSkfsg5auqtYd5UeAUBXFe9mNLt4L73GER6WLXge/NZlOMsjDsbxf6z\ngRmRNXE9Uo1j2umwdHax6SN8LqmfJbTldwdNWKpJ7Qtl2R9uaPoHY0JP55BqU0Kv\nTu3lNEILp3xDbeY8c7UnbQl0KN7ENVPt4NV4vZcECunJTAgyP7PVRb7HLZ538gpc\nA0BcNAPCay2Fs89qAQlUCOdgbl8+0NHBejVuZ2FbAzqC0/nBFf7se07DZAR1Fg49\n0pcteCzSs7XXbvb3iGgt13g/8LHn5NdZ8cs5YxB7IQKBgQD9caG8KrkqVxTwVwbR\nX25mAHvoGp9TkSMP2ybqX4SviVoomOSsTp+OdZpedE+3iRhsKbnGNTyrNiaTgHn9\nPLkWa6q4BXczctzw4xxacqPtMQ/LtdWIdVuM3yxVZvxKBNArBv8NSFaWsU21F15j\nk32W8TEhUN7o3lLkFOBMc9tTYQKBgQC2lgivaJWwqq2CMeNvNIMV/1qFCgJPMAmi\nHL55e2ybJieiCx521efb9YEaUoFNrIDTfwgPjdOIuE4jG31hQfVxhTuiiV24nNT+\nvWWggPsCLEErsG9/m540OtMzMz2+vatNoAPGb3PV+98lY7jzk4T0QLp5p++J2U2g\nCNoAVgNN/wKBgHi9x+WTHP/U2L7fVvosUrX5iQ48kKcJQADv0QxbUSUndHJe1KJa\nGp2N3WseUlQH1kDBaCXLewm+FIa08Gj6otrRlFVzFSTHlgaUzA8zCnGXrATKrd4C\nuwjT0ZUmKQ9CV8IH5T54tfe4pGKfrXIW9AATC+rpUijysd7DK1CA6X5BAoGBAJHE\n4pY35xouiWuiLLOBtw3+2ePRA9r4vRgh3qfaM/EB2y5xthal3AAt1q6PJBBBInC3\nwFW6oyFKE4fP0J+vKydAeUXgaWSUQTBHQTWNA9jOQBGDQOEd+oY0WJ1N0YPQpUzJ\n7XmlTVOPTK3rGaPNKJ5gdv/dZU4moOSdbH5MLUM9AoGBAM2jPFupodGGbTXOG3j7\nTRU9K8IzJQxl9WEAmbKw5IaQvdm8OfbZxtArls7IgebWbZ3/IhdBHEatz8/9AShC\nO1C7lIWas+FTmGYik1xXnzBLz7pWYk9j2um6EUC4syRYrKH8+UWQlYgN7PKwgq05\nulDIeeXOpWTBFNgRFuN1I2vG\n-----END PRIVATE KEY-----\n",
  "client_email": "987905943046-compute@developer.gserviceaccount.com",
  "client_id": "101183957922215650289",
  "auth_uri": "https://accounts.google.com/o/oauth2/auth",
  "token_uri": "https://oauth2.googleapis.com/token",
  "auth_provider_x509_cert_url": "https://www.googleapis.com/oauth2/v1/certs",
  "client_x509_cert_url": "https://www.googleapis.com/robot/v1/metadata/x509/987905943046-compute%40developer.gserviceaccount.com"
}
