-- Merging decision tree log ---
manifest
ADDED from /Users/usuario/Documents/telemetryApp/android/app/src/main/AndroidManifest.xml:1:1-26:12
INJECTED from /Users/usuario/Documents/telemetryApp/android/app/src/main/AndroidManifest.xml:1:1-26:12
INJECTED from /Users/usuario/Documents/telemetryApp/android/app/src/main/AndroidManifest.xml:1:1-26:12
INJECTED from /Users/usuario/Documents/telemetryApp/android/app/src/main/AndroidManifest.xml:1:1-26:12
MERGED from [com.facebook.react:react-native:0.57.8] /Users/usuario/.gradle/caches/transforms-1/files-1.1/react-native-0.57.8.aar/1fb1877c383b5cfc2af51de37ccb0b16/AndroidManifest.xml:2:1-15:12
MERGED from [com.android.support:appcompat-v7:27.1.1] /Users/usuario/.gradle/caches/transforms-1/files-1.1/appcompat-v7-27.1.1.aar/939aa956386fd38404ce9c1d1a404368/AndroidManifest.xml:17:1-22:12
MERGED from [com.android.support:support-fragment:27.1.1] /Users/usuario/.gradle/caches/transforms-1/files-1.1/support-fragment-27.1.1.aar/e7f8c1ceb275d0cc266dc3d19e3c97b2/AndroidManifest.xml:17:1-22:12
MERGED from [com.android.support:animated-vector-drawable:27.1.1] /Users/usuario/.gradle/caches/transforms-1/files-1.1/animated-vector-drawable-27.1.1.aar/2ec137a99c4db12f296b70c126c42024/AndroidManifest.xml:17:1-22:12
MERGED from [com.android.support:support-core-ui:27.1.1] /Users/usuario/.gradle/caches/transforms-1/files-1.1/support-core-ui-27.1.1.aar/13d5ba8c7b14d708ef9f9aaa2f940a6e/AndroidManifest.xml:17:1-22:12
MERGED from [com.android.support:support-core-utils:27.1.1] /Users/usuario/.gradle/caches/transforms-1/files-1.1/support-core-utils-27.1.1.aar/72bb17962a96ba5f2cb48288e9121546/AndroidManifest.xml:17:1-22:12
MERGED from [com.android.support:support-vector-drawable:27.1.1] /Users/usuario/.gradle/caches/transforms-1/files-1.1/support-vector-drawable-27.1.1.aar/3cbbc5158af07667d6ffa6f7a3c6f109/AndroidManifest.xml:17:1-22:12
MERGED from [com.android.support:support-compat:27.1.1] /Users/usuario/.gradle/caches/transforms-1/files-1.1/support-compat-27.1.1.aar/c5abbe45e76a23958b54d7ddb324bec5/AndroidManifest.xml:17:1-22:12
MERGED from [com.facebook.fresco:fresco:1.10.0] /Users/usuario/.gradle/caches/transforms-1/files-1.1/fresco-1.10.0.aar/3d2833093f5855101ac85f0d8dfb2526/AndroidManifest.xml:2:1-9:12
MERGED from [com.facebook.fresco:imagepipeline-okhttp3:1.10.0] /Users/usuario/.gradle/caches/transforms-1/files-1.1/imagepipeline-okhttp3-1.10.0.aar/be88d0dd76f8723608d3b3a87175ec4d/AndroidManifest.xml:2:1-9:12
MERGED from [com.facebook.fresco:drawee:1.10.0] /Users/usuario/.gradle/caches/transforms-1/files-1.1/drawee-1.10.0.aar/32e902ad544b68b5b28a032fd71ff876/AndroidManifest.xml:2:1-9:12
MERGED from [com.facebook.fresco:imagepipeline:1.10.0] /Users/usuario/.gradle/caches/transforms-1/files-1.1/imagepipeline-1.10.0.aar/54cef547d38880279df60e3d9b5f981e/AndroidManifest.xml:2:1-9:12
MERGED from [com.facebook.fresco:imagepipeline-base:1.10.0] /Users/usuario/.gradle/caches/transforms-1/files-1.1/imagepipeline-base-1.10.0.aar/fadf55e4f071cdd9b3b7724f929b64a6/AndroidManifest.xml:2:1-9:12
MERGED from [com.facebook.soloader:soloader:0.5.1] /Users/usuario/.gradle/caches/transforms-1/files-1.1/soloader-0.5.1.aar/eebfe4b1ace5c3b07924d9ae04ede8e4/AndroidManifest.xml:2:1-13:12
MERGED from [org.webkit:android-jsc:r174650] /Users/usuario/.gradle/caches/transforms-1/files-1.1/android-jsc-r174650.aar/18dfc61ca0d7937633d48495a1b638e8/AndroidManifest.xml:1:1-3:12
MERGED from [android.arch.lifecycle:livedata-core:1.1.0] /Users/usuario/.gradle/caches/transforms-1/files-1.1/livedata-core-1.1.0.aar/9ed990e2233e3a176d9ab329ca5a93aa/AndroidManifest.xml:17:1-22:12
MERGED from [android.arch.lifecycle:viewmodel:1.1.0] /Users/usuario/.gradle/caches/transforms-1/files-1.1/viewmodel-1.1.0.aar/8ff2fd4f885ecebf773a7856364de1f3/AndroidManifest.xml:17:1-22:12
MERGED from [com.facebook.fresco:fbcore:1.10.0] /Users/usuario/.gradle/caches/transforms-1/files-1.1/fbcore-1.10.0.aar/1ee3202c24b0ad505ba72eba7e72243d/AndroidManifest.xml:2:1-9:12
MERGED from [android.arch.lifecycle:runtime:1.1.0] /Users/usuario/.gradle/caches/transforms-1/files-1.1/runtime-1.1.0.aar/1841cdf3a2adace335ad8d16217f9f6c/AndroidManifest.xml:17:1-22:12
MERGED from [android.arch.core:runtime:1.1.0] /Users/usuario/.gradle/caches/transforms-1/files-1.1/runtime-1.1.0.aar/a5b6b4a0ec0ecee53bfb74d7305f3087/AndroidManifest.xml:17:1-22:12
INJECTED from /Users/usuario/Documents/telemetryApp/android/app/src/main/AndroidManifest.xml:1:1-26:12
INJECTED from /Users/usuario/Documents/telemetryApp/android/app/src/main/AndroidManifest.xml:1:1-26:12
INJECTED from /Users/usuario/Documents/telemetryApp/android/app/src/main/AndroidManifest.xml:1:1-26:12
	package
		ADDED from /Users/usuario/Documents/telemetryApp/android/app/src/main/AndroidManifest.xml:2:5-31
		INJECTED from /Users/usuario/Documents/telemetryApp/android/app/src/main/AndroidManifest.xml
		INJECTED from /Users/usuario/Documents/telemetryApp/android/app/src/main/AndroidManifest.xml
	android:versionName
		INJECTED from /Users/usuario/Documents/telemetryApp/android/app/src/main/AndroidManifest.xml
		ADDED from /Users/usuario/Documents/telemetryApp/android/app/src/main/AndroidManifest.xml:1:1-26:12
		INJECTED from /Users/usuario/Documents/telemetryApp/android/app/src/main/AndroidManifest.xml
	android:versionCode
		INJECTED from /Users/usuario/Documents/telemetryApp/android/app/src/main/AndroidManifest.xml
		ADDED from /Users/usuario/Documents/telemetryApp/android/app/src/main/AndroidManifest.xml:1:1-26:12
		INJECTED from /Users/usuario/Documents/telemetryApp/android/app/src/main/AndroidManifest.xml
	xmlns:android
		ADDED from /Users/usuario/Documents/telemetryApp/android/app/src/main/AndroidManifest.xml:1:11-69
uses-permission#android.permission.INTERNET
ADDED from /Users/usuario/Documents/telemetryApp/android/app/src/main/AndroidManifest.xml:4:5-67
	android:name
		ADDED from /Users/usuario/Documents/telemetryApp/android/app/src/main/AndroidManifest.xml:4:22-64
uses-permission#android.permission.SYSTEM_ALERT_WINDOW
ADDED from /Users/usuario/Documents/telemetryApp/android/app/src/main/AndroidManifest.xml:5:5-77
MERGED from [com.facebook.react:react-native:0.57.8] /Users/usuario/.gradle/caches/transforms-1/files-1.1/react-native-0.57.8.aar/1fb1877c383b5cfc2af51de37ccb0b16/AndroidManifest.xml:11:5-78
MERGED from [com.facebook.react:react-native:0.57.8] /Users/usuario/.gradle/caches/transforms-1/files-1.1/react-native-0.57.8.aar/1fb1877c383b5cfc2af51de37ccb0b16/AndroidManifest.xml:11:5-78
	android:name
		ADDED from /Users/usuario/Documents/telemetryApp/android/app/src/main/AndroidManifest.xml:5:22-75
application
ADDED from /Users/usuario/Documents/telemetryApp/android/app/src/main/AndroidManifest.xml:7:5-24:19
MERGED from [com.facebook.react:react-native:0.57.8] /Users/usuario/.gradle/caches/transforms-1/files-1.1/react-native-0.57.8.aar/1fb1877c383b5cfc2af51de37ccb0b16/AndroidManifest.xml:13:5-20
MERGED from [com.facebook.react:react-native:0.57.8] /Users/usuario/.gradle/caches/transforms-1/files-1.1/react-native-0.57.8.aar/1fb1877c383b5cfc2af51de37ccb0b16/AndroidManifest.xml:13:5-20
MERGED from [com.facebook.soloader:soloader:0.5.1] /Users/usuario/.gradle/caches/transforms-1/files-1.1/soloader-0.5.1.aar/eebfe4b1ace5c3b07924d9ae04ede8e4/AndroidManifest.xml:11:5-20
MERGED from [com.facebook.soloader:soloader:0.5.1] /Users/usuario/.gradle/caches/transforms-1/files-1.1/soloader-0.5.1.aar/eebfe4b1ace5c3b07924d9ae04ede8e4/AndroidManifest.xml:11:5-20
MERGED from [org.webkit:android-jsc:r174650] /Users/usuario/.gradle/caches/transforms-1/files-1.1/android-jsc-r174650.aar/18dfc61ca0d7937633d48495a1b638e8/AndroidManifest.xml:2:3-17
MERGED from [org.webkit:android-jsc:r174650] /Users/usuario/.gradle/caches/transforms-1/files-1.1/android-jsc-r174650.aar/18dfc61ca0d7937633d48495a1b638e8/AndroidManifest.xml:2:3-17
	android:label
		ADDED from /Users/usuario/Documents/telemetryApp/android/app/src/main/AndroidManifest.xml:9:7-39
	android:icon
		ADDED from /Users/usuario/Documents/telemetryApp/android/app/src/main/AndroidManifest.xml:10:7-41
	android:allowBackup
		ADDED from /Users/usuario/Documents/telemetryApp/android/app/src/main/AndroidManifest.xml:11:7-34
	android:theme
		ADDED from /Users/usuario/Documents/telemetryApp/android/app/src/main/AndroidManifest.xml:12:7-38
	android:name
		ADDED from /Users/usuario/Documents/telemetryApp/android/app/src/main/AndroidManifest.xml:8:7-38
activity#com.telemetryapp.MainActivity
ADDED from /Users/usuario/Documents/telemetryApp/android/app/src/main/AndroidManifest.xml:13:7-22:18
	android:label
		ADDED from /Users/usuario/Documents/telemetryApp/android/app/src/main/AndroidManifest.xml:15:9-41
	android:windowSoftInputMode
		ADDED from /Users/usuario/Documents/telemetryApp/android/app/src/main/AndroidManifest.xml:17:9-51
	android:configChanges
		ADDED from /Users/usuario/Documents/telemetryApp/android/app/src/main/AndroidManifest.xml:16:9-79
	android:name
		ADDED from /Users/usuario/Documents/telemetryApp/android/app/src/main/AndroidManifest.xml:14:9-37
intent-filter#action:name:android.intent.action.MAIN+category:name:android.intent.category.LAUNCHER
ADDED from /Users/usuario/Documents/telemetryApp/android/app/src/main/AndroidManifest.xml:18:9-21:25
action#android.intent.action.MAIN
ADDED from /Users/usuario/Documents/telemetryApp/android/app/src/main/AndroidManifest.xml:19:13-65
	android:name
		ADDED from /Users/usuario/Documents/telemetryApp/android/app/src/main/AndroidManifest.xml:19:21-62
category#android.intent.category.LAUNCHER
ADDED from /Users/usuario/Documents/telemetryApp/android/app/src/main/AndroidManifest.xml:20:13-73
	android:name
		ADDED from /Users/usuario/Documents/telemetryApp/android/app/src/main/AndroidManifest.xml:20:23-70
activity#com.facebook.react.devsupport.DevSettingsActivity
ADDED from /Users/usuario/Documents/telemetryApp/android/app/src/main/AndroidManifest.xml:23:7-84
	android:name
		ADDED from /Users/usuario/Documents/telemetryApp/android/app/src/main/AndroidManifest.xml:23:17-81
uses-sdk
INJECTED from /Users/usuario/Documents/telemetryApp/android/app/src/main/AndroidManifest.xml reason: use-sdk injection requested
INJECTED from /Users/usuario/Documents/telemetryApp/android/app/src/main/AndroidManifest.xml
INJECTED from /Users/usuario/Documents/telemetryApp/android/app/src/main/AndroidManifest.xml
MERGED from [com.facebook.react:react-native:0.57.8] /Users/usuario/.gradle/caches/transforms-1/files-1.1/react-native-0.57.8.aar/1fb1877c383b5cfc2af51de37ccb0b16/AndroidManifest.xml:7:5-9:41
MERGED from [com.facebook.react:react-native:0.57.8] /Users/usuario/.gradle/caches/transforms-1/files-1.1/react-native-0.57.8.aar/1fb1877c383b5cfc2af51de37ccb0b16/AndroidManifest.xml:7:5-9:41
MERGED from [com.android.support:appcompat-v7:27.1.1] /Users/usuario/.gradle/caches/transforms-1/files-1.1/appcompat-v7-27.1.1.aar/939aa956386fd38404ce9c1d1a404368/AndroidManifest.xml:20:5-44
MERGED from [com.android.support:appcompat-v7:27.1.1] /Users/usuario/.gradle/caches/transforms-1/files-1.1/appcompat-v7-27.1.1.aar/939aa956386fd38404ce9c1d1a404368/AndroidManifest.xml:20:5-44
MERGED from [com.android.support:support-fragment:27.1.1] /Users/usuario/.gradle/caches/transforms-1/files-1.1/support-fragment-27.1.1.aar/e7f8c1ceb275d0cc266dc3d19e3c97b2/AndroidManifest.xml:20:5-44
MERGED from [com.android.support:support-fragment:27.1.1] /Users/usuario/.gradle/caches/transforms-1/files-1.1/support-fragment-27.1.1.aar/e7f8c1ceb275d0cc266dc3d19e3c97b2/AndroidManifest.xml:20:5-44
MERGED from [com.android.support:animated-vector-drawable:27.1.1] /Users/usuario/.gradle/caches/transforms-1/files-1.1/animated-vector-drawable-27.1.1.aar/2ec137a99c4db12f296b70c126c42024/AndroidManifest.xml:20:5-44
MERGED from [com.android.support:animated-vector-drawable:27.1.1] /Users/usuario/.gradle/caches/transforms-1/files-1.1/animated-vector-drawable-27.1.1.aar/2ec137a99c4db12f296b70c126c42024/AndroidManifest.xml:20:5-44
MERGED from [com.android.support:support-core-ui:27.1.1] /Users/usuario/.gradle/caches/transforms-1/files-1.1/support-core-ui-27.1.1.aar/13d5ba8c7b14d708ef9f9aaa2f940a6e/AndroidManifest.xml:20:5-44
MERGED from [com.android.support:support-core-ui:27.1.1] /Users/usuario/.gradle/caches/transforms-1/files-1.1/support-core-ui-27.1.1.aar/13d5ba8c7b14d708ef9f9aaa2f940a6e/AndroidManifest.xml:20:5-44
MERGED from [com.android.support:support-core-utils:27.1.1] /Users/usuario/.gradle/caches/transforms-1/files-1.1/support-core-utils-27.1.1.aar/72bb17962a96ba5f2cb48288e9121546/AndroidManifest.xml:20:5-44
MERGED from [com.android.support:support-core-utils:27.1.1] /Users/usuario/.gradle/caches/transforms-1/files-1.1/support-core-utils-27.1.1.aar/72bb17962a96ba5f2cb48288e9121546/AndroidManifest.xml:20:5-44
MERGED from [com.android.support:support-vector-drawable:27.1.1] /Users/usuario/.gradle/caches/transforms-1/files-1.1/support-vector-drawable-27.1.1.aar/3cbbc5158af07667d6ffa6f7a3c6f109/AndroidManifest.xml:20:5-44
MERGED from [com.android.support:support-vector-drawable:27.1.1] /Users/usuario/.gradle/caches/transforms-1/files-1.1/support-vector-drawable-27.1.1.aar/3cbbc5158af07667d6ffa6f7a3c6f109/AndroidManifest.xml:20:5-44
MERGED from [com.android.support:support-compat:27.1.1] /Users/usuario/.gradle/caches/transforms-1/files-1.1/support-compat-27.1.1.aar/c5abbe45e76a23958b54d7ddb324bec5/AndroidManifest.xml:20:5-44
MERGED from [com.android.support:support-compat:27.1.1] /Users/usuario/.gradle/caches/transforms-1/files-1.1/support-compat-27.1.1.aar/c5abbe45e76a23958b54d7ddb324bec5/AndroidManifest.xml:20:5-44
MERGED from [com.facebook.fresco:fresco:1.10.0] /Users/usuario/.gradle/caches/transforms-1/files-1.1/fresco-1.10.0.aar/3d2833093f5855101ac85f0d8dfb2526/AndroidManifest.xml:5:5-7:41
MERGED from [com.facebook.fresco:fresco:1.10.0] /Users/usuario/.gradle/caches/transforms-1/files-1.1/fresco-1.10.0.aar/3d2833093f5855101ac85f0d8dfb2526/AndroidManifest.xml:5:5-7:41
MERGED from [com.facebook.fresco:imagepipeline-okhttp3:1.10.0] /Users/usuario/.gradle/caches/transforms-1/files-1.1/imagepipeline-okhttp3-1.10.0.aar/be88d0dd76f8723608d3b3a87175ec4d/AndroidManifest.xml:5:5-7:41
MERGED from [com.facebook.fresco:imagepipeline-okhttp3:1.10.0] /Users/usuario/.gradle/caches/transforms-1/files-1.1/imagepipeline-okhttp3-1.10.0.aar/be88d0dd76f8723608d3b3a87175ec4d/AndroidManifest.xml:5:5-7:41
MERGED from [com.facebook.fresco:drawee:1.10.0] /Users/usuario/.gradle/caches/transforms-1/files-1.1/drawee-1.10.0.aar/32e902ad544b68b5b28a032fd71ff876/AndroidManifest.xml:5:5-7:41
MERGED from [com.facebook.fresco:drawee:1.10.0] /Users/usuario/.gradle/caches/transforms-1/files-1.1/drawee-1.10.0.aar/32e902ad544b68b5b28a032fd71ff876/AndroidManifest.xml:5:5-7:41
MERGED from [com.facebook.fresco:imagepipeline:1.10.0] /Users/usuario/.gradle/caches/transforms-1/files-1.1/imagepipeline-1.10.0.aar/54cef547d38880279df60e3d9b5f981e/AndroidManifest.xml:5:5-7:41
MERGED from [com.facebook.fresco:imagepipeline:1.10.0] /Users/usuario/.gradle/caches/transforms-1/files-1.1/imagepipeline-1.10.0.aar/54cef547d38880279df60e3d9b5f981e/AndroidManifest.xml:5:5-7:41
MERGED from [com.facebook.fresco:imagepipeline-base:1.10.0] /Users/usuario/.gradle/caches/transforms-1/files-1.1/imagepipeline-base-1.10.0.aar/fadf55e4f071cdd9b3b7724f929b64a6/AndroidManifest.xml:5:5-7:41
MERGED from [com.facebook.fresco:imagepipeline-base:1.10.0] /Users/usuario/.gradle/caches/transforms-1/files-1.1/imagepipeline-base-1.10.0.aar/fadf55e4f071cdd9b3b7724f929b64a6/AndroidManifest.xml:5:5-7:41
MERGED from [com.facebook.soloader:soloader:0.5.1] /Users/usuario/.gradle/caches/transforms-1/files-1.1/soloader-0.5.1.aar/eebfe4b1ace5c3b07924d9ae04ede8e4/AndroidManifest.xml:7:5-9:41
MERGED from [com.facebook.soloader:soloader:0.5.1] /Users/usuario/.gradle/caches/transforms-1/files-1.1/soloader-0.5.1.aar/eebfe4b1ace5c3b07924d9ae04ede8e4/AndroidManifest.xml:7:5-9:41
MERGED from [android.arch.lifecycle:livedata-core:1.1.0] /Users/usuario/.gradle/caches/transforms-1/files-1.1/livedata-core-1.1.0.aar/9ed990e2233e3a176d9ab329ca5a93aa/AndroidManifest.xml:20:5-44
MERGED from [android.arch.lifecycle:livedata-core:1.1.0] /Users/usuario/.gradle/caches/transforms-1/files-1.1/livedata-core-1.1.0.aar/9ed990e2233e3a176d9ab329ca5a93aa/AndroidManifest.xml:20:5-44
MERGED from [android.arch.lifecycle:viewmodel:1.1.0] /Users/usuario/.gradle/caches/transforms-1/files-1.1/viewmodel-1.1.0.aar/8ff2fd4f885ecebf773a7856364de1f3/AndroidManifest.xml:20:5-44
MERGED from [android.arch.lifecycle:viewmodel:1.1.0] /Users/usuario/.gradle/caches/transforms-1/files-1.1/viewmodel-1.1.0.aar/8ff2fd4f885ecebf773a7856364de1f3/AndroidManifest.xml:20:5-44
MERGED from [com.facebook.fresco:fbcore:1.10.0] /Users/usuario/.gradle/caches/transforms-1/files-1.1/fbcore-1.10.0.aar/1ee3202c24b0ad505ba72eba7e72243d/AndroidManifest.xml:5:5-7:41
MERGED from [com.facebook.fresco:fbcore:1.10.0] /Users/usuario/.gradle/caches/transforms-1/files-1.1/fbcore-1.10.0.aar/1ee3202c24b0ad505ba72eba7e72243d/AndroidManifest.xml:5:5-7:41
MERGED from [android.arch.lifecycle:runtime:1.1.0] /Users/usuario/.gradle/caches/transforms-1/files-1.1/runtime-1.1.0.aar/1841cdf3a2adace335ad8d16217f9f6c/AndroidManifest.xml:20:5-44
MERGED from [android.arch.lifecycle:runtime:1.1.0] /Users/usuario/.gradle/caches/transforms-1/files-1.1/runtime-1.1.0.aar/1841cdf3a2adace335ad8d16217f9f6c/AndroidManifest.xml:20:5-44
MERGED from [android.arch.core:runtime:1.1.0] /Users/usuario/.gradle/caches/transforms-1/files-1.1/runtime-1.1.0.aar/a5b6b4a0ec0ecee53bfb74d7305f3087/AndroidManifest.xml:20:5-44
MERGED from [android.arch.core:runtime:1.1.0] /Users/usuario/.gradle/caches/transforms-1/files-1.1/runtime-1.1.0.aar/a5b6b4a0ec0ecee53bfb74d7305f3087/AndroidManifest.xml:20:5-44
INJECTED from /Users/usuario/Documents/telemetryApp/android/app/src/main/AndroidManifest.xml
INJECTED from /Users/usuario/Documents/telemetryApp/android/app/src/main/AndroidManifest.xml
	android:targetSdkVersion
		INJECTED from /Users/usuario/Documents/telemetryApp/android/app/src/main/AndroidManifest.xml
		ADDED from /Users/usuario/Documents/telemetryApp/android/app/src/main/AndroidManifest.xml
		INJECTED from /Users/usuario/Documents/telemetryApp/android/app/src/main/AndroidManifest.xml
	android:minSdkVersion
		INJECTED from /Users/usuario/Documents/telemetryApp/android/app/src/main/AndroidManifest.xml
		ADDED from /Users/usuario/Documents/telemetryApp/android/app/src/main/AndroidManifest.xml
		INJECTED from /Users/usuario/Documents/telemetryApp/android/app/src/main/AndroidManifest.xml
uses-permission#android.permission.WRITE_EXTERNAL_STORAGE
IMPLIED from /Users/usuario/Documents/telemetryApp/android/app/src/main/AndroidManifest.xml:1:1-26:12 reason: org.webkit.android_jsc has a targetSdkVersion < 4
uses-permission#android.permission.READ_PHONE_STATE
IMPLIED from /Users/usuario/Documents/telemetryApp/android/app/src/main/AndroidManifest.xml:1:1-26:12 reason: org.webkit.android_jsc has a targetSdkVersion < 4
uses-permission#android.permission.READ_EXTERNAL_STORAGE
IMPLIED from /Users/usuario/Documents/telemetryApp/android/app/src/main/AndroidManifest.xml:1:1-26:12 reason: org.webkit.android_jsc requested WRITE_EXTERNAL_STORAGE
