{
  "extends": [
    "config:base",
    ":disableDependencyDashboard"
  ],
  "regexManagers": [
    {
      "fileMatch": ["Dockerfile$"],
      "matchStrings":[
        "ENV RELEASE_VERSION (?<currentValue>.*)\\n"
      ],
      "datasourceTemplate": "github-releases",
      "depNameTemplate": "the-djmaze/snappymail"
    }
  ]

}
