{
  "$schema": "https://docs.renovatebot.com/renovate-schema.json",
  "extends": [
    "config:base",
    ":disableDependencyDashboard"
  ],
  "regexManagers": [
		{
			"fileMatch": [
				".gitlab-ci.yml$"
			],
			"matchStrings": [
				"CONTAINERD_VERSION: (?<currentValue>.*)\\n"
			],
			"datasourceTemplate": "github-releases",
			"depNameTemplate": "containerd/containerd",
			"extractVersionTemplate": "^v(?<version>.*)$"
		},
    {
			"fileMatch": [
				".gitlab-ci.yml$"
			],
			"matchStrings": [
				"RUNC_VERSION: (?<currentValue>.*)\\n"
			],
			"datasourceTemplate": "github-releases",
			"depNameTemplate": "opencontainers/runc",
			"extractVersionTemplate": "^v(?<version>.*)$"
		},
    {
			"fileMatch": [
				".gitlab-ci.yml$"
			],
			"matchStrings": [
				"CRI_TOOLS_VERSION: (?<currentValue>.*)\\n"
			],
			"datasourceTemplate": "github-releases",
			"depNameTemplate": "kubernetes-sigs/cri-tools",
			"extractVersionTemplate": "^v(?<version>.*)$"
		}
  ]
}
